{"text_format":"1","workbook":"xlsx","n_sheets":8,"sheets":["説明","取扱説明","登録touroku","運営カードcard","進行表shinko","成績表seiseki","(空欄)成績表seiseki","Sheet1"],"not_rendered":{"charts":0,"images":0,"macros":0,"external_links":0,"defined_names":7,"comments":0,"pivot_tables":0},"unopened":[],"bounds":{"document_bytes":16777216,"sheet_cells":100000,"rows_first":2000,"rows_last":500,"rows_between":2000,"halvings":0,"cell_chars":16384,"cell_head_chars":4096},"cells_cut":0,"cells_raw":0,"read":"whole","date_system":"1900"}

{"sheet":"説明","index":0,"n_rows":23,"n_cols":6,"rows_kept":23,"cut":false,"hidden":false,"merged":[]}
[]
["①　total表のシートの下のほうにある所にチーム名・選手名を記入する"]
["②　運営表はプリントアウトして一定の大きさに切って使ってください。"]
["③　試合開始後は、進行表のシートに結果を入力すれば計算等はすべてしてくれます。"]
["　　　※）　ただしｗの半角全角を間違えないようにして記入してください。"]
["④　HR・MVP等は最終total表に直接記入してください。"]
[]
[]
["２県対抗戦の運営システム"]
[]
["２チーム７名　１８０点"]
[]
["出場費　","３，５００×７名=24,500 ×２チーム",null,null,49000]
["関ポケ補助",9200,null,null,9200]
[null,null,null,null,null,58200]
["団体優勝","３，０００×７名",null,null,21000]
["MVP",null,null,null,2000]
["VP",null,null,null,1000]
["HR",null,null,null,1000]
["会場費",null,null,null,20000]
["昼食費","８００×１４名",null,null,11200]
["運営費",null,null,null,2000]
[null,null,null,null,null,58200]

{"sheet":"取扱説明","index":1,"n_rows":22,"n_cols":3,"rows_kept":22,"cut":false,"hidden":false,"merged":[]}
[]
[null,"【取扱説明】"]
[]
[]
[null,"◆","登録"]
[null,null,"まずはじめに、登録シートの表内の白抜きの欄を入力してください。"]
[null,null,"　（対抗戦名、開催日、会場、勝ちゲーム点、各チーム名と選手名）"]
[]
[null,"◆","運営カード"]
[null,null,"運営カードシートで運営カードを印刷してください。"]
[null,null,"A4サイズ用紙1枚で運営カード8枚が印刷されます。"]
[null,null,"切り取って使用してください。"]
[]
[null,"◆","進行表"]
[null,null,"終了した試合の運営カードから、進行表シートに試合結果を入力して下さい。"]
[null,null,"勝者は半角大文字のW、敗者は得点"]
[null,null,"ただし、HRは、成績表の左下欄に入力してください。"]
[]
[null,"◆","成績表"]
[null,null,"対戦結果等は成績表シートに自動で入力されます。"]
[null,null,"各選手のHRはシート左下の欄に入力してください。"]
[null,null,"また、MVP、VP、HRの各賞対象者を右上の欄に入力してください。"]

{"sheet":"登録touroku","index":2,"n_rows":45,"n_cols":6,"rows_kept":45,"cut":false,"hidden":false,"merged":[[16,2,16,3],[10,1,10,4],[12,2,12,4],[14,2,14,4]]}
[]
[null,"対抗戦名を入力して下さい。"]
[null,"チームAと1～8、チームBと一～八を入力して下さい。"]
[null,"チーム名は、セルを選択後▼が表示されてから、\"Alt+↓\"で"]
[null,"　表示されるリストから、↑↓キーで選択しEnterキーで決定して下さい。"]
[null,"チーム名は直接入力もできますが、今後も使うようであれば、"]
[null,"　下の「チームリスト」のB45以下の列に登録しておくと便利です。"]
[]
[]
[null,null,"対抗戦名"]
[null,"第１７回　京奈　対抗戦"]
[]
[null,"開催日","2021-11-28"]
[]
[null,"会　場","VAMP"]
[]
[null,"勝ゲーム点",180,null,"点（240点以下）"]
[]
[null,null,"選手名","持点","選手名","持点"]
[null,"チーム名","京都",null,"奈良"]
[null,"選手1","今村哲也",180,"金澤茂昌",180]
[null,"選手2","金光隆男",180,"白戸玲人",180]
[null,"選手3","田附裕次",180,"吉向翔平",180]
[null,"選手4","吉田智直",180,"岩本剛",180]
[null,"選手5","小堀泰次郎",180,"長谷川進",180]
[null,"選手6","上倉淑敬",180,"井本高史",180]
[null,"選手7","森田由佳里",140,"宮野早織",140]
[null,"選手8",null,140,null,140]
[]
[]
[]
[]
[]
[]
[]
[null,"チームリスト"]
[null,"大阪"]
[null,"京都"]
[null,"兵庫"]
[null,"滋賀"]
[null,"奈良"]
[null,"和歌山"]
[null,"三重"]
[null,"岐阜"]
[null,"愛知"]

{"sheet":"運営カードcard","index":3,"n_rows":63,"n_cols":32,"rows_kept":63,"cut":false,"hidden":false,"merged":[]}
[]
[null,"１－１","No.",null,null,"１－２","No.",null,null,"１－３","No.",null,null,"１－４","No.",null,null,"１－５","No.",null,null,"１－６","No.",null,null,"１－７","No.",null,null,null,"１－８","No."]
[null,{"$f":"進行表shinko!$D$13","v":"今村哲也"},{"$f":"進行表shinko!$I$13","v":"金澤茂昌"},null,null,{"$f":"進行表shinko!$D$14","v":"金光隆男"},{"$f":"進行表shinko!$I$14","v":"白戸玲人"},null,null,{"$f":"進行表shinko!$D$15","v":"田附裕次"},{"$f":"進行表shinko!$I$15","v":"吉向翔平"},null,null,{"$f":"進行表shinko!$D$16","v":"吉田智直"},{"$f":"進行表shinko!$I$16","v":"岩本剛"},null,null,{"$f":"進行表shinko!$D$17","v":"小堀泰次郎"},{"$f":"進行表shinko!$I$17","v":"長谷川進"},null,null,{"$f":"進行表shinko!$D$18","v":"上倉淑敬"},{"$f":"進行表shinko!$I$18","v":"井本高史"},null,null,{"$f":"進行表shinko!$D$19","v":"森田由佳里"},{"$f":"進行表shinko!$I$19","v":"宮野早織"},null,null,null,{"$f":"進行表shinko!$D$20","v":""},{"$f":"進行表shinko!$I$20","v":""}]
[null,{"$f":"登録touroku!C20","v":"京都"},{"$f":"登録touroku!E20","v":"奈良"},null,null,{"$f":"$B$4","v":"京都"},{"$f":"$C$4","v":"奈良"},null,null,{"$f":"$B$4","v":"京都"},{"$f":"$C$4","v":"奈良"},null,null,{"$f":"$B$4","v":"京都"},{"$f":"$C$4","v":"奈良"},null,null,{"$f":"$B$4","v":"京都"},{"$f":"$C$4","v":"奈良"},null,null,{"$f":"$B$4","v":"京都"},{"$f":"$C$4","v":"奈良"},null,null,{"$f":"$B$4","v":"京都"},{"$f":"$C$4","v":"奈良"},null,null,null,{"$f":"$B$4","v":"京都"},{"$f":"$C$4","v":"奈良"}]
[]
[null,"HR","HR",null,null,"HR","HR",null,null,"HR","HR",null,null,"HR","HR",null,null,"HR","HR",null,null,"HR","HR",null,null,"HR","HR",null,null,null,"HR","HR"]
[null,"レフリー",null,null,null,"レフリー",null,null,null,"レフリー",null,null,null,"レフリー",null,null,null,"レフリー",null,null,null,"レフリー",null,null,null,"レフリー",null,null,null,null,"レフリー"]
[]
[]
[null,"２－１","No.",null,null,"２－２","No.",null,null,"２－３","No.",null,null,"２－４","No.",null,null,"２－５","No.",null,null,"２－６","No.",null,null,"２－７","No.",null,null,null,"２－８","No."]
[null,{"$f":"進行表shinko!$D$21","v":"今村哲也"},{"$f":"進行表shinko!$I$21","v":"白戸玲人"},null,null,{"$f":"進行表shinko!$D$22","v":"金光隆男"},{"$f":"進行表shinko!$I$22","v":"吉向翔平"},null,null,{"$f":"進行表shinko!$D$23","v":"田附裕次"},{"$f":"進行表shinko!$I$23","v":"岩本剛"},null,null,{"$f":"進行表shinko!$D$24","v":"吉田智直"},{"$f":"進行表shinko!$I$24","v":"長谷川進"},null,null,{"$f":"進行表shinko!$D$25","v":"小堀泰次郎"},{"$f":"進行表shinko!$I$25","v":"井本高史"},null,null,{"$f":"進行表shinko!$D$26","v":"上倉淑敬"},{"$f":"進行表shinko!$I$26","v":"宮野早織"},null,null,{"$f":"進行表shinko!$D$27","v":"森田由佳里"},{"$f":"進行表shinko!$I$27","v":"金澤茂昌"},null,null,null,{"$f":"進行表shinko!$D$28","v":""},{"$f":"進行表shinko!$I$28","v":""}]
[null,{"$f":"$B$4","v":"京都"},{"$f":"$C$4","v":"奈良"},null,null,{"$f":"$B$4","v":"京都"},{"$f":"$C$4","v":"奈良"},null,null,{"$f":"$B$4","v":"京都"},{"$f":"$C$4","v":"奈良"},null,null,{"$f":"$B$4","v":"京都"},{"$f":"$C$4","v":"奈良"},null,null,{"$f":"$B$4","v":"京都"},{"$f":"$C$4","v":"奈良"},null,null,{"$f":"$B$4","v":"京都"},{"$f":"$C$4","v":"奈良"},null,null,{"$f":"$B$4","v":"京都"},{"$f":"$C$4","v":"奈良"},null,null,null,{"$f":"$B$4","v":"京都"},{"$f":"$C$4","v":"奈良"}]
[]
[null,"HR","HR",null,null,"HR","HR",null,null,"HR","HR",null,null,"HR","HR",null,null,"HR","HR",null,null,"HR","HR",null,null,"HR","HR",null,null,null,"HR","HR"]
[null,"レフリー",null,null,null,"レフリー",null,null,null,"レフリー",null,null,null,"レフリー",null,null,null,"レフリー",null,null,null,"レフリー",null,null,null,"レフリー",null,null,null,null,"レフリー"]
[]
[]
[null,"３－１","No.",null,null,"３－２","No.",null,null,"３－３","No.",null,null,"３－４","No.",null,null,"３－５","No.",null,null,"３－６","No.",null,null,"３－７","No.",null,null,null,"３－８","No."]
[null,{"$f":"進行表shinko!$D$29","v":"今村哲也"},{"$f":"進行表shinko!$I$29","v":"吉向翔平"},null,null,{"$f":"進行表shinko!$D$30","v":"金光隆男"},{"$f":"進行表shinko!$I$30","v":"岩本剛"},null,null,{"$f":"進行表shinko!$D$31","v":"田附裕次"},{"$f":"進行表shinko!$I$31","v":"長谷川進"},null,null,{"$f":"進行表shinko!$D$32","v":"吉田智直"},{"$f":"進行表shinko!$I$32","v":"井本高史"},null,null,{"$f":"進行表shinko!$D$33","v":"小堀泰次郎"},{"$f":"進行表shinko!$I$33","v":"宮野早織"},null,null,{"$f":"進行表shinko!$D$34","v":"上倉淑敬"},{"$f":"進行表shinko!$I$34","v":"金澤茂昌"},null,null,{"$f":"進行表shinko!$D$35","v":"森田由佳里"},{"$f":"進行表shinko!$I$35","v":"白戸玲人"},null,null,null,{"$f":"進行表shinko!$D$36","v":""},{"$f":"進行表shinko!$I$36","v":""}]
[null,{"$f":"$B$4","v":"京都"},{"$f":"$C$4","v":"奈良"},null,null,{"$f":"$B$4","v":"京都"},{"$f":"$C$4","v":"奈良"},null,null,{"$f":"$B$4","v":"京都"},{"$f":"$C$4","v":"奈良"},null,null,{"$f":"$B$4","v":"京都"},{"$f":"$C$4","v":"奈良"},null,null,{"$f":"$B$4","v":"京都"},{"$f":"$C$4","v":"奈良"},null,null,{"$f":"$B$4","v":"京都"},{"$f":"$C$4","v":"奈良"},null,null,{"$f":"$B$4","v":"京都"},{"$f":"$C$4","v":"奈良"},null,null,null,{"$f":"$B$4","v":"京都"},{"$f":"$C$4","v":"奈良"}]
[]
[null,"HR","HR",null,null,"HR","HR",null,null,"HR","HR",null,null,"HR","HR",null,null,"HR","HR",null,null,"HR","HR",null,null,"HR","HR",null,null,null,"HR","HR"]
[null,"レフリー",null,null,null,"レフリー",null,null,null,"レフリー",null,null,null,"レフリー",null,null,null,"レフリー",null,null,null,"レフリー",null,null,null,"レフリー",null,null,null,null,"レフリー"]
[]
[]
[null,"４－１","No.",null,null,"４－２","No.",null,null,"４－３","No.",null,null,"４－４","No.",null,null,"４－５","No.",null,null,"４－６","No.",null,null,"４－７","No.",null,null,null,"４－８","No."]
[null,{"$f":"進行表shinko!$D$37","v":"今村哲也"},{"$f":"進行表shinko!$I$37","v":"岩本剛"},null,null,{"$f":"進行表shinko!$D$38","v":"金光隆男"},{"$f":"進行表shinko!$I$38","v":"長谷川進"},null,null,{"$f":"進行表shinko!$D$39","v":"田附裕次"},{"$f":"進行表shinko!$I$39","v":"井本高史"},null,null,{"$f":"進行表shinko!$D$40","v":"吉田智直"},{"$f":"進行表shinko!$I$40","v":"宮野早織"},null,null,{"$f":"進行表shinko!$D$41","v":"小堀泰次郎"},{"$f":"進行表shinko!$I$41","v":"金澤茂昌"},null,null,{"$f":"進行表shinko!$D$42","v":"上倉淑敬"},{"$f":"進行表shinko!$I$42","v":"白戸玲人"},null,null,{"$f":"進行表shinko!$D$43","v":"森田由佳里"},{"$f":"進行表shinko!$I$43","v":"吉向翔平"},null,null,null,{"$f":"進行表shinko!$D$44","v":""},{"$f":"進行表shinko!$I$44","v":""}]
[null,{"$f":"$B$4","v":"京都"},{"$f":"$C$4","v":"奈良"},null,null,{"$f":"$B$4","v":"京都"},{"$f":"$C$4","v":"奈良"},null,null,{"$f":"$B$4","v":"京都"},{"$f":"$C$4","v":"奈良"},null,null,{"$f":"$B$4","v":"京都"},{"$f":"$C$4","v":"奈良"},null,null,{"$f":"$B$4","v":"京都"},{"$f":"$C$4","v":"奈良"},null,null,{"$f":"$B$4","v":"京都"},{"$f":"$C$4","v":"奈良"},null,null,{"$f":"$B$4","v":"京都"},{"$f":"$C$4","v":"奈良"},null,null,null,{"$f":"$B$4","v":"京都"},{"$f":"$C$4","v":"奈良"}]
[]
[null,"HR","HR",null,null,"HR","HR",null,null,"HR","HR",null,null,"HR","HR",null,null,"HR","HR",null,null,"HR","HR",null,null,"HR","HR",null,null,null,"HR","HR"]
[null,"レフリー",null,null,null,"レフリー",null,null,null,"レフリー",null,null,null,"レフリー",null,null,null,"レフリー",null,null,null,"レフリー",null,null,null,"レフリー",null,null,null,null,"レフリー"]
[]
[]
[null,"５－１","No.",null,null,"５－２","No.",null,null,"５－３","No.",null,null,"５－４","No.",null,null,"５－５","No.",null,null,"５－６","No.",null,null,"５－７","No.",null,null,null,"５－８","No."]
[null,{"$f":"進行表shinko!$D$45","v":"今村哲也"},{"$f":"進行表shinko!$I$45","v":"長谷川進"},null,null,{"$f":"進行表shinko!$D$46","v":"金光隆男"},{"$f":"進行表shinko!$I$46","v":"井本高史"},null,null,{"$f":"進行表shinko!$D$47","v":"田附裕次"},{"$f":"進行表shinko!$I$47","v":"宮野早織"},null,null,{"$f":"進行表shinko!$D$48","v":"吉田智直"},{"$f":"進行表shinko!$I$48","v":"金澤茂昌"},null,null,{"$f":"進行表shinko!$D$49","v":"小堀泰次郎"},{"$f":"進行表shinko!$I$49","v":"白戸玲人"},null,null,{"$f":"進行表shinko!$D$50","v":"上倉淑敬"},{"$f":"進行表shinko!$I$50","v":"吉向翔平"},null,null,{"$f":"進行表shinko!$D$51","v":"森田由佳里"},{"$f":"進行表shinko!$I$51","v":"岩本剛"},null,null,null,{"$f":"進行表shinko!$D$52","v":""},{"$f":"進行表shinko!$I$52","v":""}]
[null,{"$f":"$B$4","v":"京都"},{"$f":"$C$4","v":"奈良"},null,null,{"$f":"$B$4","v":"京都"},{"$f":"$C$4","v":"奈良"},null,null,{"$f":"$B$4","v":"京都"},{"$f":"$C$4","v":"奈良"},null,null,{"$f":"$B$4","v":"京都"},{"$f":"$C$4","v":"奈良"},null,null,{"$f":"$B$4","v":"京都"},{"$f":"$C$4","v":"奈良"},null,null,{"$f":"$B$4","v":"京都"},{"$f":"$C$4","v":"奈良"},null,null,{"$f":"$B$4","v":"京都"},{"$f":"$C$4","v":"奈良"},null,null,null,{"$f":"$B$4","v":"京都"},{"$f":"$C$4","v":"奈良"}]
[]
[null,"HR","HR",null,null,"HR","HR",null,null,"HR","HR",null,null,"HR","HR",null,null,"HR","HR",null,null,"HR","HR",null,null,"HR","HR",null,null,null,"HR","HR"]
[null,"レフリー",null,null,null,"レフリー",null,null,null,"レフリー",null,null,null,"レフリー",null,null,null,"レフリー",null,null,null,"レフリー",null,null,null,"レフリー",null,null,null,null,"レフリー"]
[]
[]
[null,"６－１","No.",null,null,"６－２","No.",null,null,"６－３","No.",null,null,"６－４","No.",null,null,"６－５","No.",null,null,"６－６","No.",null,null,"６－７","No.",null,null,null,"６－８","No."]
[null,{"$f":"進行表shinko!$D$53","v":"今村哲也"},{"$f":"進行表shinko!$I$53","v":"井本高史"},null,null,{"$f":"進行表shinko!$D$54","v":"金光隆男"},{"$f":"進行表shinko!$I$54","v":"宮野早織"},null,null,{"$f":"進行表shinko!$D$55","v":"田附裕次"},{"$f":"進行表shinko!$I$55","v":"金澤茂昌"},null,null,{"$f":"進行表shinko!$D$56","v":"吉田智直"},{"$f":"進行表shinko!$I$56","v":"白戸玲人"},null,null,{"$f":"進行表shinko!$D$57","v":"小堀泰次郎"},{"$f":"進行表shinko!$I$57","v":"吉向翔平"},null,null,{"$f":"進行表shinko!$D$58","v":"上倉淑敬"},{"$f":"進行表shinko!$I$58","v":"岩本剛"},null,null,{"$f":"進行表shinko!$D$59","v":"森田由佳里"},{"$f":"進行表shinko!$I$59","v":"長谷川進"},null,null,null,{"$f":"進行表shinko!$D$60","v":""},{"$f":"進行表shinko!$I$60","v":""}]
[null,{"$f":"$B$4","v":"京都"},{"$f":"$C$4","v":"奈良"},null,null,{"$f":"$B$4","v":"京都"},{"$f":"$C$4","v":"奈良"},null,null,{"$f":"$B$4","v":"京都"},{"$f":"$C$4","v":"奈良"},null,null,{"$f":"$B$4","v":"京都"},{"$f":"$C$4","v":"奈良"},null,null,{"$f":"$B$4","v":"京都"},{"$f":"$C$4","v":"奈良"},null,null,{"$f":"$B$4","v":"京都"},{"$f":"$C$4","v":"奈良"},null,null,{"$f":"$B$4","v":"京都"},{"$f":"$C$4","v":"奈良"},null,null,null,{"$f":"$B$4","v":"京都"},{"$f":"$C$4","v":"奈良"}]
[]
[null,"HR","HR",null,null,"HR","HR",null,null,"HR","HR",null,null,"HR","HR",null,null,"HR","HR",null,null,"HR","HR",null,null,"HR","HR",null,null,null,"HR","HR"]
[null,"レフリー",null,null,null,"レフリー",null,null,null,"レフリー",null,null,null,"レフリー",null,null,null,"レフリー",null,null,null,"レフリー",null,null,null,"レフリー",null,null,null,null,"レフリー"]
[]
[]
[null,"７－１","No.",null,null,"７－２","No.",null,null,"７－３","No.",null,null,"７－４","No.",null,null,"７－５","No.",null,null,"７－６","No.",null,null,"７－７","No.",null,null,null,"７－８","No."]
[null,{"$f":"進行表shinko!$D$61","v":"今村哲也"},{"$f":"進行表shinko!$I$61","v":"宮野早織"},null,null,{"$f":"進行表shinko!$D$62","v":"金光隆男"},{"$f":"進行表shinko!$I$62","v":"金澤茂昌"},null,null,{"$f":"進行表shinko!$D$63","v":"田附裕次"},{"$f":"進行表shinko!$I$63","v":"白戸玲人"},null,null,{"$f":"進行表shinko!$D$64","v":"吉田智直"},{"$f":"進行表shinko!$I$64","v":"吉向翔平"},null,null,{"$f":"進行表shinko!$D$65","v":"小堀泰次郎"},{"$f":"進行表shinko!$I$65","v":"岩本剛"},null,null,{"$f":"進行表shinko!$D$66","v":"上倉淑敬"},{"$f":"進行表shinko!$I$66","v":"長谷川進"},null,null,{"$f":"進行表shinko!$D$67","v":"森田由佳里"},{"$f":"進行表shinko!$I$67","v":"井本高史"},null,null,null,{"$f":"進行表shinko!$D$68","v":""},{"$f":"進行表shinko!$I$68","v":""}]
[null,{"$f":"$B$4","v":"京都"},{"$f":"$C$4","v":"奈良"},null,null,{"$f":"$B$4","v":"京都"},{"$f":"$C$4","v":"奈良"},null,null,{"$f":"$B$4","v":"京都"},{"$f":"$C$4","v":"奈良"},null,null,{"$f":"$B$4","v":"京都"},{"$f":"$C$4","v":"奈良"},null,null,{"$f":"$B$4","v":"京都"},{"$f":"$C$4","v":"奈良"},null,null,{"$f":"$B$4","v":"京都"},{"$f":"$C$4","v":"奈良"},null,null,{"$f":"$B$4","v":"京都"},{"$f":"$C$4","v":"奈良"},null,null,null,{"$f":"$B$4","v":"京都"},{"$f":"$C$4","v":"奈良"}]
[]
[null,"HR","HR",null,null,"HR","HR",null,null,"HR","HR",null,null,"HR","HR",null,null,"HR","HR",null,null,"HR","HR",null,null,"HR","HR",null,null,null,"HR","HR"]
[null,"レフリー",null,null,null,"レフリー",null,null,null,"レフリー",null,null,null,"レフリー",null,null,null,"レフリー",null,null,null,"レフリー",null,null,null,"レフリー",null,null,null,null,"レフリー"]
[]
[]
[null,"８－１","No.",null,null,"８－２","No.",null,null,"８－３","No.",null,null,"８－４","No.",null,null,"８－５","No.",null,null,"８－６","No.",null,null,"８－７","No.",null,null,null,"８－８","No."]
[null,{"$f":"進行表shinko!$D$69","v":""},{"$f":"進行表shinko!$I$69","v":""},null,null,{"$f":"進行表shinko!$D$70","v":""},{"$f":"進行表shinko!$I$70","v":""},null,null,{"$f":"進行表shinko!$D$71","v":""},{"$f":"進行表shinko!$I$71","v":""},null,null,{"$f":"進行表shinko!$D$72","v":""},{"$f":"進行表shinko!$I$72","v":""},null,null,{"$f":"進行表shinko!$D$73","v":""},{"$f":"進行表shinko!$I$73","v":""},null,null,{"$f":"進行表shinko!$D$74","v":""},{"$f":"進行表shinko!$I$74","v":""},null,null,{"$f":"進行表shinko!$D$75","v":""},{"$f":"進行表shinko!$I$75","v":""},null,null,null,{"$f":"進行表shinko!$D$76","v":""},{"$f":"進行表shinko!$I$76","v":""}]
[null,{"$f":"$B$4","v":"京都"},{"$f":"$C$4","v":"奈良"},null,null,{"$f":"$B$4","v":"京都"},{"$f":"$C$4","v":"奈良"},null,null,{"$f":"$B$4","v":"京都"},{"$f":"$C$4","v":"奈良"},null,null,{"$f":"$B$4","v":"京都"},{"$f":"$C$4","v":"奈良"},null,null,{"$f":"$B$4","v":"京都"},{"$f":"$C$4","v":"奈良"},null,null,{"$f":"$B$4","v":"京都"},{"$f":"$C$4","v":"奈良"},null,null,{"$f":"$B$4","v":"京都"},{"$f":"$C$4","v":"奈良"},null,null,null,{"$f":"$B$4","v":"京都"},{"$f":"$C$4","v":"奈良"}]
[]
[null,"HR","HR",null,null,"HR","HR",null,null,"HR","HR",null,null,"HR","HR",null,null,"HR","HR",null,null,"HR","HR",null,null,"HR","HR",null,null,null,"HR","HR"]
[null,"レフリー",null,null,null,"レフリー",null,null,null,"レフリー",null,null,null,"レフリー",null,null,null,"レフリー",null,null,null,"レフリー",null,null,null,"レフリー",null,null,null,null,"レフリー"]

{"sheet":"進行表shinko","index":4,"n_rows":78,"n_cols":12,"rows_kept":78,"cut":false,"hidden":false,"merged":[[7,7,7,8],[7,3,7,4]]}
[null,null,null,"試合の進行に関する入力は、このシートのみで行ってください。"]
[null,null,null,"得点欄に、勝者は半角大文字でW、敗者は半角数字で負点を入力して下さい。"]
[]
[null,null,null,"その他の欄は自動で更新されます。"]
[]
[{"$f":"登録touroku!B11","v":"第１７回　京奈　対抗戦"}]
[null,null,null,{"$f":"登録touroku!C20","v":"京都"},null,null,{"$f":"登録touroku!E20","v":"奈良"}]
[null,null,null,{"$f":"成績表seiseki!T41","v":26},null,null,null,{"$f":"成績表seiseki!AK41","v":16}]
[null,null,null,"Total Point",null,null,null,"Total Point"]
[null,null,null,{"$f":"成績表seiseki!T41*180+成績表seiseki!V41","v":6070.1428571428569},null,null,null,{"$f":"成績表seiseki!AK41*180+成績表seiseki!AM41","v":5204.4285714285716}]
[]
[null,"1節",null,{"$f":"登録touroku!C20","v":"京都"},"HR","得点","得点","HR",{"$f":"登録touroku!E20","v":"奈良"}]
[null,null,{"$f":"D13&I13","v":"今村哲也金澤茂昌"},{"$f":"登録touroku!C21","v":"今村哲也"},null,"w",69,null,{"$f":"登録touroku!E21","v":"金澤茂昌"},null,null,"勝者は半角大文字のW、敗者は得点"]
[null,null,{"$f":"D14&I14","v":"金光隆男白戸玲人"},{"$f":"登録touroku!C22","v":"金光隆男"},180,"w",60,null,{"$f":"登録touroku!E22","v":"白戸玲人"},null,null,"ただし、HRは、成績表の左下欄に入力してください。"]
[null,null,"田附裕次吉向翔平",{"$f":"登録touroku!C23","v":"田附裕次"},null,122,"w",null,{"$f":"登録touroku!E23","v":"吉向翔平"}]
[null,null,"吉田智直岩本剛",{"$f":"登録touroku!C24","v":"吉田智直"},null,"w",45,null,{"$f":"登録touroku!E24","v":"岩本剛"}]
[null,null,"小堀泰次郎長谷川進",{"$f":"登録touroku!C25","v":"小堀泰次郎"},null,"w",108,null,{"$f":"登録touroku!E25","v":"長谷川進"}]
[null,null,"上倉淑敬井本高史",{"$f":"登録touroku!C26","v":"上倉淑敬"},null,"w",102,null,{"$f":"登録touroku!E26","v":"井本高史"}]
[null,null,"森田由佳里宮野早織",{"$f":"登録touroku!C27","v":"森田由佳里"},null,"w",63,null,{"$f":"登録touroku!E27","v":"宮野早織"}]
[null,null,"",{"$f":"IF(登録touroku!C28=\"\",\"\",登録touroku!C28)","v":""},null,null,null,null,{"$f":"IF(登録touroku!E28=\"\",\"\",登録touroku!E28)","v":""}]
[null,"2節","今村哲也白戸玲人",{"$f":"D13","v":"今村哲也"},null,"w",62,null,{"$f":"I14","v":"白戸玲人"}]
[null,null,"金光隆男吉向翔平","金光隆男",null,95,"w",null,"吉向翔平"]
[null,null,"田附裕次岩本剛","田附裕次",null,32,"w",null,"岩本剛"]
[null,null,"吉田智直長谷川進","吉田智直",null,"w",169,null,"長谷川進"]
[null,null,"小堀泰次郎井本高史","小堀泰次郎",null,"w",54,null,"井本高史"]
[null,null,"上倉淑敬宮野早織","上倉淑敬",null,"w",81,null,"宮野早織"]
[null,null,"森田由佳里金澤茂昌","森田由佳里",null,"w",164,null,{"$f":"IF(I20=\"\",I13,I20)","v":"金澤茂昌"}]
[null,null,"","",null,null,null,null,{"$f":"IF(I20=\"\",\"\",I13)","v":""}]
[null,"3節","今村哲也吉向翔平",{"$f":"D13","v":"今村哲也"},114,"w",122,null,{"$f":"I22","v":"吉向翔平"}]
[null,null,"金光隆男岩本剛","金光隆男",null,47,"w",null,"岩本剛"]
[null,null,"田附裕次長谷川進","田附裕次",null,"w",29,null,"長谷川進"]
[null,null,"吉田智直井本高史","吉田智直",null,"w",20,null,"井本高史"]
[null,null,{"$f":"D33&I33","v":"小堀泰次郎宮野早織"},"小堀泰次郎",null,"w",105,null,"宮野早織"]
[null,null,"上倉淑敬金澤茂昌","上倉淑敬",null,87,"w",null,"金澤茂昌"]
[null,null,"森田由佳里白戸玲人","森田由佳里",null,49,"w",null,{"$f":"IF(I20=\"\",I21,I28)","v":"白戸玲人"}]
[null,null,"","",null,null,null,null,{"$f":"IF(I20=\"\",\"\",I21)","v":""}]
[null,"4節","今村哲也岩本剛",{"$f":"D29","v":"今村哲也"},null,83,"w",null,{"$f":"I30","v":"岩本剛"}]
[null,null,"金光隆男長谷川進","金光隆男",null,176,"w",null,"長谷川進"]
[null,null,"田附裕次井本高史","田附裕次",null,"w",31,null,"井本高史"]
[null,null,"吉田智直宮野早織","吉田智直",null,"w",98,null,{"$f":"I33","v":"宮野早織"}]
[null,null,"小堀泰次郎金澤茂昌","小堀泰次郎",null,119,"w",null,"金澤茂昌"]
[null,null,"上倉淑敬白戸玲人","上倉淑敬",null,"w",50,null,{"$f":"I35","v":"白戸玲人"}]
[null,null,"森田由佳里吉向翔平","森田由佳里",null,23,"w",null,{"$f":"IF(I20=\"\",I29,I35)","v":"吉向翔平"}]
[null,null,"","",null,null,null,null,{"$f":"IF(I20=\"\",\"\",I29)","v":""}]
[null,"5節","今村哲也長谷川進",{"$f":"D29","v":"今村哲也"},134,"w",86,null,{"$f":"I38","v":"長谷川進"}]
[null,null,"金光隆男井本高史","金光隆男",null,"w",73,null,"井本高史"]
[null,null,"田附裕次宮野早織","田附裕次",null,"w",99,null,"宮野早織"]
[null,null,"吉田智直金澤茂昌","吉田智直",null,"w",15,null,"金澤茂昌"]
[null,null,"小堀泰次郎白戸玲人","小堀泰次郎",null,"w",158,null,"白戸玲人"]
[null,null,"上倉淑敬吉向翔平","上倉淑敬",null,89,"w",null,"吉向翔平"]
[null,null,"森田由佳里岩本剛","森田由佳里",null,107,"w",120,{"$f":"IF(I20=\"\",I37,I44)","v":"岩本剛"}]
[null,null,"","",null,null,null,null,{"$f":"IF(I20=\"\",\"\",I37)","v":""}]
[null,"6節","今村哲也井本高史",{"$f":"D37","v":"今村哲也"},null,"w",67,null,{"$f":"I46","v":"井本高史"}]
[null,null,"金光隆男宮野早織","金光隆男",null,106,"w",null,"宮野早織"]
[null,null,"田附裕次金澤茂昌","田附裕次",null,101,"w",null,"金澤茂昌"]
[null,null,"吉田智直白戸玲人","吉田智直",null,97,"w",null,"白戸玲人"]
[null,null,"小堀泰次郎吉向翔平","小堀泰次郎",null,"w",140,null,"吉向翔平"]
[null,null,"上倉淑敬岩本剛","上倉淑敬",null,6,"w",null,"岩本剛"]
[null,null,"森田由佳里長谷川進","森田由佳里",null,"w",127,null,{"$f":"IF(I20=\"\",I45,I52)","v":"長谷川進"}]
[null,null,"","",null,null,null,null,{"$f":"IF(I20=\"\",\"\",I45)","v":""}]
[null,"7節","今村哲也宮野早織",{"$f":"D45","v":"今村哲也"},null,null,null,null,{"$f":"I54","v":"宮野早織"}]
[null,null,"金光隆男金澤茂昌","金光隆男",null,null,null,null,"金澤茂昌"]
[null,null,"田附裕次白戸玲人","田附裕次",null,null,null,null,"白戸玲人"]
[null,null,"吉田智直吉向翔平","吉田智直",null,null,null,null,"吉向翔平"]
[null,null,"小堀泰次郎岩本剛","小堀泰次郎",null,null,null,null,"岩本剛"]
[null,null,"上倉淑敬長谷川進","上倉淑敬",null,null,null,null,"長谷川進"]
[null,null,"森田由佳里井本高史","森田由佳里",null,null,null,null,{"$f":"IF(I20=\"\",I53,I60)","v":"井本高史"}]
[null,null,"","",null,null,null,null,{"$f":"IF(I20=\"\",\"\",I53)","v":""}]
[null,"8節","",{"$f":"IF(I20=\"\",\"\",D53)","v":""},null,null,null,null,{"$f":"IF(I20=\"\",\"\",I62)","v":""}]
[null,null,"",{"$f":"IF(I20=\"\",\"\",D54)","v":""},null,null,null,null,{"$f":"IF(I20=\"\",\"\",I63)","v":""}]
[null,null,"",{"$f":"IF(I20=\"\",\"\",D55)","v":""},null,null,null,null,{"$f":"IF(I20=\"\",\"\",I64)","v":""}]
[null,null,"",{"$f":"IF(I20=\"\",\"\",D56)","v":""},null,null,null,null,{"$f":"IF(I20=\"\",\"\",I65)","v":""}]
[null,null,"",{"$f":"IF(I20=\"\",\"\",D57)","v":""},null,null,null,null,{"$f":"IF(I20=\"\",\"\",I66)","v":""}]
[null,null,"",{"$f":"IF(I20=\"\",\"\",D58)","v":""},null,null,null,null,{"$f":"IF(I20=\"\",\"\",I67)","v":""}]
[null,null,"",{"$f":"IF(I20=\"\",\"\",D59)","v":""},null,null,null,null,{"$f":"IF(I20=\"\",\"\",I68)","v":""}]
[null,null,"",{"$f":"D60","v":""},null,null,null,null,{"$f":"IF(I20=\"\",\"\",I61)","v":""}]
[]
[null,null,null,null,{"$f":"MAX(E13:E76)","v":180},null,null,{"$f":"MAX(H13:H76)","v":120}]

{"sheet":"成績表seiseki","index":5,"n_rows":41,"n_cols":42,"rows_kept":41,"cut":false,"hidden":false,"merged":[[40,38,40,39],[40,1,40,2],[40,4,40,5],[37,4,37,5],[38,1,38,2],[38,4,38,5],[39,1,39,2],[39,4,39,5],[40,21,40,22],[34,1,34,2],[37,1,37,2],[34,4,34,5],[35,1,35,2],[35,4,35,5],[36,1,36,2],[36,4,36,5],[31,1,31,2],[31,4,31,5],[32,1,32,2],[32,4,32,5],[33,1,33,2],[33,4,33,5],[5,1,6,9],[6,10,6,13],[19,8,21,8],[19,9,21,9],[19,7,21,7],[19,2,21,2],[19,3,21,3],[19,5,21,5],[19,6,21,6],[19,4,21,4],[14,12,16,12],[14,13,16,13],[9,2,11,2],[9,3,11,3],[9,4,11,4],[9,5,11,5],[14,2,16,2],[14,3,16,3],[9,13,11,13],[9,6,11,6],[9,7,11,7],[9,8,11,8],[9,12,11,12],[9,9,11,9],[29,40,31,40],[29,34,31,34],[29,35,31,35],[29,36,31,36],[29,37,31,37],[29,38,31,38],[28,36,28,38],[28,39,28,40],[29,29,31,29],[29,39,31,39],[29,30,31,30],[29,31,31,31],[29,32,31,32],[29,33,31,33],[9,39,11,39],[9,36,11,36],[9,37,11,37],[9,35,11,35],[9,38,11,38],[9,25,11,25],[24,35,26,35],[24,36,26,36],[6,29,6,32],[6,36,6,40],[6,22,6,25],[24,38,26,38],[14,29,16,29],[14,32,16,32],[24,23,26,23],[14,28,16,28],[14,26,16,26],[14,27,16,27],[14,35,16,35],[19,36,21,36],[24,24,26,24],[24,33,26,33],[19,29,21,29],[24,26,26,26],[19,27,21,27],[19,24,21,24],[14,39,16,39],[14,37,16,37],[14,34,16,34],[14,33,16,33],[14,36,16,36],[14,38,16,38],[24,39,26,39],[19,38,21,38],[19,39,21,39],[19,37,21,37],[24,37,26,37],[14,24,16,24],[24,29,26,29],[24,25,26,25],[24,28,26,28],[24,27,26,27],[19,28,21,28],[19,25,21,25],[19,26,21,26],[14,22,16,22],[14,23,16,23],[29,15,31,15],[14,15,16,15],[19,19,21,19],[19,22,21,22],[19,23,21,23],[29,23,31,23],[29,22,31,22],[24,22,26,22],[29,11,31,11],[14,5,16,5],[14,14,16,14],[19,14,21,14],[9,14,11,14],[9,15,11,15],[14,19,16,19],[14,18,16,18],[14,16,16,16],[14,17,16,17],[29,1,29,2],[29,4,29,5],[30,1,30,2],[30,4,30,5],[28,1,28,2],[28,3,28,4],[14,4,16,4],[29,13,31,13],[14,7,16,7],[14,8,16,8],[14,9,16,9],[14,6,16,6],[24,2,26,2],[24,3,26,3],[24,4,26,4],[24,5,26,5],[24,9,26,9],[19,12,21,12],[19,13,21,13],[29,12,31,12],[24,6,26,6],[24,7,26,7],[24,8,26,8],[28,5,28,6],[9,34,11,34],[9,26,11,26],[9,27,11,27],[9,28,11,28],[9,29,11,29],[9,32,11,32],[9,33,11,33],[19,18,21,18],[24,16,26,16],[9,18,11,18],[9,19,11,19],[9,16,11,16],[9,17,11,17],[14,25,16,25],[9,22,11,22],[9,23,11,23],[9,24,11,24],[24,32,26,32],[24,34,26,34],[19,34,21,34],[19,33,21,33],[19,32,21,32],[24,18,26,18],[24,19,26,19],[41,4,41,5],[42,4,42,5],[43,4,43,5],[19,35,21,35],[24,12,26,12],[24,13,26,13],[19,16,21,16],[19,17,21,17],[19,15,21,15],[24,15,26,15],[24,17,26,17],[24,14,26,14],[29,16,31,16],[28,19,28,21],[28,22,28,23],[29,14,31,14],[29,20,31,20],[29,21,31,21],[29,18,31,18],[29,19,31,19],[29,17,31,17],[29,25,31,27],[29,28,31,28],[29,8,31,10]]}
[null,"このシートは、左下のHRチェック、および右上のMVP、VP、HRの各賞対象者のみ入力して下さい。"]
[null,"左下のHRチェックは、選手名以下のセルを選択後▼が表示されてから、\"Alt+↓\"で表示されるリストから、↑↓キーで選択しEnterキーで決定して下さい。"]
[null,"HRの得点は、直接入力して下さい。"]
[null,"右上のMVP、VP、HRの各賞対象者を直接入力して下さい。"]
[]
[null,{"$f":"登録touroku!B11","v":"第１７回　京奈　対抗戦"}]
[null,null,null,null,null,null,null,null,null,null,{"$f":"登録touroku!C13","v":"2021-11-28"},null,null,null,"於",{"$f":"登録touroku!C15","v":"VAMP"},null,null,null,null,"MVP",null,"小堀泰次郎",null,null,null,null,"VP",null,"岩本剛",null,null,null,null,"HR",null,"金光隆男"]
[]
[null,null,1,{"$f":"C9+1","v":2},3,4,5,6,7,{"$f":"IF(登録touroku!$C$28=\"\",\"\",成績表seiseki!I9+1)","v":""},null,null,{"$f":"IF(J9=\"\",I9+1,J9+1)","v":8},{"$f":"M9+1","v":9},10,11,12,13,14,{"$f":"IF(登録touroku!$C$28=\"\",\"\",成績表seiseki!S9+1)","v":""},null,null,{"$f":"IF(T9=\"\",S9+1,T9+1)","v":15},{"$f":"W9+1","v":16},17,18,19,20,21,{"$f":"IF(登録touroku!$C$28=\"\",\"\",成績表seiseki!AC9+1)","v":""},null,null,{"$f":"IF(AD9=\"\",AC9+1,AD9+1)","v":22},{"$f":"AG9+1","v":23},24,25,26,27,28,{"$f":"IF(登録touroku!$C$28=\"\",\"\",成績表seiseki!AM9+1)","v":""}]
[null,null,{"$f":"IF(進行表shinko!D13=\"\",\"\",進行表shinko!D13)","v":"今村哲也"},{"$f":"IF(進行表shinko!D14=\"\",\"\",進行表shinko!D14)","v":"金光隆男"},{"$f":"IF(進行表shinko!D15=\"\",\"\",進行表shinko!D15)","v":"田附裕次"},{"$f":"IF(進行表shinko!D16=\"\",\"\",進行表shinko!D16)","v":"吉田智直"},{"$f":"IF(進行表shinko!D17=\"\",\"\",進行表shinko!D17)","v":"小堀泰次郎"},{"$f":"IF(進行表shinko!D18=\"\",\"\",進行表shinko!D18)","v":"上倉淑敬"},{"$f":"IF(進行表shinko!D19=\"\",\"\",進行表shinko!D19)","v":"森田由佳里"},{"$f":"IF(進行表shinko!D20=\"\",\"\",進行表shinko!D20)","v":""},null,null,{"$f":"IF(進行表shinko!D21=\"\",\"\",進行表shinko!D21)","v":"今村哲也"},{"$f":"IF(進行表shinko!D22=\"\",\"\",進行表shinko!D22)","v":"金光隆男"},{"$f":"IF(進行表shinko!D23=\"\",\"\",進行表shinko!D23)","v":"田附裕次"},{"$f":"IF(進行表shinko!D24=\"\",\"\",進行表shinko!D24)","v":"吉田智直"},{"$f":"IF(進行表shinko!D25=\"\",\"\",進行表shinko!D25)","v":"小堀泰次郎"},{"$f":"IF(進行表shinko!D26=\"\",\"\",進行表shinko!D26)","v":"上倉淑敬"},{"$f":"IF(進行表shinko!D27=\"\",\"\",進行表shinko!D27)","v":"森田由佳里"},{"$f":"IF(進行表shinko!D28=\"\",\"\",進行表shinko!D28)","v":""},null,null,{"$f":"IF(進行表shinko!D29=\"\",\"\",進行表shinko!D29)","v":"今村哲也"},{"$f":"IF(進行表shinko!D30=\"\",\"\",進行表shinko!D30)","v":"金光隆男"},{"$f":"IF(進行表shinko!D31=\"\",\"\",進行表shinko!D31)","v":"田附裕次"},{"$f":"IF(進行表shinko!D32=\"\",\"\",進行表shinko!D32)","v":"吉田智直"},{"$f":"IF(進行表shinko!D33=\"\",\"\",進行表shinko!D33)","v":"小堀泰次郎"},{"$f":"IF(進行表shinko!D34=\"\",\"\",進行表shinko!D34)","v":"上倉淑敬"},{"$f":"IF(進行表shinko!D35=\"\",\"\",進行表shinko!D35)","v":"森田由佳里"},{"$f":"IF(進行表shinko!D36=\"\",\"\",進行表shinko!D36)","v":""},null,null,{"$f":"IF(進行表shinko!D37=\"\",\"\",進行表shinko!D37)","v":"今村哲也"},{"$f":"IF(進行表shinko!D38=\"\",\"\",進行表shinko!D38)","v":"金光隆男"},{"$f":"IF(進行表shinko!D39=\"\",\"\",進行表shinko!D39)","v":"田附裕次"},{"$f":"IF(進行表shinko!D40=\"\",\"\",進行表shinko!D40)","v":"吉田智直"},{"$f":"IF(進行表shinko!D41=\"\",\"\",進行表shinko!D41)","v":"小堀泰次郎"},{"$f":"IF(進行表shinko!D42=\"\",\"\",進行表shinko!D42)","v":"上倉淑敬"},{"$f":"IF(進行表shinko!D43=\"\",\"\",進行表shinko!D43)","v":"森田由佳里"},{"$f":"IF(進行表shinko!D44=\"\",\"\",進行表shinko!D44)","v":""}]
[]
[null,null,null,null,null,null,null,null,null,null,null,null,null,null,null,null,null,null,null,null,{"$f":"IF(K13=\"\",\"\",K13+U13)","v":11},null,null,null,null,null,null,null,null,null,{"$f":"IF(U13=\"\",\"\",U12+AE13)","v":15},null,null,null,null,null,null,null,null,null,{"$f":"IF(AO13=\"\",\"\",AE12+AO13)","v":18}]
[null,1,{"$f":"IF(進行表shinko!F13=\"\",\"\",IF(進行表shinko!F13<180,\"×\",\"○\"))","v":"○"},{"$f":"IF(進行表shinko!F14=\"\",\"\",IF(進行表shinko!F14<180,\"×\",\"○\"))","v":"○"},{"$f":"IF(進行表shinko!F15=\"\",\"\",IF(進行表shinko!F15<180,\"×\",\"○\"))","v":"×"},{"$f":"IF(進行表shinko!F16=\"\",\"\",IF(進行表shinko!F16<180,\"×\",\"○\"))","v":"○"},{"$f":"IF(進行表shinko!F17=\"\",\"\",IF(進行表shinko!F17<180,\"×\",\"○\"))","v":"○"},{"$f":"IF(進行表shinko!F18=\"\",\"\",IF(進行表shinko!F18<180,\"×\",\"○\"))","v":"○"},{"$f":"IF(進行表shinko!F19=\"\",\"\",IF(進行表shinko!F19<180,\"×\",\"○\"))","v":"○"},{"$f":"IF(進行表shinko!F20=\"\",\"\",IF(進行表shinko!F20<180,\"×\",\"○\"))","v":""},{"$f":"COUNTIF(C13:I13,\"○\")","v":6},2,{"$f":"IF(進行表shinko!F21=\"\",\"\",IF(進行表shinko!F21<180,\"×\",\"○\"))","v":"○"},{"$f":"IF(進行表shinko!F22=\"\",\"\",IF(進行表shinko!F22<180,\"×\",\"○\"))","v":"×"},{"$f":"IF(進行表shinko!F23=\"\",\"\",IF(進行表shinko!F23<180,\"×\",\"○\"))","v":"×"},{"$f":"IF(進行表shinko!F24=\"\",\"\",IF(進行表shinko!F24<180,\"×\",\"○\"))","v":"○"},{"$f":"IF(進行表shinko!F25=\"\",\"\",IF(進行表shinko!F25<180,\"×\",\"○\"))","v":"○"},{"$f":"IF(進行表shinko!F26=\"\",\"\",IF(進行表shinko!F26<180,\"×\",\"○\"))","v":"○"},{"$f":"IF(進行表shinko!F27=\"\",\"\",IF(進行表shinko!F27<180,\"×\",\"○\"))","v":"○"},null,{"$f":"COUNTIF(M13:S13,\"○\")","v":5},3,{"$f":"IF(進行表shinko!F29=\"\",\"\",IF(進行表shinko!F29<180,\"×\",\"○\"))","v":"○"},{"$f":"IF(進行表shinko!F30=\"\",\"\",IF(進行表shinko!F30<180,\"×\",\"○\"))","v":"×"},{"$f":"IF(進行表shinko!F31=\"\",\"\",IF(進行表shinko!F31<180,\"×\",\"○\"))","v":"○"},{"$f":"IF(進行表shinko!F32=\"\",\"\",IF(進行表shinko!F32<180,\"×\",\"○\"))","v":"○"},{"$f":"IF(進行表shinko!F33=\"\",\"\",IF(進行表shinko!F33<180,\"×\",\"○\"))","v":"○"},{"$f":"IF(進行表shinko!F34=\"\",\"\",IF(進行表shinko!F34<180,\"×\",\"○\"))","v":"×"},{"$f":"IF(進行表shinko!F35=\"\",\"\",IF(進行表shinko!F35<180,\"×\",\"○\"))","v":"×"},null,{"$f":"COUNTIF(W13:AC13,\"○\")","v":4},4,{"$f":"IF(進行表shinko!F37=\"\",\"\",IF(進行表shinko!F37<180,\"×\",\"○\"))","v":"×"},{"$f":"IF(進行表shinko!F38=\"\",\"\",IF(進行表shinko!F38<180,\"×\",\"○\"))","v":"×"},{"$f":"IF(進行表shinko!F39=\"\",\"\",IF(進行表shinko!F39<180,\"×\",\"○\"))","v":"○"},{"$f":"IF(進行表shinko!F40=\"\",\"\",IF(進行表shinko!F40<180,\"×\",\"○\"))","v":"○"},{"$f":"IF(進行表shinko!F41=\"\",\"\",IF(進行表shinko!F41<180,\"×\",\"○\"))","v":"×"},{"$f":"IF(進行表shinko!F42=\"\",\"\",IF(進行表shinko!F42<180,\"×\",\"○\"))","v":"○"},{"$f":"IF(進行表shinko!F43=\"\",\"\",IF(進行表shinko!F43<180,\"×\",\"○\"))","v":"×"},null,{"$f":"COUNTIF(AG13:AM13,\"○\")","v":3}]
[null,null,{"$f":"IF(進行表shinko!G13=\"\",\"\",IF(進行表shinko!G13<180,\"×\",\"○\"))","v":"×"},{"$f":"IF(進行表shinko!G14=\"\",\"\",IF(進行表shinko!G14<180,\"×\",\"○\"))","v":"×"},{"$f":"IF(進行表shinko!G15=\"\",\"\",IF(進行表shinko!G15<180,\"×\",\"○\"))","v":"○"},{"$f":"IF(進行表shinko!G16=\"\",\"\",IF(進行表shinko!G16<180,\"×\",\"○\"))","v":"×"},{"$f":"IF(進行表shinko!G17=\"\",\"\",IF(進行表shinko!G17<180,\"×\",\"○\"))","v":"×"},{"$f":"IF(進行表shinko!G18=\"\",\"\",IF(進行表shinko!G18<180,\"×\",\"○\"))","v":"×"},{"$f":"IF(進行表shinko!G19=\"\",\"\",IF(進行表shinko!G19<180,\"×\",\"○\"))","v":"×"},{"$f":"IF(進行表shinko!G20=\"\",\"\",IF(進行表shinko!G20<180,\"×\",\"○\"))","v":""},{"$f":"COUNTIF(C14:I14,\"○\")","v":1},null,{"$f":"IF(進行表shinko!G21=\"\",\"\",IF(進行表shinko!G21<180,\"×\",\"○\"))","v":"×"},{"$f":"IF(進行表shinko!G22=\"\",\"\",IF(進行表shinko!G22<180,\"×\",\"○\"))","v":"○"},{"$f":"IF(進行表shinko!G23=\"\",\"\",IF(進行表shinko!G23<180,\"×\",\"○\"))","v":"○"},{"$f":"IF(進行表shinko!G24=\"\",\"\",IF(進行表shinko!G24<180,\"×\",\"○\"))","v":"×"},{"$f":"IF(進行表shinko!G25=\"\",\"\",IF(進行表shinko!G25<180,\"×\",\"○\"))","v":"×"},{"$f":"IF(進行表shinko!G26=\"\",\"\",IF(進行表shinko!G26<180,\"×\",\"○\"))","v":"×"},{"$f":"IF(進行表shinko!G27=\"\",\"\",IF(進行表shinko!G27<180,\"×\",\"○\"))","v":"×"},{"$f":"IF(進行表shinko!G28=\"\",\"\",IF(進行表shinko!G28<180,\"×\",\"○\"))","v":""},{"$f":"COUNTIF(M14:S14,\"○\")","v":2},null,{"$f":"IF(進行表shinko!G29=\"\",\"\",IF(進行表shinko!G29<180,\"×\",\"○\"))","v":"×"},{"$f":"IF(進行表shinko!G30=\"\",\"\",IF(進行表shinko!G30<180,\"×\",\"○\"))","v":"○"},{"$f":"IF(進行表shinko!G31=\"\",\"\",IF(進行表shinko!G31<180,\"×\",\"○\"))","v":"×"},{"$f":"IF(進行表shinko!G32=\"\",\"\",IF(進行表shinko!G32<180,\"×\",\"○\"))","v":"×"},{"$f":"IF(進行表shinko!G33=\"\",\"\",IF(進行表shinko!G33<180,\"×\",\"○\"))","v":"×"},{"$f":"IF(進行表shinko!G34=\"\",\"\",IF(進行表shinko!G34<180,\"×\",\"○\"))","v":"○"},{"$f":"IF(進行表shinko!G35=\"\",\"\",IF(進行表shinko!G35<180,\"×\",\"○\"))","v":"○"},null,{"$f":"COUNTIF(W14:AC14,\"○\")","v":3},null,{"$f":"IF(進行表shinko!G37=\"\",\"\",IF(進行表shinko!G37<180,\"×\",\"○\"))","v":"○"},{"$f":"IF(進行表shinko!G38=\"\",\"\",IF(進行表shinko!G38<180,\"×\",\"○\"))","v":"○"},{"$f":"IF(進行表shinko!G39=\"\",\"\",IF(進行表shinko!G39<180,\"×\",\"○\"))","v":"×"},{"$f":"IF(進行表shinko!G40=\"\",\"\",IF(進行表shinko!G40<180,\"×\",\"○\"))","v":"×"},{"$f":"IF(進行表shinko!G41=\"\",\"\",IF(進行表shinko!G41<180,\"×\",\"○\"))","v":"○"},{"$f":"IF(進行表shinko!G42=\"\",\"\",IF(進行表shinko!G42<180,\"×\",\"○\"))","v":"×"},{"$f":"IF(進行表shinko!G43=\"\",\"\",IF(進行表shinko!G43<180,\"×\",\"○\"))","v":"○"},{"$f":"IF(進行表shinko!G44=\"\",\"\",IF(進行表shinko!G44<180,\"×\",\"○\"))","v":""},{"$f":"COUNTIF(AG14:AM14,\"○\")","v":4}]
[null,null,{"$f":"IF(進行表shinko!I13=\"\",\"\",進行表shinko!I13)","v":"金澤茂昌"},{"$f":"IF(進行表shinko!I14=\"\",\"\",進行表shinko!I14)","v":"白戸玲人"},{"$f":"IF(進行表shinko!I15=\"\",\"\",進行表shinko!I15)","v":"吉向翔平"},{"$f":"IF(進行表shinko!I16=\"\",\"\",進行表shinko!I16)","v":"岩本剛"},{"$f":"IF(進行表shinko!I17=\"\",\"\",進行表shinko!I17)","v":"長谷川進"},{"$f":"IF(進行表shinko!I18=\"\",\"\",進行表shinko!I18)","v":"井本高史"},{"$f":"IF(進行表shinko!I19=\"\",\"\",進行表shinko!I19)","v":"宮野早織"},{"$f":"IF(進行表shinko!I20=\"\",\"\",進行表shinko!I20)","v":""},null,null,{"$f":"IF(進行表shinko!I21=\"\",\"\",進行表shinko!I21)","v":"白戸玲人"},{"$f":"IF(進行表shinko!I22=\"\",\"\",進行表shinko!I22)","v":"吉向翔平"},{"$f":"IF(進行表shinko!I23=\"\",\"\",進行表shinko!I23)","v":"岩本剛"},{"$f":"IF(進行表shinko!I24=\"\",\"\",進行表shinko!I24)","v":"長谷川進"},{"$f":"IF(進行表shinko!I25=\"\",\"\",進行表shinko!I25)","v":"井本高史"},{"$f":"IF(進行表shinko!I26=\"\",\"\",進行表shinko!I26)","v":"宮野早織"},{"$f":"IF(進行表shinko!I27=\"\",\"\",進行表shinko!I27)","v":"金澤茂昌"},{"$f":"IF(進行表shinko!I28=\"\",\"\",進行表shinko!I28)","v":""},{"$f":"IF(K14=\"\",\"\",K14+U14)","v":3},null,{"$f":"IF(進行表shinko!I29=\"\",\"\",進行表shinko!I29)","v":"吉向翔平"},{"$f":"IF(進行表shinko!I30=\"\",\"\",進行表shinko!I30)","v":"岩本剛"},{"$f":"IF(進行表shinko!I31=\"\",\"\",進行表shinko!I31)","v":"長谷川進"},{"$f":"IF(進行表shinko!I32=\"\",\"\",進行表shinko!I32)","v":"井本高史"},{"$f":"IF(進行表shinko!I33=\"\",\"\",進行表shinko!I33)","v":"宮野早織"},{"$f":"IF(進行表shinko!I34=\"\",\"\",進行表shinko!I34)","v":"金澤茂昌"},{"$f":"IF(進行表shinko!I35=\"\",\"\",進行表shinko!I35)","v":"白戸玲人"},{"$f":"IF(進行表shinko!I36=\"\",\"\",進行表shinko!I36)","v":""},{"$f":"IF(U14=\"\",\"\",U15+AE14)","v":6},null,{"$f":"IF(進行表shinko!I37=\"\",\"\",進行表shinko!I37)","v":"岩本剛"},{"$f":"IF(進行表shinko!I38=\"\",\"\",進行表shinko!I38)","v":"長谷川進"},{"$f":"IF(進行表shinko!I39=\"\",\"\",進行表shinko!I39)","v":"井本高史"},{"$f":"IF(進行表shinko!I40=\"\",\"\",進行表shinko!I40)","v":"宮野早織"},{"$f":"IF(進行表shinko!I41=\"\",\"\",進行表shinko!I41)","v":"金澤茂昌"},{"$f":"IF(進行表shinko!I42=\"\",\"\",進行表shinko!I42)","v":"白戸玲人"},{"$f":"IF(進行表shinko!I43=\"\",\"\",進行表shinko!I43)","v":"吉向翔平"},{"$f":"IF(進行表shinko!I44=\"\",\"\",進行表shinko!I44)","v":""},{"$f":"IF(AE14=\"\",\"\",AE15+AO14)","v":10}]
[]
[]
[]
[null,null,{"$f":"IF(AN9=\"\",AM9+1,AN9+1)","v":29},{"$f":"C19+1","v":30},31,32,33,34,35,{"$f":"IF(登録touroku!$C$28=\"\",\"\",成績表seiseki!I19+1)","v":""},null,null,{"$f":"IF(J19=\"\",I19+1,J19+1)","v":36},{"$f":"M19+1","v":37},38,39,40,41,42,{"$f":"IF(登録touroku!$C$28=\"\",\"\",成績表seiseki!S19+1)","v":""},null,null,{"$f":"IF(T19=\"\",S19+1,T19+1)","v":43},{"$f":"W19+1","v":44},45,46,47,48,49,{"$f":"IF(登録touroku!$C$28=\"\",\"\",成績表seiseki!AC19+1)","v":""},null,null,{"$f":"IF(AD19=\"\",\"\",AD19+1)","v":""},{"$f":"IF(AG19=\"\",\"\",AG19+1)","v":""},"","","","","",{"$f":"IF(登録touroku!$C$28=\"\",\"\",成績表seiseki!AM19+1)","v":""}]
[null,null,{"$f":"IF(進行表shinko!D45=\"\",\"\",進行表shinko!D45)","v":"今村哲也"},{"$f":"IF(進行表shinko!D46=\"\",\"\",進行表shinko!D46)","v":"金光隆男"},{"$f":"IF(進行表shinko!D47=\"\",\"\",進行表shinko!D47)","v":"田附裕次"},{"$f":"IF(進行表shinko!D48=\"\",\"\",進行表shinko!D48)","v":"吉田智直"},{"$f":"IF(進行表shinko!D49=\"\",\"\",進行表shinko!D49)","v":"小堀泰次郎"},{"$f":"IF(進行表shinko!D50=\"\",\"\",進行表shinko!D50)","v":"上倉淑敬"},{"$f":"IF(進行表shinko!D51=\"\",\"\",進行表shinko!D51)","v":"森田由佳里"},{"$f":"IF(進行表shinko!D52=\"\",\"\",進行表shinko!D52)","v":""},null,null,{"$f":"IF(進行表shinko!D53=\"\",\"\",進行表shinko!D53)","v":"今村哲也"},{"$f":"IF(進行表shinko!D54=\"\",\"\",進行表shinko!D54)","v":"金光隆男"},{"$f":"IF(進行表shinko!D55=\"\",\"\",進行表shinko!D55)","v":"田附裕次"},{"$f":"IF(進行表shinko!D56=\"\",\"\",進行表shinko!D56)","v":"吉田智直"},{"$f":"IF(進行表shinko!D57=\"\",\"\",進行表shinko!D57)","v":"小堀泰次郎"},{"$f":"IF(進行表shinko!D58=\"\",\"\",進行表shinko!D58)","v":"上倉淑敬"},{"$f":"IF(進行表shinko!D59=\"\",\"\",進行表shinko!D59)","v":"森田由佳里"},{"$f":"IF(進行表shinko!D60=\"\",\"\",進行表shinko!D60)","v":""},null,null,{"$f":"IF(進行表shinko!D61=\"\",\"\",進行表shinko!D61)","v":"今村哲也"},{"$f":"IF(進行表shinko!D62=\"\",\"\",進行表shinko!D62)","v":"金光隆男"},{"$f":"IF(進行表shinko!D63=\"\",\"\",進行表shinko!D63)","v":"田附裕次"},{"$f":"IF(進行表shinko!D64=\"\",\"\",進行表shinko!D64)","v":"吉田智直"},{"$f":"IF(進行表shinko!D65=\"\",\"\",進行表shinko!D65)","v":"小堀泰次郎"},{"$f":"IF(進行表shinko!D66=\"\",\"\",進行表shinko!D66)","v":"上倉淑敬"},{"$f":"IF(進行表shinko!D67=\"\",\"\",進行表shinko!D67)","v":"森田由佳里"},{"$f":"IF(進行表shinko!D68=\"\",\"\",進行表shinko!D68)","v":""},null,null,{"$f":"IF(進行表shinko!D69=\"\",\"\",進行表shinko!D69)","v":""},{"$f":"IF(進行表shinko!D70=\"\",\"\",進行表shinko!D70)","v":""},{"$f":"IF(進行表shinko!D71=\"\",\"\",進行表shinko!D71)","v":""},{"$f":"IF(進行表shinko!D72=\"\",\"\",進行表shinko!D72)","v":""},{"$f":"IF(進行表shinko!D73=\"\",\"\",進行表shinko!D73)","v":""},{"$f":"IF(進行表shinko!D74=\"\",\"\",進行表shinko!D74)","v":""},{"$f":"IF(進行表shinko!D75=\"\",\"\",進行表shinko!D75)","v":""},{"$f":"IF(進行表shinko!D76=\"\",\"\",進行表shinko!D76)","v":""}]
[]
[null,null,null,null,null,null,null,null,null,null,{"$f":"IF(K23=\"\",\"\",AO12+K23)","v":23},null,null,null,null,null,null,null,null,null,{"$f":"IF(U23=\"\",\"\",K22+U23)","v":26},null,null,null,null,null,null,null,null,null,{"$f":"IF(AE23=\"\",\"\",U22+AE23)","v":26},null,null,null,null,null,null,null,null,null,{"$f":"IF(AO23=\"\",\"\",AE22+AO23)","v":""}]
[null,5,{"$f":"IF(進行表shinko!F45=\"\",\"\",IF(進行表shinko!F45<180,\"×\",\"○\"))","v":"○"},{"$f":"IF(進行表shinko!F46=\"\",\"\",IF(進行表shinko!F46<180,\"×\",\"○\"))","v":"○"},{"$f":"IF(進行表shinko!F47=\"\",\"\",IF(進行表shinko!F47<180,\"×\",\"○\"))","v":"○"},{"$f":"IF(進行表shinko!F48=\"\",\"\",IF(進行表shinko!F48<180,\"×\",\"○\"))","v":"○"},{"$f":"IF(進行表shinko!F49=\"\",\"\",IF(進行表shinko!F49<180,\"×\",\"○\"))","v":"○"},{"$f":"IF(進行表shinko!F50=\"\",\"\",IF(進行表shinko!F50<180,\"×\",\"○\"))","v":"×"},{"$f":"IF(進行表shinko!F51=\"\",\"\",IF(進行表shinko!F51<180,\"×\",\"○\"))","v":"×"},{"$f":"IF(進行表shinko!F52=\"\",\"\",IF(進行表shinko!F52<180,\"×\",\"○\"))","v":""},{"$f":"COUNTIF(C23:I23,\"○\")","v":5},6,{"$f":"IF(進行表shinko!F53=\"\",\"\",IF(進行表shinko!F53<180,\"×\",\"○\"))","v":"○"},{"$f":"IF(進行表shinko!F54=\"\",\"\",IF(進行表shinko!F54<180,\"×\",\"○\"))","v":"×"},{"$f":"IF(進行表shinko!F55=\"\",\"\",IF(進行表shinko!F55<180,\"×\",\"○\"))","v":"×"},{"$f":"IF(進行表shinko!F56=\"\",\"\",IF(進行表shinko!F56<180,\"×\",\"○\"))","v":"×"},{"$f":"IF(進行表shinko!F57=\"\",\"\",IF(進行表shinko!F57<180,\"×\",\"○\"))","v":"○"},{"$f":"IF(進行表shinko!F58=\"\",\"\",IF(進行表shinko!F58<180,\"×\",\"○\"))","v":"×"},{"$f":"IF(進行表shinko!F59=\"\",\"\",IF(進行表shinko!F59<180,\"×\",\"○\"))","v":"○"},{"$f":"IF(進行表shinko!F60=\"\",\"\",IF(進行表shinko!F60<180,\"×\",\"○\"))","v":""},{"$f":"COUNTIF(M23:S23,\"○\")","v":3},7,{"$f":"IF(進行表shinko!F61=\"\",\"\",IF(進行表shinko!F61<180,\"×\",\"○\"))","v":""},{"$f":"IF(進行表shinko!F62=\"\",\"\",IF(進行表shinko!F62<180,\"×\",\"○\"))","v":""},{"$f":"IF(進行表shinko!F63=\"\",\"\",IF(進行表shinko!F63<180,\"×\",\"○\"))","v":""},{"$f":"IF(進行表shinko!F64=\"\",\"\",IF(進行表shinko!F64<180,\"×\",\"○\"))","v":""},{"$f":"IF(進行表shinko!F65=\"\",\"\",IF(進行表shinko!F65<180,\"×\",\"○\"))","v":""},{"$f":"IF(進行表shinko!F66=\"\",\"\",IF(進行表shinko!F66<180,\"×\",\"○\"))","v":""},{"$f":"IF(進行表shinko!F67=\"\",\"\",IF(進行表shinko!F67<180,\"×\",\"○\"))","v":""},{"$f":"IF(進行表shinko!F68=\"\",\"\",IF(進行表shinko!F68<180,\"×\",\"○\"))","v":""},{"$f":"COUNTIF(W23:AC23,\"○\")","v":0},8,{"$f":"IF(進行表shinko!F69=\"\",\"\",IF(進行表shinko!F69<180,\"×\",\"○\"))","v":""},{"$f":"IF(進行表shinko!F70=\"\",\"\",IF(進行表shinko!F70<180,\"×\",\"○\"))","v":""},{"$f":"IF(進行表shinko!F71=\"\",\"\",IF(進行表shinko!F71<180,\"×\",\"○\"))","v":""},{"$f":"IF(進行表shinko!F72=\"\",\"\",IF(進行表shinko!F72<180,\"×\",\"○\"))","v":""},{"$f":"IF(進行表shinko!F73=\"\",\"\",IF(進行表shinko!F73<180,\"×\",\"○\"))","v":""},{"$f":"IF(進行表shinko!F74=\"\",\"\",IF(進行表shinko!F74<180,\"×\",\"○\"))","v":""},{"$f":"IF(進行表shinko!F75=\"\",\"\",IF(進行表shinko!F75<180,\"×\",\"○\"))","v":""},{"$f":"IF(進行表shinko!F76=\"\",\"\",IF(進行表shinko!F76<180,\"×\",\"○\"))","v":""},{"$f":"IF(COUNTA(AG23:AN23)=8,\"\",COUNTIF(AG23:AN23,\"○\"))","v":""}]
[null,null,{"$f":"IF(進行表shinko!G45=\"\",\"\",IF(進行表shinko!G45<180,\"×\",\"○\"))","v":"×"},{"$f":"IF(進行表shinko!G46=\"\",\"\",IF(進行表shinko!G46<180,\"×\",\"○\"))","v":"×"},{"$f":"IF(進行表shinko!G47=\"\",\"\",IF(進行表shinko!G47<180,\"×\",\"○\"))","v":"×"},{"$f":"IF(進行表shinko!G48=\"\",\"\",IF(進行表shinko!G48<180,\"×\",\"○\"))","v":"×"},{"$f":"IF(進行表shinko!G49=\"\",\"\",IF(進行表shinko!G49<180,\"×\",\"○\"))","v":"×"},{"$f":"IF(進行表shinko!G50=\"\",\"\",IF(進行表shinko!G50<180,\"×\",\"○\"))","v":"○"},{"$f":"IF(進行表shinko!G51=\"\",\"\",IF(進行表shinko!G51<180,\"×\",\"○\"))","v":"○"},{"$f":"IF(進行表shinko!G52=\"\",\"\",IF(進行表shinko!G52<180,\"×\",\"○\"))","v":""},{"$f":"COUNTIF(C24:I24,\"○\")","v":2},null,{"$f":"IF(進行表shinko!G53=\"\",\"\",IF(進行表shinko!G53<180,\"×\",\"○\"))","v":"×"},{"$f":"IF(進行表shinko!G54=\"\",\"\",IF(進行表shinko!G54<180,\"×\",\"○\"))","v":"○"},{"$f":"IF(進行表shinko!G55=\"\",\"\",IF(進行表shinko!G55<180,\"×\",\"○\"))","v":"○"},{"$f":"IF(進行表shinko!G56=\"\",\"\",IF(進行表shinko!G56<180,\"×\",\"○\"))","v":"○"},{"$f":"IF(進行表shinko!G57=\"\",\"\",IF(進行表shinko!G57<180,\"×\",\"○\"))","v":"×"},{"$f":"IF(進行表shinko!G58=\"\",\"\",IF(進行表shinko!G58<180,\"×\",\"○\"))","v":"○"},{"$f":"IF(進行表shinko!G59=\"\",\"\",IF(進行表shinko!G59<180,\"×\",\"○\"))","v":"×"},{"$f":"IF(進行表shinko!G60=\"\",\"\",IF(進行表shinko!G60<180,\"×\",\"○\"))","v":""},{"$f":"COUNTIF(M24:S24,\"○\")","v":4},null,{"$f":"IF(進行表shinko!G61=\"\",\"\",IF(進行表shinko!G61<180,\"×\",\"○\"))","v":""},{"$f":"IF(進行表shinko!G62=\"\",\"\",IF(進行表shinko!G62<180,\"×\",\"○\"))","v":""},{"$f":"IF(進行表shinko!G63=\"\",\"\",IF(進行表shinko!G63<180,\"×\",\"○\"))","v":""},{"$f":"IF(進行表shinko!G64=\"\",\"\",IF(進行表shinko!G64<180,\"×\",\"○\"))","v":""},{"$f":"IF(進行表shinko!G65=\"\",\"\",IF(進行表shinko!G65<180,\"×\",\"○\"))","v":""},{"$f":"IF(進行表shinko!G66=\"\",\"\",IF(進行表shinko!G66<180,\"×\",\"○\"))","v":""},{"$f":"IF(進行表shinko!G67=\"\",\"\",IF(進行表shinko!G67<180,\"×\",\"○\"))","v":""},{"$f":"IF(進行表shinko!G68=\"\",\"\",IF(進行表shinko!G68<180,\"×\",\"○\"))","v":""},{"$f":"COUNTIF(W24:AC24,\"○\")","v":0},null,{"$f":"IF(進行表shinko!G69=\"\",\"\",IF(進行表shinko!G69<180,\"×\",\"○\"))","v":""},{"$f":"IF(進行表shinko!G70=\"\",\"\",IF(進行表shinko!G70<180,\"×\",\"○\"))","v":""},{"$f":"IF(進行表shinko!G71=\"\",\"\",IF(進行表shinko!G71<180,\"×\",\"○\"))","v":""},{"$f":"IF(進行表shinko!G72=\"\",\"\",IF(進行表shinko!G72<180,\"×\",\"○\"))","v":""},{"$f":"IF(進行表shinko!G73=\"\",\"\",IF(進行表shinko!G73<180,\"×\",\"○\"))","v":""},{"$f":"IF(進行表shinko!G74=\"\",\"\",IF(進行表shinko!G74<180,\"×\",\"○\"))","v":""},{"$f":"IF(進行表shinko!G75=\"\",\"\",IF(進行表shinko!G75<180,\"×\",\"○\"))","v":""},{"$f":"IF(進行表shinko!G76=\"\",\"\",IF(進行表shinko!G76<180,\"×\",\"○\"))","v":""},{"$f":"IF(COUNTA(AG24:AN24)=8,\"\",COUNTIF(AG24:AN24,\"○\"))","v":""}]
[null,null,{"$f":"IF(進行表shinko!I45=\"\",\"\",進行表shinko!I45)","v":"長谷川進"},{"$f":"IF(進行表shinko!I46=\"\",\"\",進行表shinko!I46)","v":"井本高史"},{"$f":"IF(進行表shinko!I47=\"\",\"\",進行表shinko!I47)","v":"宮野早織"},{"$f":"IF(進行表shinko!I48=\"\",\"\",進行表shinko!I48)","v":"金澤茂昌"},{"$f":"IF(進行表shinko!I49=\"\",\"\",進行表shinko!I49)","v":"白戸玲人"},{"$f":"IF(進行表shinko!I50=\"\",\"\",進行表shinko!I50)","v":"吉向翔平"},{"$f":"IF(進行表shinko!I51=\"\",\"\",進行表shinko!I51)","v":"岩本剛"},{"$f":"IF(進行表shinko!I52=\"\",\"\",進行表shinko!I52)","v":""},{"$f":"IF(K24=\"\",\"\",AO15+K24)","v":12},null,{"$f":"IF(進行表shinko!I53=\"\",\"\",進行表shinko!I53)","v":"井本高史"},{"$f":"IF(進行表shinko!I54=\"\",\"\",進行表shinko!I54)","v":"宮野早織"},{"$f":"IF(進行表shinko!I55=\"\",\"\",進行表shinko!I55)","v":"金澤茂昌"},{"$f":"IF(進行表shinko!I56=\"\",\"\",進行表shinko!I56)","v":"白戸玲人"},{"$f":"IF(進行表shinko!I57=\"\",\"\",進行表shinko!I57)","v":"吉向翔平"},{"$f":"IF(進行表shinko!I58=\"\",\"\",進行表shinko!I58)","v":"岩本剛"},{"$f":"IF(進行表shinko!I59=\"\",\"\",進行表shinko!I59)","v":"長谷川進"},{"$f":"IF(進行表shinko!I60=\"\",\"\",進行表shinko!I60)","v":""},{"$f":"IF(U24=\"\",\"\",K25+U24)","v":16},null,{"$f":"IF(進行表shinko!I61=\"\",\"\",進行表shinko!I61)","v":"宮野早織"},{"$f":"IF(進行表shinko!I62=\"\",\"\",進行表shinko!I62)","v":"金澤茂昌"},{"$f":"IF(進行表shinko!I63=\"\",\"\",進行表shinko!I63)","v":"白戸玲人"},{"$f":"IF(進行表shinko!I64=\"\",\"\",進行表shinko!I64)","v":"吉向翔平"},{"$f":"IF(進行表shinko!I65=\"\",\"\",進行表shinko!I65)","v":"岩本剛"},{"$f":"IF(進行表shinko!I66=\"\",\"\",進行表shinko!I66)","v":"長谷川進"},{"$f":"IF(進行表shinko!I67=\"\",\"\",進行表shinko!I67)","v":"井本高史"},{"$f":"IF(進行表shinko!I68=\"\",\"\",進行表shinko!I68)","v":""},{"$f":"IF(AE24=\"\",\"\",U25+AE24)","v":16},null,{"$f":"IF(進行表shinko!I69=\"\",\"\",進行表shinko!I69)","v":""},{"$f":"IF(進行表shinko!I70=\"\",\"\",進行表shinko!I70)","v":""},{"$f":"IF(進行表shinko!I71=\"\",\"\",進行表shinko!I71)","v":""},{"$f":"IF(進行表shinko!I72=\"\",\"\",進行表shinko!I72)","v":""},{"$f":"IF(進行表shinko!I73=\"\",\"\",進行表shinko!I73)","v":""},{"$f":"IF(進行表shinko!I74=\"\",\"\",進行表shinko!I74)","v":""},{"$f":"IF(進行表shinko!I75=\"\",\"\",進行表shinko!I75)","v":""},{"$f":"IF(進行表shinko!I76=\"\",\"\",進行表shinko!I76)","v":""},{"$f":"IF(AO24=\"\",\"\",AE25+AO24)","v":""}]
[]
[]
[]
[null,{"$f":"登録touroku!C20","v":"京都"},null,"HR",null,{"$f":"登録touroku!E20","v":"奈良"},null,null,null,null,null,1,2,3,4,5,6,7,8,"total point",null,null,{"$f":"T41*180+V41","v":6070.1428571428569},null,null,null,null,null,1,2,3,4,5,6,7,8,"total point",null,null,{"$f":"AK41*180+AM41","v":5204.4285714285716}]
[null,"選手名",null,"点","選手名",null,"点",null,null,null,null,{"$f":"登録touroku!E21","v":"金澤茂昌"},{"$f":"登録touroku!E22","v":"白戸玲人"},{"$f":"登録touroku!E23","v":"吉向翔平"},{"$f":"登録touroku!E24","v":"岩本剛"},{"$f":"登録touroku!E25","v":"長谷川進"},{"$f":"登録touroku!E26","v":"井本高史"},{"$f":"登録touroku!E27","v":"宮野早織"},{"$f":"IF(登録touroku!E28=\"\",\"\",登録touroku!E28)","v":""},"W","L","負点","失点","R",null,null,null,null,{"$f":"I33","v":"今村哲也"},{"$f":"I34","v":"金光隆男"},{"$f":"I35","v":"田附裕次"},{"$f":"I36","v":"吉田智直"},{"$f":"I37","v":"小堀泰次郎"},{"$f":"I38","v":"上倉淑敬"},{"$f":"I39","v":"森田由佳里"},{"$f":"I40","v":""},"W","L","負点","失点","R"]
[]
[]
[{"$f":"T33*100000-U33*10000+V33-W33","v":490083},null,null,null,null,null,null,1,{"$f":"登録touroku!C21","v":"今村哲也"},null,null,{"$f":"IF(VLOOKUP($I33&L$30,進行表shinko!$C$13:$H$76,4,FALSE)=\"\",\"\",VLOOKUP($I33&L$30,進行表shinko!$C$13:$H$76,4,FALSE))","v":"w"},{"$f":"IF(VLOOKUP($I33&M$30,進行表shinko!$C$13:$H$76,4,FALSE)=\"\",\"\",VLOOKUP($I33&M$30,進行表shinko!$C$13:$H$76,4,FALSE))","v":"w"},{"$f":"IF(VLOOKUP($I33&N$30,進行表shinko!$C$13:$H$76,4,FALSE)=\"\",\"\",VLOOKUP($I33&N$30,進行表shinko!$C$13:$H$76,4,FALSE))","v":"w"},{"$f":"IF(VLOOKUP($I33&O$30,進行表shinko!$C$13:$H$76,4,FALSE)=\"\",\"\",VLOOKUP($I33&O$30,進行表shinko!$C$13:$H$76,4,FALSE))","v":83},{"$f":"IF(VLOOKUP($I33&P$30,進行表shinko!$C$13:$H$76,4,FALSE)=\"\",\"\",VLOOKUP($I33&P$30,進行表shinko!$C$13:$H$76,4,FALSE))","v":"w"},{"$f":"IF(VLOOKUP($I33&Q$30,進行表shinko!$C$13:$H$76,4,FALSE)=\"\",\"\",VLOOKUP($I33&Q$30,進行表shinko!$C$13:$H$76,4,FALSE))","v":"w"},{"$f":"IF(VLOOKUP($I33&R$30,進行表shinko!$C$13:$H$76,4,FALSE)=\"\",\"\",VLOOKUP($I33&R$30,進行表shinko!$C$13:$H$76,4,FALSE))","v":""},{"$f":"IF(S$30=\"\",\"\",IF(VLOOKUP($I33&S$30,進行表shinko!$C$13:$H$76,4,FALSE)=\"\",\"\",VLOOKUP($I33&S$30,進行表shinko!$C$13:$H$76,4,FALSE)))","v":""},{"$f":"COUNTIF(L33:S33,\"W\")","v":5},{"$f":"COUNTIF(L33:S33,\"<180\")","v":1},{"$f":"SUM(L33:S33)/登録touroku!D21*登録touroku!$C$17","v":83},null,{"$f":"RANK(A$33:A$40,A$33:A$40)","v":3},1,{"$f":"登録touroku!E21","v":"金澤茂昌"},null,null,{"$f":"IF(VLOOKUP(AC$30&$Z33,進行表shinko!$C$13:$H$76,5,FALSE)=\"\",\"\",VLOOKUP(AC$30&$Z33,進行表shinko!$C$13:$H$76,5,FALSE))","v":69},{"$f":"IF(VLOOKUP(AD$30&$Z33,進行表shinko!$C$13:$H$76,5,FALSE)=\"\",\"\",VLOOKUP(AD$30&$Z33,進行表shinko!$C$13:$H$76,5,FALSE))","v":""},{"$f":"IF(VLOOKUP(AE$30&$Z33,進行表shinko!$C$13:$H$76,5,FALSE)=\"\",\"\",VLOOKUP(AE$30&$Z33,進行表shinko!$C$13:$H$76,5,FALSE))","v":"w"},{"$f":"IF(VLOOKUP(AF$30&$Z33,進行表shinko!$C$13:$H$76,5,FALSE)=\"\",\"\",VLOOKUP(AF$30&$Z33,進行表shinko!$C$13:$H$76,5,FALSE))","v":15},{"$f":"IF(VLOOKUP(AG$30&$Z33,進行表shinko!$C$13:$H$76,5,FALSE)=\"\",\"\",VLOOKUP(AG$30&$Z33,進行表shinko!$C$13:$H$76,5,FALSE))","v":"w"},{"$f":"IF(VLOOKUP(AH$30&$Z33,進行表shinko!$C$13:$H$76,5,FALSE)=\"\",\"\",VLOOKUP(AH$30&$Z33,進行表shinko!$C$13:$H$76,5,FALSE))","v":"w"},{"$f":"IF(VLOOKUP(AI$30&$Z33,進行表shinko!$C$13:$H$76,5,FALSE)=\"\",\"\",VLOOKUP(AI$30&$Z33,進行表shinko!$C$13:$H$76,5,FALSE))","v":164},{"$f":"IF(AJ$30=\"\",\"\",IF(VLOOKUP(I$33&$AJ30,進行表shinko!$C$13:$H$76,5,FALSE)=\"\",\"\",VLOOKUP(I$33&$AJ30,進行表shinko!$C$13:$H$76,5,FALSE)))","v":""},{"$f":"COUNTIF(AC33:AJ33,\"W\")","v":3},{"$f":"COUNTIF(AC33:AJ33,\"<180\")","v":3},{"$f":"SUM(AC33:AJ33)/登録touroku!F21*登録touroku!$C$17","v":248},null,{"$f":"RANK(AP$33:AP$40,AP$33:AP$40)","v":3},{"$f":"AK33*100000-AL33*10000+AM33-AN33","v":270248}]
[160424,null,null,null,null,null,null,2,{"$f":"登録touroku!C22","v":"金光隆男"},null,null,{"$f":"IF(VLOOKUP($I34&L$30,進行表shinko!$C$13:$H$76,4,FALSE)=\"\",\"\",VLOOKUP($I34&L$30,進行表shinko!$C$13:$H$76,4,FALSE))","v":""},{"$f":"IF(VLOOKUP($I34&M$30,進行表shinko!$C$13:$H$76,4,FALSE)=\"\",\"\",VLOOKUP($I34&M$30,進行表shinko!$C$13:$H$76,4,FALSE))","v":"w"},{"$f":"IF(VLOOKUP($I34&N$30,進行表shinko!$C$13:$H$76,4,FALSE)=\"\",\"\",VLOOKUP($I34&N$30,進行表shinko!$C$13:$H$76,4,FALSE))","v":95},{"$f":"IF(VLOOKUP($I34&O$30,進行表shinko!$C$13:$H$76,4,FALSE)=\"\",\"\",VLOOKUP($I34&O$30,進行表shinko!$C$13:$H$76,4,FALSE))","v":47},{"$f":"IF(VLOOKUP($I34&P$30,進行表shinko!$C$13:$H$76,4,FALSE)=\"\",\"\",VLOOKUP($I34&P$30,進行表shinko!$C$13:$H$76,4,FALSE))","v":176},{"$f":"IF(VLOOKUP($I34&Q$30,進行表shinko!$C$13:$H$76,4,FALSE)=\"\",\"\",VLOOKUP($I34&Q$30,進行表shinko!$C$13:$H$76,4,FALSE))","v":"w"},{"$f":"IF(VLOOKUP($I34&R$30,進行表shinko!$C$13:$H$76,4,FALSE)=\"\",\"\",VLOOKUP($I34&R$30,進行表shinko!$C$13:$H$76,4,FALSE))","v":106},{"$f":"IF(S$30=\"\",\"\",IF(VLOOKUP($I34&S$30,進行表shinko!$C$13:$H$76,4,FALSE)=\"\",\"\",VLOOKUP($I34&S$30,進行表shinko!$C$13:$H$76,4,FALSE)))","v":""},{"$f":"COUNTIF(L34:S34,\"W\")","v":2},{"$f":"COUNTIF(L34:S34,\"<180\")","v":4},{"$f":"SUM(L34:S34)/登録touroku!D22*登録touroku!$C$17","v":424},null,7,2,{"$f":"登録touroku!E22","v":"白戸玲人"},null,null,{"$f":"IF(VLOOKUP(AC$30&$Z34,進行表shinko!$C$13:$H$76,5,FALSE)=\"\",\"\",VLOOKUP(AC$30&$Z34,進行表shinko!$C$13:$H$76,5,FALSE))","v":62},{"$f":"IF(VLOOKUP(AD$30&$Z34,進行表shinko!$C$13:$H$76,5,FALSE)=\"\",\"\",VLOOKUP(AD$30&$Z34,進行表shinko!$C$13:$H$76,5,FALSE))","v":60},{"$f":"IF(VLOOKUP(AE$30&$Z34,進行表shinko!$C$13:$H$76,5,FALSE)=\"\",\"\",VLOOKUP(AE$30&$Z34,進行表shinko!$C$13:$H$76,5,FALSE))","v":""},{"$f":"IF(VLOOKUP(AF$30&$Z34,進行表shinko!$C$13:$H$76,5,FALSE)=\"\",\"\",VLOOKUP(AF$30&$Z34,進行表shinko!$C$13:$H$76,5,FALSE))","v":"w"},{"$f":"IF(VLOOKUP(AG$30&$Z34,進行表shinko!$C$13:$H$76,5,FALSE)=\"\",\"\",VLOOKUP(AG$30&$Z34,進行表shinko!$C$13:$H$76,5,FALSE))","v":158},{"$f":"IF(VLOOKUP(AH$30&$Z34,進行表shinko!$C$13:$H$76,5,FALSE)=\"\",\"\",VLOOKUP(AH$30&$Z34,進行表shinko!$C$13:$H$76,5,FALSE))","v":50},{"$f":"IF(VLOOKUP(AI$30&$Z34,進行表shinko!$C$13:$H$76,5,FALSE)=\"\",\"\",VLOOKUP(AI$30&$Z34,進行表shinko!$C$13:$H$76,5,FALSE))","v":"w"},{"$f":"IF(AJ$30=\"\",\"\",IF(VLOOKUP(I$33&$AJ31,進行表shinko!$C$13:$H$76,5,FALSE)=\"\",\"\",VLOOKUP(I$33&$AJ31,進行表shinko!$C$13:$H$76,5,FALSE)))","v":""},{"$f":"COUNTIF(AC34:AJ34,\"W\")","v":2},{"$f":"COUNTIF(AC34:AJ34,\"<180\")","v":4},{"$f":"SUM(AC34:AJ34)/登録touroku!F22*登録touroku!$C$17","v":330},null,4,{"$f":"AK34*100000-AL34*10000+AM34-AN34","v":160330}]
[270255,null,null,null,null,null,null,3,{"$f":"登録touroku!C23","v":"田附裕次"},null,null,{"$f":"IF(VLOOKUP($I35&L$30,進行表shinko!$C$13:$H$76,4,FALSE)=\"\",\"\",VLOOKUP($I35&L$30,進行表shinko!$C$13:$H$76,4,FALSE))","v":101},{"$f":"IF(VLOOKUP($I35&M$30,進行表shinko!$C$13:$H$76,4,FALSE)=\"\",\"\",VLOOKUP($I35&M$30,進行表shinko!$C$13:$H$76,4,FALSE))","v":""},{"$f":"IF(VLOOKUP($I35&N$30,進行表shinko!$C$13:$H$76,4,FALSE)=\"\",\"\",VLOOKUP($I35&N$30,進行表shinko!$C$13:$H$76,4,FALSE))","v":122},{"$f":"IF(VLOOKUP($I35&O$30,進行表shinko!$C$13:$H$76,4,FALSE)=\"\",\"\",VLOOKUP($I35&O$30,進行表shinko!$C$13:$H$76,4,FALSE))","v":32},{"$f":"IF(VLOOKUP($I35&P$30,進行表shinko!$C$13:$H$76,4,FALSE)=\"\",\"\",VLOOKUP($I35&P$30,進行表shinko!$C$13:$H$76,4,FALSE))","v":"w"},{"$f":"IF(VLOOKUP($I35&Q$30,進行表shinko!$C$13:$H$76,4,FALSE)=\"\",\"\",VLOOKUP($I35&Q$30,進行表shinko!$C$13:$H$76,4,FALSE))","v":"w"},{"$f":"IF(VLOOKUP($I35&R$30,進行表shinko!$C$13:$H$76,4,FALSE)=\"\",\"\",VLOOKUP($I35&R$30,進行表shinko!$C$13:$H$76,4,FALSE))","v":"w"},{"$f":"IF(S$30=\"\",\"\",IF(VLOOKUP($I35&S$30,進行表shinko!$C$13:$H$76,4,FALSE)=\"\",\"\",VLOOKUP($I35&S$30,進行表shinko!$C$13:$H$76,4,FALSE)))","v":""},{"$f":"COUNTIF(L35:S35,\"W\")","v":3},3,{"$f":"SUM(L35:S35)/登録touroku!D23*登録touroku!$C$17","v":255},null,4,3,{"$f":"登録touroku!E23","v":"吉向翔平"},null,null,{"$f":"IF(VLOOKUP(AC$30&$Z35,進行表shinko!$C$13:$H$76,5,FALSE)=\"\",\"\",VLOOKUP(AC$30&$Z35,進行表shinko!$C$13:$H$76,5,FALSE))","v":122},{"$f":"IF(VLOOKUP(AD$30&$Z35,進行表shinko!$C$13:$H$76,5,FALSE)=\"\",\"\",VLOOKUP(AD$30&$Z35,進行表shinko!$C$13:$H$76,5,FALSE))","v":"w"},{"$f":"IF(VLOOKUP(AE$30&$Z35,進行表shinko!$C$13:$H$76,5,FALSE)=\"\",\"\",VLOOKUP(AE$30&$Z35,進行表shinko!$C$13:$H$76,5,FALSE))","v":"w"},{"$f":"IF(VLOOKUP(AF$30&$Z35,進行表shinko!$C$13:$H$76,5,FALSE)=\"\",\"\",VLOOKUP(AF$30&$Z35,進行表shinko!$C$13:$H$76,5,FALSE))","v":""},{"$f":"IF(VLOOKUP(AG$30&$Z35,進行表shinko!$C$13:$H$76,5,FALSE)=\"\",\"\",VLOOKUP(AG$30&$Z35,進行表shinko!$C$13:$H$76,5,FALSE))","v":140},{"$f":"IF(VLOOKUP(AH$30&$Z35,進行表shinko!$C$13:$H$76,5,FALSE)=\"\",\"\",VLOOKUP(AH$30&$Z35,進行表shinko!$C$13:$H$76,5,FALSE))","v":"w"},{"$f":"IF(VLOOKUP(AI$30&$Z35,進行表shinko!$C$13:$H$76,5,FALSE)=\"\",\"\",VLOOKUP(AI$30&$Z35,進行表shinko!$C$13:$H$76,5,FALSE))","v":"w"},{"$f":"IF(AJ$30=\"\",\"\",IF(VLOOKUP(I$33&$AJ32,進行表shinko!$C$13:$H$76,5,FALSE)=\"\",\"\",VLOOKUP(I$33&$AJ32,進行表shinko!$C$13:$H$76,5,FALSE)))","v":""},{"$f":"COUNTIF(AC35:AJ35,\"W\")","v":4},2,{"$f":"SUM(AC35:AJ35)/登録touroku!F23*登録touroku!$C$17","v":262},null,2,380262]
[490097,null,null,null,null,null,null,4,{"$f":"登録touroku!C24","v":"吉田智直"},null,null,{"$f":"IF(VLOOKUP($I36&L$30,進行表shinko!$C$13:$H$76,4,FALSE)=\"\",\"\",VLOOKUP($I36&L$30,進行表shinko!$C$13:$H$76,4,FALSE))","v":"w"},{"$f":"IF(VLOOKUP($I36&M$30,進行表shinko!$C$13:$H$76,4,FALSE)=\"\",\"\",VLOOKUP($I36&M$30,進行表shinko!$C$13:$H$76,4,FALSE))","v":97},{"$f":"IF(VLOOKUP($I36&N$30,進行表shinko!$C$13:$H$76,4,FALSE)=\"\",\"\",VLOOKUP($I36&N$30,進行表shinko!$C$13:$H$76,4,FALSE))","v":""},{"$f":"IF(VLOOKUP($I36&O$30,進行表shinko!$C$13:$H$76,4,FALSE)=\"\",\"\",VLOOKUP($I36&O$30,進行表shinko!$C$13:$H$76,4,FALSE))","v":"w"},{"$f":"IF(VLOOKUP($I36&P$30,進行表shinko!$C$13:$H$76,4,FALSE)=\"\",\"\",VLOOKUP($I36&P$30,進行表shinko!$C$13:$H$76,4,FALSE))","v":"w"},{"$f":"IF(VLOOKUP($I36&Q$30,進行表shinko!$C$13:$H$76,4,FALSE)=\"\",\"\",VLOOKUP($I36&Q$30,進行表shinko!$C$13:$H$76,4,FALSE))","v":"w"},{"$f":"IF(VLOOKUP($I36&R$30,進行表shinko!$C$13:$H$76,4,FALSE)=\"\",\"\",VLOOKUP($I36&R$30,進行表shinko!$C$13:$H$76,4,FALSE))","v":"w"},{"$f":"IF(S$30=\"\",\"\",IF(VLOOKUP($I36&S$30,進行表shinko!$C$13:$H$76,4,FALSE)=\"\",\"\",VLOOKUP($I36&S$30,進行表shinko!$C$13:$H$76,4,FALSE)))","v":""},5,1,{"$f":"SUM(L36:S36)/登録touroku!D24*登録touroku!$C$17","v":97},null,2,4,{"$f":"登録touroku!E24","v":"岩本剛"},null,null,{"$f":"IF(VLOOKUP(AC$30&$Z36,進行表shinko!$C$13:$H$76,5,FALSE)=\"\",\"\",VLOOKUP(AC$30&$Z36,進行表shinko!$C$13:$H$76,5,FALSE))","v":"w"},{"$f":"IF(VLOOKUP(AD$30&$Z36,進行表shinko!$C$13:$H$76,5,FALSE)=\"\",\"\",VLOOKUP(AD$30&$Z36,進行表shinko!$C$13:$H$76,5,FALSE))","v":"w"},{"$f":"IF(VLOOKUP(AE$30&$Z36,進行表shinko!$C$13:$H$76,5,FALSE)=\"\",\"\",VLOOKUP(AE$30&$Z36,進行表shinko!$C$13:$H$76,5,FALSE))","v":"w"},{"$f":"IF(VLOOKUP(AF$30&$Z36,進行表shinko!$C$13:$H$76,5,FALSE)=\"\",\"\",VLOOKUP(AF$30&$Z36,進行表shinko!$C$13:$H$76,5,FALSE))","v":45},{"$f":"IF(VLOOKUP(AG$30&$Z36,進行表shinko!$C$13:$H$76,5,FALSE)=\"\",\"\",VLOOKUP(AG$30&$Z36,進行表shinko!$C$13:$H$76,5,FALSE))","v":""},{"$f":"IF(VLOOKUP(AH$30&$Z36,進行表shinko!$C$13:$H$76,5,FALSE)=\"\",\"\",VLOOKUP(AH$30&$Z36,進行表shinko!$C$13:$H$76,5,FALSE))","v":"w"},{"$f":"IF(VLOOKUP(AI$30&$Z36,進行表shinko!$C$13:$H$76,5,FALSE)=\"\",\"\",VLOOKUP(AI$30&$Z36,進行表shinko!$C$13:$H$76,5,FALSE))","v":"w"},{"$f":"IF(AJ$30=\"\",\"\",IF(VLOOKUP(I$33&$AJ33,進行表shinko!$C$13:$H$76,5,FALSE)=\"\",\"\",VLOOKUP(I$33&$AJ33,進行表shinko!$C$13:$H$76,5,FALSE)))","v":""},5,1,{"$f":"SUM(AC36:AJ36)/登録touroku!F24*登録touroku!$C$17","v":45},null,1,490045]
[490119,null,null,null,null,null,null,5,{"$f":"登録touroku!C25","v":"小堀泰次郎"},null,null,{"$f":"IF(VLOOKUP($I37&L$30,進行表shinko!$C$13:$H$76,4,FALSE)=\"\",\"\",VLOOKUP($I37&L$30,進行表shinko!$C$13:$H$76,4,FALSE))","v":119},{"$f":"IF(VLOOKUP($I37&M$30,進行表shinko!$C$13:$H$76,4,FALSE)=\"\",\"\",VLOOKUP($I37&M$30,進行表shinko!$C$13:$H$76,4,FALSE))","v":"w"},{"$f":"IF(VLOOKUP($I37&N$30,進行表shinko!$C$13:$H$76,4,FALSE)=\"\",\"\",VLOOKUP($I37&N$30,進行表shinko!$C$13:$H$76,4,FALSE))","v":"w"},{"$f":"IF(VLOOKUP($I37&O$30,進行表shinko!$C$13:$H$76,4,FALSE)=\"\",\"\",VLOOKUP($I37&O$30,進行表shinko!$C$13:$H$76,4,FALSE))","v":""},{"$f":"IF(VLOOKUP($I37&P$30,進行表shinko!$C$13:$H$76,4,FALSE)=\"\",\"\",VLOOKUP($I37&P$30,進行表shinko!$C$13:$H$76,4,FALSE))","v":"w"},{"$f":"IF(VLOOKUP($I37&Q$30,進行表shinko!$C$13:$H$76,4,FALSE)=\"\",\"\",VLOOKUP($I37&Q$30,進行表shinko!$C$13:$H$76,4,FALSE))","v":"w"},{"$f":"IF(VLOOKUP($I37&R$30,進行表shinko!$C$13:$H$76,4,FALSE)=\"\",\"\",VLOOKUP($I37&R$30,進行表shinko!$C$13:$H$76,4,FALSE))","v":"w"},{"$f":"IF(S$30=\"\",\"\",IF(VLOOKUP($I37&S$30,進行表shinko!$C$13:$H$76,4,FALSE)=\"\",\"\",VLOOKUP($I37&S$30,進行表shinko!$C$13:$H$76,4,FALSE)))","v":""},5,1,{"$f":"SUM(L37:S37)/登録touroku!D25*登録touroku!$C$17","v":119},null,1,5,{"$f":"登録touroku!E25","v":"長谷川進"},null,null,{"$f":"IF(VLOOKUP(AC$30&$Z37,進行表shinko!$C$13:$H$76,5,FALSE)=\"\",\"\",VLOOKUP(AC$30&$Z37,進行表shinko!$C$13:$H$76,5,FALSE))","v":86},{"$f":"IF(VLOOKUP(AD$30&$Z37,進行表shinko!$C$13:$H$76,5,FALSE)=\"\",\"\",VLOOKUP(AD$30&$Z37,進行表shinko!$C$13:$H$76,5,FALSE))","v":"w"},{"$f":"IF(VLOOKUP(AE$30&$Z37,進行表shinko!$C$13:$H$76,5,FALSE)=\"\",\"\",VLOOKUP(AE$30&$Z37,進行表shinko!$C$13:$H$76,5,FALSE))","v":29},{"$f":"IF(VLOOKUP(AF$30&$Z37,進行表shinko!$C$13:$H$76,5,FALSE)=\"\",\"\",VLOOKUP(AF$30&$Z37,進行表shinko!$C$13:$H$76,5,FALSE))","v":169},{"$f":"IF(VLOOKUP(AG$30&$Z37,進行表shinko!$C$13:$H$76,5,FALSE)=\"\",\"\",VLOOKUP(AG$30&$Z37,進行表shinko!$C$13:$H$76,5,FALSE))","v":108},{"$f":"IF(VLOOKUP(AH$30&$Z37,進行表shinko!$C$13:$H$76,5,FALSE)=\"\",\"\",VLOOKUP(AH$30&$Z37,進行表shinko!$C$13:$H$76,5,FALSE))","v":""},{"$f":"IF(VLOOKUP(AI$30&$Z37,進行表shinko!$C$13:$H$76,5,FALSE)=\"\",\"\",VLOOKUP(AI$30&$Z37,進行表shinko!$C$13:$H$76,5,FALSE))","v":127},{"$f":"IF(AJ$30=\"\",\"\",IF(VLOOKUP(I$33&$AJ34,進行表shinko!$C$13:$H$76,5,FALSE)=\"\",\"\",VLOOKUP(I$33&$AJ34,進行表shinko!$C$13:$H$76,5,FALSE)))","v":""},1,5,{"$f":"SUM(AC37:AJ37)/登録touroku!F25*登録touroku!$C$17","v":519},null,6,50519]
[270182,null,null,null,null,null,null,6,{"$f":"登録touroku!C26","v":"上倉淑敬"},null,null,{"$f":"IF(VLOOKUP($I38&L$30,進行表shinko!$C$13:$H$76,4,FALSE)=\"\",\"\",VLOOKUP($I38&L$30,進行表shinko!$C$13:$H$76,4,FALSE))","v":87},{"$f":"IF(VLOOKUP($I38&M$30,進行表shinko!$C$13:$H$76,4,FALSE)=\"\",\"\",VLOOKUP($I38&M$30,進行表shinko!$C$13:$H$76,4,FALSE))","v":"w"},{"$f":"IF(VLOOKUP($I38&N$30,進行表shinko!$C$13:$H$76,4,FALSE)=\"\",\"\",VLOOKUP($I38&N$30,進行表shinko!$C$13:$H$76,4,FALSE))","v":89},{"$f":"IF(VLOOKUP($I38&O$30,進行表shinko!$C$13:$H$76,4,FALSE)=\"\",\"\",VLOOKUP($I38&O$30,進行表shinko!$C$13:$H$76,4,FALSE))","v":6},{"$f":"IF(VLOOKUP($I38&P$30,進行表shinko!$C$13:$H$76,4,FALSE)=\"\",\"\",VLOOKUP($I38&P$30,進行表shinko!$C$13:$H$76,4,FALSE))","v":""},{"$f":"IF(VLOOKUP($I38&Q$30,進行表shinko!$C$13:$H$76,4,FALSE)=\"\",\"\",VLOOKUP($I38&Q$30,進行表shinko!$C$13:$H$76,4,FALSE))","v":"w"},{"$f":"IF(VLOOKUP($I38&R$30,進行表shinko!$C$13:$H$76,4,FALSE)=\"\",\"\",VLOOKUP($I38&R$30,進行表shinko!$C$13:$H$76,4,FALSE))","v":"w"},{"$f":"IF(S$30=\"\",\"\",IF(VLOOKUP($I38&S$30,進行表shinko!$C$13:$H$76,4,FALSE)=\"\",\"\",VLOOKUP($I38&S$30,進行表shinko!$C$13:$H$76,4,FALSE)))","v":""},3,3,{"$f":"SUM(L38:S38)/登録touroku!D26*登録touroku!$C$17","v":182},null,6,6,{"$f":"登録touroku!E26","v":"井本高史"},null,null,{"$f":"IF(VLOOKUP(AC$30&$Z38,進行表shinko!$C$13:$H$76,5,FALSE)=\"\",\"\",VLOOKUP(AC$30&$Z38,進行表shinko!$C$13:$H$76,5,FALSE))","v":67},{"$f":"IF(VLOOKUP(AD$30&$Z38,進行表shinko!$C$13:$H$76,5,FALSE)=\"\",\"\",VLOOKUP(AD$30&$Z38,進行表shinko!$C$13:$H$76,5,FALSE))","v":73},{"$f":"IF(VLOOKUP(AE$30&$Z38,進行表shinko!$C$13:$H$76,5,FALSE)=\"\",\"\",VLOOKUP(AE$30&$Z38,進行表shinko!$C$13:$H$76,5,FALSE))","v":31},{"$f":"IF(VLOOKUP(AF$30&$Z38,進行表shinko!$C$13:$H$76,5,FALSE)=\"\",\"\",VLOOKUP(AF$30&$Z38,進行表shinko!$C$13:$H$76,5,FALSE))","v":20},{"$f":"IF(VLOOKUP(AG$30&$Z38,進行表shinko!$C$13:$H$76,5,FALSE)=\"\",\"\",VLOOKUP(AG$30&$Z38,進行表shinko!$C$13:$H$76,5,FALSE))","v":54},{"$f":"IF(VLOOKUP(AH$30&$Z38,進行表shinko!$C$13:$H$76,5,FALSE)=\"\",\"\",VLOOKUP(AH$30&$Z38,進行表shinko!$C$13:$H$76,5,FALSE))","v":102},{"$f":"IF(VLOOKUP(AI$30&$Z38,進行表shinko!$C$13:$H$76,5,FALSE)=\"\",\"\",VLOOKUP(AI$30&$Z38,進行表shinko!$C$13:$H$76,5,FALSE))","v":""},{"$f":"IF(AJ$30=\"\",\"\",IF(VLOOKUP(I$33&$AJ35,進行表shinko!$C$13:$H$76,5,FALSE)=\"\",\"\",VLOOKUP(I$33&$AJ35,進行表shinko!$C$13:$H$76,5,FALSE)))","v":""},0,6,{"$f":"SUM(AC38:AJ38)/登録touroku!F26*登録touroku!$C$17","v":347},null,8,-59653]
[270230.14285714284,null,null,null,null,null,null,7,{"$f":"登録touroku!C27","v":"森田由佳里"},null,null,{"$f":"IF(VLOOKUP($I39&L$30,進行表shinko!$C$13:$H$76,4,FALSE)=\"\",\"\",VLOOKUP($I39&L$30,進行表shinko!$C$13:$H$76,4,FALSE))","v":"w"},{"$f":"IF(VLOOKUP($I39&M$30,進行表shinko!$C$13:$H$76,4,FALSE)=\"\",\"\",VLOOKUP($I39&M$30,進行表shinko!$C$13:$H$76,4,FALSE))","v":49},{"$f":"IF(VLOOKUP($I39&N$30,進行表shinko!$C$13:$H$76,4,FALSE)=\"\",\"\",VLOOKUP($I39&N$30,進行表shinko!$C$13:$H$76,4,FALSE))","v":23},{"$f":"IF(VLOOKUP($I39&O$30,進行表shinko!$C$13:$H$76,4,FALSE)=\"\",\"\",VLOOKUP($I39&O$30,進行表shinko!$C$13:$H$76,4,FALSE))","v":107},{"$f":"IF(VLOOKUP($I39&P$30,進行表shinko!$C$13:$H$76,4,FALSE)=\"\",\"\",VLOOKUP($I39&P$30,進行表shinko!$C$13:$H$76,4,FALSE))","v":"w"},{"$f":"IF(VLOOKUP($I39&Q$30,進行表shinko!$C$13:$H$76,4,FALSE)=\"\",\"\",VLOOKUP($I39&Q$30,進行表shinko!$C$13:$H$76,4,FALSE))","v":""},{"$f":"IF(VLOOKUP($I39&R$30,進行表shinko!$C$13:$H$76,4,FALSE)=\"\",\"\",VLOOKUP($I39&R$30,進行表shinko!$C$13:$H$76,4,FALSE))","v":"w"},{"$f":"IF(S$30=\"\",\"\",IF(VLOOKUP($I39&S$30,進行表shinko!$C$13:$H$76,4,FALSE)=\"\",\"\",VLOOKUP($I39&S$30,進行表shinko!$C$13:$H$76,4,FALSE)))","v":""},3,3,{"$f":"SUM(L39:S39)/登録touroku!D27*登録touroku!$C$17","v":230.14285714285711},null,5,7,{"$f":"登録touroku!E27","v":"宮野早織"},null,null,{"$f":"IF(VLOOKUP(AC$30&$Z39,進行表shinko!$C$13:$H$76,5,FALSE)=\"\",\"\",VLOOKUP(AC$30&$Z39,進行表shinko!$C$13:$H$76,5,FALSE))","v":""},{"$f":"IF(VLOOKUP(AD$30&$Z39,進行表shinko!$C$13:$H$76,5,FALSE)=\"\",\"\",VLOOKUP(AD$30&$Z39,進行表shinko!$C$13:$H$76,5,FALSE))","v":"w"},{"$f":"IF(VLOOKUP(AE$30&$Z39,進行表shinko!$C$13:$H$76,5,FALSE)=\"\",\"\",VLOOKUP(AE$30&$Z39,進行表shinko!$C$13:$H$76,5,FALSE))","v":99},{"$f":"IF(VLOOKUP(AF$30&$Z39,進行表shinko!$C$13:$H$76,5,FALSE)=\"\",\"\",VLOOKUP(AF$30&$Z39,進行表shinko!$C$13:$H$76,5,FALSE))","v":98},{"$f":"IF(VLOOKUP(AG$30&$Z39,進行表shinko!$C$13:$H$76,5,FALSE)=\"\",\"\",VLOOKUP(AG$30&$Z39,進行表shinko!$C$13:$H$76,5,FALSE))","v":105},{"$f":"IF(VLOOKUP(AH$30&$Z39,進行表shinko!$C$13:$H$76,5,FALSE)=\"\",\"\",VLOOKUP(AH$30&$Z39,進行表shinko!$C$13:$H$76,5,FALSE))","v":81},{"$f":"IF(VLOOKUP(AI$30&$Z39,進行表shinko!$C$13:$H$76,5,FALSE)=\"\",\"\",VLOOKUP(AI$30&$Z39,進行表shinko!$C$13:$H$76,5,FALSE))","v":63},{"$f":"IF(AJ$30=\"\",\"\",IF(VLOOKUP(I$33&$AJ36,進行表shinko!$C$13:$H$76,5,FALSE)=\"\",\"\",VLOOKUP(I$33&$AJ36,進行表shinko!$C$13:$H$76,5,FALSE)))","v":""},1,5,{"$f":"SUM(AC39:AJ39)/登録touroku!F27*登録touroku!$C$17","v":573.42857142857144},null,5,50573.428571428572]
[0,null,null,null,null,null,null,8,{"$f":"IF(登録touroku!C28=\"\",\"\",登録touroku!C28)","v":""},null,null,{"$f":"IF($I40=\"\",\"\",IF(VLOOKUP($I40&L$30,進行表shinko!$C$13:$H$76,4,FALSE)=\"\",\"\",VLOOKUP($I40&L$30,進行表shinko!$C$13:$H$76,4,FALSE)))","v":""},{"$f":"IF($I40=\"\",\"\",IF(VLOOKUP($I40&M$30,進行表shinko!$C$13:$H$76,4,FALSE)=\"\",\"\",VLOOKUP($I40&M$30,進行表shinko!$C$13:$H$76,4,FALSE)))","v":""},{"$f":"IF($I40=\"\",\"\",IF(VLOOKUP($I40&N$30,進行表shinko!$C$13:$H$76,4,FALSE)=\"\",\"\",VLOOKUP($I40&N$30,進行表shinko!$C$13:$H$76,4,FALSE)))","v":""},{"$f":"IF($I40=\"\",\"\",IF(VLOOKUP($I40&O$30,進行表shinko!$C$13:$H$76,4,FALSE)=\"\",\"\",VLOOKUP($I40&O$30,進行表shinko!$C$13:$H$76,4,FALSE)))","v":""},{"$f":"IF($I40=\"\",\"\",IF(VLOOKUP($I40&P$30,進行表shinko!$C$13:$H$76,4,FALSE)=\"\",\"\",VLOOKUP($I40&P$30,進行表shinko!$C$13:$H$76,4,FALSE)))","v":""},{"$f":"IF($I40=\"\",\"\",IF(VLOOKUP($I40&Q$30,進行表shinko!$C$13:$H$76,4,FALSE)=\"\",\"\",VLOOKUP($I40&Q$30,進行表shinko!$C$13:$H$76,4,FALSE)))","v":""},{"$f":"IF($I40=\"\",\"\",IF(VLOOKUP($I40&R$30,進行表shinko!$C$13:$H$76,4,FALSE)=\"\",\"\",VLOOKUP($I40&R$30,進行表shinko!$C$13:$H$76,4,FALSE)))","v":""},{"$f":"IF($I40=\"\",\"\",IF(VLOOKUP($I40&S$30,進行表shinko!$C$13:$H$76,4,FALSE)=\"\",\"\",VLOOKUP($I40&S$30,進行表shinko!$C$13:$H$76,4,FALSE)))","v":""},0,0,{"$f":"SUM(L40:S40)/登録touroku!D28*登録touroku!$C$17","v":0},null,8,8,{"$f":"IF(登録touroku!E28=\"\",\"\",登録touroku!E28)","v":""},null,null,{"$f":"IF($I40=\"\",\"\",IF(VLOOKUP(I$40&$AC30,進行表shinko!$C$13:$H$76,5,FALSE)=\"\",\"\",VLOOKUP(I$40&$AC30,進行表shinko!$C$13:$H$76,5,FALSE)))","v":""},{"$f":"IF($I40=\"\",\"\",IF(VLOOKUP(J$40&$AC30,進行表shinko!$C$13:$H$76,5,FALSE)=\"\",\"\",VLOOKUP(J$40&$AC30,進行表shinko!$C$13:$H$76,5,FALSE)))","v":""},{"$f":"IF($I40=\"\",\"\",IF(VLOOKUP(K$40&$AC30,進行表shinko!$C$13:$H$76,5,FALSE)=\"\",\"\",VLOOKUP(K$40&$AC30,進行表shinko!$C$13:$H$76,5,FALSE)))","v":""},{"$f":"IF($I40=\"\",\"\",IF(VLOOKUP(L$40&$AC30,進行表shinko!$C$13:$H$76,5,FALSE)=\"\",\"\",VLOOKUP(L$40&$AC30,進行表shinko!$C$13:$H$76,5,FALSE)))","v":""},{"$f":"IF($I40=\"\",\"\",IF(VLOOKUP(M$40&$AC30,進行表shinko!$C$13:$H$76,5,FALSE)=\"\",\"\",VLOOKUP(M$40&$AC30,進行表shinko!$C$13:$H$76,5,FALSE)))","v":""},{"$f":"IF($I40=\"\",\"\",IF(VLOOKUP(N$40&$AC30,進行表shinko!$C$13:$H$76,5,FALSE)=\"\",\"\",VLOOKUP(N$40&$AC30,進行表shinko!$C$13:$H$76,5,FALSE)))","v":""},{"$f":"IF($I40=\"\",\"\",IF(VLOOKUP(O$40&$AC30,進行表shinko!$C$13:$H$76,5,FALSE)=\"\",\"\",VLOOKUP(O$40&$AC30,進行表shinko!$C$13:$H$76,5,FALSE)))","v":""},{"$f":"IF($I40=\"\",\"\",IF(VLOOKUP(P$40&$AC30,進行表shinko!$C$13:$H$76,5,FALSE)=\"\",\"\",VLOOKUP(P$40&$AC30,進行表shinko!$C$13:$H$76,5,FALSE)))","v":""},0,0,{"$f":"SUM(AC40:AJ40)/登録touroku!F28*登録touroku!$C$17","v":0},null,7,0]
[null,null,null,null,null,null,null,null,null,null,null,null,null,null,null,null,null,null,null,{"$f":"SUM(T33:T40)","v":26},{"$f":"SUM(U33:U40)","v":16},{"$f":"SUM(V33:V40)","v":1390.1428571428571},null,null,null,null,null,null,null,null,null,null,null,null,null,null,{"$f":"SUM(AK33:AK40)","v":16},{"$f":"SUM(AL33:AL40)","v":26},{"$f":"SUM(AM33:AM40)","v":2324.4285714285716}]

{"sheet":"(空欄)成績表seiseki","index":6,"n_rows":40,"n_cols":42,"rows_kept":40,"cut":false,"hidden":false,"merged":[[14,6,16,6],[29,11,31,11],[29,12,31,12],[24,13,26,13],[29,8,31,10],[24,9,26,9],[24,8,26,8],[28,19,28,21],[28,22,28,23],[29,13,31,13],[29,14,31,14],[29,20,31,20],[29,21,31,21],[29,18,31,18],[29,19,31,19],[29,22,31,22],[29,23,31,23],[29,15,31,15],[29,17,31,17],[29,16,31,16],[19,12,21,12],[19,13,21,13],[24,12,26,12],[19,17,21,17],[9,9,11,9],[9,12,11,12],[9,13,11,13],[9,38,11,38],[14,12,16,12],[14,13,16,13],[14,14,16,14],[14,15,16,15],[9,34,11,34],[14,26,16,26],[9,17,11,17],[14,19,16,19],[14,18,16,18],[9,22,11,22],[9,23,11,23],[9,24,11,24],[9,18,11,18],[9,19,11,19],[14,16,16,16],[14,17,16,17],[9,14,11,14],[9,15,11,15],[9,16,11,16],[9,36,11,36],[9,37,11,37],[14,32,16,32],[9,25,11,25],[9,29,11,29],[9,35,11,35],[9,26,11,26],[9,27,11,27],[9,28,11,28],[14,28,16,28],[24,39,26,39],[19,38,21,38],[19,39,21,39],[19,34,21,34],[19,24,21,24],[24,16,26,16],[24,17,26,17],[24,29,26,29],[24,25,26,25],[24,18,26,18],[24,19,26,19],[24,33,26,33],[19,29,21,29],[24,34,26,34],[24,35,26,35],[24,36,26,36],[24,24,26,24],[19,23,21,23],[19,26,21,26],[24,32,26,32],[19,28,21,28],[22,31,23,31],[19,27,21,27],[19,16,21,16],[6,36,6,40],[12,31,13,31],[6,22,6,25],[19,36,21,36],[9,32,11,32],[9,33,11,33],[9,39,11,39],[19,37,21,37],[24,37,26,37],[6,29,6,32],[24,38,26,38],[14,38,16,38],[19,35,21,35],[19,32,21,32],[19,33,21,33],[14,35,16,35],[14,36,16,36],[24,26,26,26],[14,39,16,39],[14,37,16,37],[14,34,16,34],[14,33,16,33],[14,29,16,29],[14,27,16,27],[29,28,31,28],[29,30,31,30],[29,31,31,31],[29,32,31,32],[29,33,31,33],[29,25,31,27],[29,29,31,29],[29,40,31,40],[29,34,31,34],[29,35,31,35],[29,36,31,36],[29,37,31,37],[29,38,31,38],[29,39,31,39],[5,1,6,9],[6,10,6,13],[24,2,26,2],[24,3,26,3],[24,4,26,4],[24,5,26,5],[24,6,26,6],[12,1,13,1],[12,11,13,11],[24,7,26,7],[14,7,16,7],[14,8,16,8],[14,9,16,9],[9,2,11,2],[9,3,11,3],[9,4,11,4],[9,5,11,5],[9,6,11,6],[9,7,11,7],[9,8,11,8],[14,2,16,2],[14,3,16,3],[14,4,16,4],[14,5,16,5],[24,14,26,14],[24,15,26,15],[24,22,26,22],[24,23,26,23],[22,1,23,1],[22,11,23,11],[19,8,21,8],[19,9,21,9],[19,7,21,7],[19,2,21,2],[19,3,21,3],[19,5,21,5],[19,6,21,6],[19,4,21,4],[12,21,13,21],[22,21,23,21],[14,24,16,24],[14,25,16,25],[19,25,21,25],[19,22,21,22],[14,22,16,22],[14,23,16,23],[24,28,26,28],[24,27,26,27],[30,4,30,5],[28,1,28,2],[33,1,33,2],[33,4,33,5],[34,1,34,2],[37,1,37,2],[34,4,34,5],[35,1,35,2],[35,4,35,5],[36,1,36,2],[36,4,36,5],[28,36,28,38],[28,39,28,40],[19,18,21,18],[19,19,21,19],[19,14,21,14],[19,15,21,15],[28,3,28,4],[40,38,40,39],[40,1,40,2],[40,4,40,5],[37,4,37,5],[38,1,38,2],[38,4,38,5],[39,1,39,2],[39,4,39,5],[40,21,40,22],[31,1,31,2],[31,4,31,5],[32,1,32,2],[32,4,32,5],[28,5,28,6],[29,1,29,2],[29,4,29,5],[30,1,30,2]]}
[null,"このシートは、左下のHRチェック、および右上のMVP、VP、HRの各賞対象者のみ入力して下さい。"]
[null,"左下のHRチェックは、選手名以下のセルを選択後▼が表示されてから、\"Alt+↓\"で表示されるリストから、↑↓キーで選択しEnterキーで決定して下さい。"]
[null,"HRの得点は、直接入力して下さい。"]
[null,"右上のMVP、VP、HRの各賞対象者を直接入力して下さい。"]
[]
[null,{"$f":"登録touroku!B11","v":"第１７回　京奈　対抗戦"}]
[null,null,null,null,null,null,null,null,null,null,{"$f":"登録touroku!C13","v":"2021-11-28"},null,null,null,"於",{"$f":"登録touroku!C15","v":"VAMP"},null,null,null,null,"MVP",null,"　　　　(　　　　)",null,null,null,null,"VP",null,"　　　　(　　　　)",null,null,null,null,"HR",null,"　　　　(　　　　)　　　　p"]
[]
[null,null,1,2,3,4,5,6,7,null,null,null,8,9,10,11,12,13,14,null,null,null,15,16,17,18,19,20,21,null,null,null,22,23,24,25,26,27,28]
[null,null,{"$f":"IF(進行表shinko!D13=\"\",\"\",進行表shinko!D13)","v":"今村哲也"},{"$f":"IF(進行表shinko!D14=\"\",\"\",進行表shinko!D14)","v":"金光隆男"},{"$f":"IF(進行表shinko!D15=\"\",\"\",進行表shinko!D15)","v":"田附裕次"},{"$f":"IF(進行表shinko!D16=\"\",\"\",進行表shinko!D16)","v":"吉田智直"},{"$f":"IF(進行表shinko!D17=\"\",\"\",進行表shinko!D17)","v":"小堀泰次郎"},{"$f":"IF(進行表shinko!D18=\"\",\"\",進行表shinko!D18)","v":"上倉淑敬"},{"$f":"IF(進行表shinko!D19=\"\",\"\",進行表shinko!D19)","v":"森田由佳里"},{"$f":"IF(進行表shinko!D20=\"\",\"\",進行表shinko!D20)","v":""},null,null,{"$f":"IF(進行表shinko!D21=\"\",\"\",進行表shinko!D21)","v":"今村哲也"},{"$f":"IF(進行表shinko!D22=\"\",\"\",進行表shinko!D22)","v":"金光隆男"},{"$f":"IF(進行表shinko!D23=\"\",\"\",進行表shinko!D23)","v":"田附裕次"},{"$f":"IF(進行表shinko!D24=\"\",\"\",進行表shinko!D24)","v":"吉田智直"},{"$f":"IF(進行表shinko!D25=\"\",\"\",進行表shinko!D25)","v":"小堀泰次郎"},{"$f":"IF(進行表shinko!D26=\"\",\"\",進行表shinko!D26)","v":"上倉淑敬"},{"$f":"IF(進行表shinko!D27=\"\",\"\",進行表shinko!D27)","v":"森田由佳里"},{"$f":"IF(進行表shinko!D28=\"\",\"\",進行表shinko!D28)","v":""},null,null,{"$f":"IF(進行表shinko!D29=\"\",\"\",進行表shinko!D29)","v":"今村哲也"},{"$f":"IF(進行表shinko!D30=\"\",\"\",進行表shinko!D30)","v":"金光隆男"},{"$f":"IF(進行表shinko!D31=\"\",\"\",進行表shinko!D31)","v":"田附裕次"},{"$f":"IF(進行表shinko!D32=\"\",\"\",進行表shinko!D32)","v":"吉田智直"},{"$f":"IF(進行表shinko!D33=\"\",\"\",進行表shinko!D33)","v":"小堀泰次郎"},{"$f":"IF(進行表shinko!D34=\"\",\"\",進行表shinko!D34)","v":"上倉淑敬"},{"$f":"IF(進行表shinko!D35=\"\",\"\",進行表shinko!D35)","v":"森田由佳里"},{"$f":"IF(進行表shinko!D36=\"\",\"\",進行表shinko!D36)","v":""},null,null,{"$f":"IF(進行表shinko!D37=\"\",\"\",進行表shinko!D37)","v":"今村哲也"},{"$f":"IF(進行表shinko!D38=\"\",\"\",進行表shinko!D38)","v":"金光隆男"},{"$f":"IF(進行表shinko!D39=\"\",\"\",進行表shinko!D39)","v":"田附裕次"},{"$f":"IF(進行表shinko!D40=\"\",\"\",進行表shinko!D40)","v":"吉田智直"},{"$f":"IF(進行表shinko!D41=\"\",\"\",進行表shinko!D41)","v":"小堀泰次郎"},{"$f":"IF(進行表shinko!D42=\"\",\"\",進行表shinko!D42)","v":"上倉淑敬"},{"$f":"IF(進行表shinko!D43=\"\",\"\",進行表shinko!D43)","v":"森田由佳里"},{"$f":"IF(進行表shinko!D44=\"\",\"\",進行表shinko!D44)","v":""}]
[]
[null,null,null,null,null,null,null,null,null,null,null,null,null,null,null,null,null,null,null,null,{"$f":"IF(K13=\"\",\"\",K13+U13)","v":""},null,null,null,null,null,null,null,null,null,null,null,null,null,null,null,null,null,null,null,{"$f":"IF(AE13=\"\",\"\",AE13+AO13)","v":""}]
[null,1,{"$f":"IF(進行表shinko!F13=\"\",\"\",IF(進行表shinko!F13<180,\"×\",\"○\"))","v":"○"},{"$f":"IF(進行表shinko!F14=\"\",\"\",IF(進行表shinko!F14<180,\"×\",\"○\"))","v":"○"},{"$f":"IF(進行表shinko!F15=\"\",\"\",IF(進行表shinko!F15<180,\"×\",\"○\"))","v":"×"},{"$f":"IF(進行表shinko!F16=\"\",\"\",IF(進行表shinko!F16<180,\"×\",\"○\"))","v":"○"},{"$f":"IF(進行表shinko!F17=\"\",\"\",IF(進行表shinko!F17<180,\"×\",\"○\"))","v":"○"},{"$f":"IF(進行表shinko!F18=\"\",\"\",IF(進行表shinko!F18<180,\"×\",\"○\"))","v":"○"},{"$f":"IF(進行表shinko!F19=\"\",\"\",IF(進行表shinko!F19<180,\"×\",\"○\"))","v":"○"},{"$f":"IF(進行表shinko!F20=\"\",\"\",IF(進行表shinko!F20<180,\"×\",\"○\"))","v":""},{"$f":"IF(COUNTA(C13:J13)=8,\"\",COUNTIF(C13:J13,\"○\"))","v":""},2,{"$f":"IF(進行表shinko!F21=\"\",\"\",IF(進行表shinko!F21<180,\"×\",\"○\"))","v":"○"},{"$f":"IF(進行表shinko!F22=\"\",\"\",IF(進行表shinko!F22<180,\"×\",\"○\"))","v":"×"},{"$f":"IF(進行表shinko!F23=\"\",\"\",IF(進行表shinko!F23<180,\"×\",\"○\"))","v":"×"},{"$f":"IF(進行表shinko!F24=\"\",\"\",IF(進行表shinko!F24<180,\"×\",\"○\"))","v":"○"},{"$f":"IF(進行表shinko!F25=\"\",\"\",IF(進行表shinko!F25<180,\"×\",\"○\"))","v":"○"},{"$f":"IF(進行表shinko!F26=\"\",\"\",IF(進行表shinko!F26<180,\"×\",\"○\"))","v":"○"},{"$f":"IF(進行表shinko!F27=\"\",\"\",IF(進行表shinko!F27<180,\"×\",\"○\"))","v":"○"},null,null,3,{"$f":"IF(進行表shinko!F29=\"\",\"\",IF(進行表shinko!F29<180,\"×\",\"○\"))","v":"○"},{"$f":"IF(進行表shinko!F30=\"\",\"\",IF(進行表shinko!F30<180,\"×\",\"○\"))","v":"×"},{"$f":"IF(進行表shinko!F31=\"\",\"\",IF(進行表shinko!F31<180,\"×\",\"○\"))","v":"○"},{"$f":"IF(進行表shinko!F32=\"\",\"\",IF(進行表shinko!F32<180,\"×\",\"○\"))","v":"○"},{"$f":"IF(進行表shinko!F33=\"\",\"\",IF(進行表shinko!F33<180,\"×\",\"○\"))","v":"○"},{"$f":"IF(進行表shinko!F34=\"\",\"\",IF(進行表shinko!F34<180,\"×\",\"○\"))","v":"×"},{"$f":"IF(進行表shinko!F35=\"\",\"\",IF(進行表shinko!F35<180,\"×\",\"○\"))","v":"×"},null,null,4,{"$f":"IF(進行表shinko!F37=\"\",\"\",IF(進行表shinko!F37<180,\"×\",\"○\"))","v":"×"},{"$f":"IF(進行表shinko!F38=\"\",\"\",IF(進行表shinko!F38<180,\"×\",\"○\"))","v":"×"},{"$f":"IF(進行表shinko!F39=\"\",\"\",IF(進行表shinko!F39<180,\"×\",\"○\"))","v":"○"},{"$f":"IF(進行表shinko!F40=\"\",\"\",IF(進行表shinko!F40<180,\"×\",\"○\"))","v":"○"},{"$f":"IF(進行表shinko!F41=\"\",\"\",IF(進行表shinko!F41<180,\"×\",\"○\"))","v":"×"},{"$f":"IF(進行表shinko!F42=\"\",\"\",IF(進行表shinko!F42<180,\"×\",\"○\"))","v":"○"},{"$f":"IF(進行表shinko!F43=\"\",\"\",IF(進行表shinko!F43<180,\"×\",\"○\"))","v":"×"}]
[null,null,{"$f":"IF(進行表shinko!G13=\"\",\"\",IF(進行表shinko!G13<180,\"×\",\"○\"))","v":"×"},{"$f":"IF(進行表shinko!G14=\"\",\"\",IF(進行表shinko!G14<180,\"×\",\"○\"))","v":"×"},{"$f":"IF(進行表shinko!G15=\"\",\"\",IF(進行表shinko!G15<180,\"×\",\"○\"))","v":"○"},{"$f":"IF(進行表shinko!G16=\"\",\"\",IF(進行表shinko!G16<180,\"×\",\"○\"))","v":"×"},{"$f":"IF(進行表shinko!G17=\"\",\"\",IF(進行表shinko!G17<180,\"×\",\"○\"))","v":"×"},{"$f":"IF(進行表shinko!G18=\"\",\"\",IF(進行表shinko!G18<180,\"×\",\"○\"))","v":"×"},{"$f":"IF(進行表shinko!G19=\"\",\"\",IF(進行表shinko!G19<180,\"×\",\"○\"))","v":"×"},{"$f":"IF(進行表shinko!G20=\"\",\"\",IF(進行表shinko!G20<180,\"×\",\"○\"))","v":""},{"$f":"IF(COUNTA(C14:J14)=8,\"\",COUNTIF(C14:J14,\"○\"))","v":""},null,{"$f":"IF(進行表shinko!G21=\"\",\"\",IF(進行表shinko!G21<180,\"×\",\"○\"))","v":"×"},{"$f":"IF(進行表shinko!G22=\"\",\"\",IF(進行表shinko!G22<180,\"×\",\"○\"))","v":"○"},{"$f":"IF(進行表shinko!G23=\"\",\"\",IF(進行表shinko!G23<180,\"×\",\"○\"))","v":"○"},{"$f":"IF(進行表shinko!G24=\"\",\"\",IF(進行表shinko!G24<180,\"×\",\"○\"))","v":"×"},{"$f":"IF(進行表shinko!G25=\"\",\"\",IF(進行表shinko!G25<180,\"×\",\"○\"))","v":"×"},{"$f":"IF(進行表shinko!G26=\"\",\"\",IF(進行表shinko!G26<180,\"×\",\"○\"))","v":"×"},{"$f":"IF(進行表shinko!G27=\"\",\"\",IF(進行表shinko!G27<180,\"×\",\"○\"))","v":"×"},{"$f":"IF(進行表shinko!G28=\"\",\"\",IF(進行表shinko!G28<180,\"×\",\"○\"))","v":""},{"$f":"IF(COUNTA(M14:T14)=8,\"\",COUNTIF(M14:T14,\"○\"))","v":""},null,{"$f":"IF(進行表shinko!G29=\"\",\"\",IF(進行表shinko!G29<180,\"×\",\"○\"))","v":"×"},{"$f":"IF(進行表shinko!G30=\"\",\"\",IF(進行表shinko!G30<180,\"×\",\"○\"))","v":"○"},{"$f":"IF(進行表shinko!G31=\"\",\"\",IF(進行表shinko!G31<180,\"×\",\"○\"))","v":"×"},{"$f":"IF(進行表shinko!G32=\"\",\"\",IF(進行表shinko!G32<180,\"×\",\"○\"))","v":"×"},{"$f":"IF(進行表shinko!G33=\"\",\"\",IF(進行表shinko!G33<180,\"×\",\"○\"))","v":"×"},{"$f":"IF(進行表shinko!G34=\"\",\"\",IF(進行表shinko!G34<180,\"×\",\"○\"))","v":"○"},{"$f":"IF(進行表shinko!G35=\"\",\"\",IF(進行表shinko!G35<180,\"×\",\"○\"))","v":"○"},null,null,null,{"$f":"IF(進行表shinko!G37=\"\",\"\",IF(進行表shinko!G37<180,\"×\",\"○\"))","v":"○"},{"$f":"IF(進行表shinko!G38=\"\",\"\",IF(進行表shinko!G38<180,\"×\",\"○\"))","v":"○"},{"$f":"IF(進行表shinko!G39=\"\",\"\",IF(進行表shinko!G39<180,\"×\",\"○\"))","v":"×"},{"$f":"IF(進行表shinko!G40=\"\",\"\",IF(進行表shinko!G40<180,\"×\",\"○\"))","v":"×"},{"$f":"IF(進行表shinko!G41=\"\",\"\",IF(進行表shinko!G41<180,\"×\",\"○\"))","v":"○"},{"$f":"IF(進行表shinko!G42=\"\",\"\",IF(進行表shinko!G42<180,\"×\",\"○\"))","v":"×"},{"$f":"IF(進行表shinko!G43=\"\",\"\",IF(進行表shinko!G43<180,\"×\",\"○\"))","v":"○"},{"$f":"IF(進行表shinko!G44=\"\",\"\",IF(進行表shinko!G44<180,\"×\",\"○\"))","v":""},{"$f":"IF(COUNTA(AG14:AN14)=8,\"\",COUNTIF(AG14:AN14,\"○\"))","v":""}]
[null,null,{"$f":"IF(進行表shinko!I13=\"\",\"\",進行表shinko!I13)","v":"金澤茂昌"},{"$f":"IF(進行表shinko!I14=\"\",\"\",進行表shinko!I14)","v":"白戸玲人"},{"$f":"IF(進行表shinko!I15=\"\",\"\",進行表shinko!I15)","v":"吉向翔平"},{"$f":"IF(進行表shinko!I16=\"\",\"\",進行表shinko!I16)","v":"岩本剛"},{"$f":"IF(進行表shinko!I17=\"\",\"\",進行表shinko!I17)","v":"長谷川進"},{"$f":"IF(進行表shinko!I18=\"\",\"\",進行表shinko!I18)","v":"井本高史"},{"$f":"IF(進行表shinko!I19=\"\",\"\",進行表shinko!I19)","v":"宮野早織"},{"$f":"IF(進行表shinko!I20=\"\",\"\",進行表shinko!I20)","v":""},null,null,{"$f":"IF(進行表shinko!I21=\"\",\"\",進行表shinko!I21)","v":"白戸玲人"},{"$f":"IF(進行表shinko!I22=\"\",\"\",進行表shinko!I22)","v":"吉向翔平"},{"$f":"IF(進行表shinko!I23=\"\",\"\",進行表shinko!I23)","v":"岩本剛"},{"$f":"IF(進行表shinko!I24=\"\",\"\",進行表shinko!I24)","v":"長谷川進"},{"$f":"IF(進行表shinko!I25=\"\",\"\",進行表shinko!I25)","v":"井本高史"},{"$f":"IF(進行表shinko!I26=\"\",\"\",進行表shinko!I26)","v":"宮野早織"},{"$f":"IF(進行表shinko!I27=\"\",\"\",進行表shinko!I27)","v":"金澤茂昌"},{"$f":"IF(進行表shinko!I28=\"\",\"\",進行表shinko!I28)","v":""},{"$f":"IF(K14=\"\",\"\",K14+U14)","v":""},null,{"$f":"IF(進行表shinko!I29=\"\",\"\",進行表shinko!I29)","v":"吉向翔平"},{"$f":"IF(進行表shinko!I30=\"\",\"\",進行表shinko!I30)","v":"岩本剛"},{"$f":"IF(進行表shinko!I31=\"\",\"\",進行表shinko!I31)","v":"長谷川進"},{"$f":"IF(進行表shinko!I32=\"\",\"\",進行表shinko!I32)","v":"井本高史"},{"$f":"IF(進行表shinko!I33=\"\",\"\",進行表shinko!I33)","v":"宮野早織"},{"$f":"IF(進行表shinko!I34=\"\",\"\",進行表shinko!I34)","v":"金澤茂昌"},{"$f":"IF(進行表shinko!I35=\"\",\"\",進行表shinko!I35)","v":"白戸玲人"},{"$f":"IF(進行表shinko!I36=\"\",\"\",進行表shinko!I36)","v":""},{"$f":"IF(U14=\"\",\"\",U14+AE14)","v":""},null,{"$f":"IF(進行表shinko!I37=\"\",\"\",進行表shinko!I37)","v":"岩本剛"},{"$f":"IF(進行表shinko!I38=\"\",\"\",進行表shinko!I38)","v":"長谷川進"},{"$f":"IF(進行表shinko!I39=\"\",\"\",進行表shinko!I39)","v":"井本高史"},{"$f":"IF(進行表shinko!I40=\"\",\"\",進行表shinko!I40)","v":"宮野早織"},{"$f":"IF(進行表shinko!I41=\"\",\"\",進行表shinko!I41)","v":"金澤茂昌"},{"$f":"IF(進行表shinko!I42=\"\",\"\",進行表shinko!I42)","v":"白戸玲人"},{"$f":"IF(進行表shinko!I43=\"\",\"\",進行表shinko!I43)","v":"吉向翔平"},{"$f":"IF(進行表shinko!I44=\"\",\"\",進行表shinko!I44)","v":""},{"$f":"IF(AE14=\"\",\"\",AE14+AO14)","v":""}]
[]
[]
[]
[null,null,29,30,31,32,33,34,35,null,null,null,{"$f":"IF(J19=\"\",I19+1,J19+1)","v":36},{"$f":"M19+1","v":37},38,39,40,41,42,{"$f":"IF(登録touroku!$C$28=\"\",\"\",成績表seiseki!S19+1)","v":""},null,null,{"$f":"IF(T19=\"\",S19+1,T19+1)","v":43},{"$f":"W19+1","v":44},45,46,47,48,49,{"$f":"IF(登録touroku!$C$28=\"\",\"\",成績表seiseki!AC19+1)","v":""}]
[null,null,{"$f":"IF(進行表shinko!D45=\"\",\"\",進行表shinko!D45)","v":"今村哲也"},{"$f":"IF(進行表shinko!D46=\"\",\"\",進行表shinko!D46)","v":"金光隆男"},{"$f":"IF(進行表shinko!D47=\"\",\"\",進行表shinko!D47)","v":"田附裕次"},{"$f":"IF(進行表shinko!D48=\"\",\"\",進行表shinko!D48)","v":"吉田智直"},{"$f":"IF(進行表shinko!D49=\"\",\"\",進行表shinko!D49)","v":"小堀泰次郎"},{"$f":"IF(進行表shinko!D50=\"\",\"\",進行表shinko!D50)","v":"上倉淑敬"},{"$f":"IF(進行表shinko!D51=\"\",\"\",進行表shinko!D51)","v":"森田由佳里"},{"$f":"IF(進行表shinko!D52=\"\",\"\",進行表shinko!D52)","v":""},null,null,{"$f":"IF(進行表shinko!D53=\"\",\"\",進行表shinko!D53)","v":"今村哲也"},{"$f":"IF(進行表shinko!D54=\"\",\"\",進行表shinko!D54)","v":"金光隆男"},{"$f":"IF(進行表shinko!D55=\"\",\"\",進行表shinko!D55)","v":"田附裕次"},{"$f":"IF(進行表shinko!D56=\"\",\"\",進行表shinko!D56)","v":"吉田智直"},{"$f":"IF(進行表shinko!D57=\"\",\"\",進行表shinko!D57)","v":"小堀泰次郎"},{"$f":"IF(進行表shinko!D58=\"\",\"\",進行表shinko!D58)","v":"上倉淑敬"},{"$f":"IF(進行表shinko!D59=\"\",\"\",進行表shinko!D59)","v":"森田由佳里"},{"$f":"IF(進行表shinko!D60=\"\",\"\",進行表shinko!D60)","v":""},null,null,{"$f":"IF(進行表shinko!D61=\"\",\"\",進行表shinko!D61)","v":"今村哲也"},{"$f":"IF(進行表shinko!D62=\"\",\"\",進行表shinko!D62)","v":"金光隆男"},{"$f":"IF(進行表shinko!D63=\"\",\"\",進行表shinko!D63)","v":"田附裕次"},{"$f":"IF(進行表shinko!D64=\"\",\"\",進行表shinko!D64)","v":"吉田智直"},{"$f":"IF(進行表shinko!D65=\"\",\"\",進行表shinko!D65)","v":"小堀泰次郎"},{"$f":"IF(進行表shinko!D66=\"\",\"\",進行表shinko!D66)","v":"上倉淑敬"},{"$f":"IF(進行表shinko!D67=\"\",\"\",進行表shinko!D67)","v":"森田由佳里"},{"$f":"IF(進行表shinko!D68=\"\",\"\",進行表shinko!D68)","v":""}]
[]
[null,null,null,null,null,null,null,null,null,null,{"$f":"IF(AO12=\"\",\"\",AO12+K23)","v":""},null,null,null,null,null,null,null,null,null,{"$f":"IF(K23=\"\",\"\",K23+U23)","v":""},null,null,null,null,null,null,null,null,null,{"$f":"IF(U23=\"\",\"\",U23+AE23)","v":""},null,null,null,null,null,null,null,null,null,{"$f":"IF(AE23=\"\",\"\",AE23+AO23)","v":""}]
[null,5,{"$f":"IF(進行表shinko!F45=\"\",\"\",IF(進行表shinko!F45<180,\"×\",\"○\"))","v":"○"},{"$f":"IF(進行表shinko!F46=\"\",\"\",IF(進行表shinko!F46<180,\"×\",\"○\"))","v":"○"},{"$f":"IF(進行表shinko!F47=\"\",\"\",IF(進行表shinko!F47<180,\"×\",\"○\"))","v":"○"},{"$f":"IF(進行表shinko!F48=\"\",\"\",IF(進行表shinko!F48<180,\"×\",\"○\"))","v":"○"},{"$f":"IF(進行表shinko!F49=\"\",\"\",IF(進行表shinko!F49<180,\"×\",\"○\"))","v":"○"},{"$f":"IF(進行表shinko!F50=\"\",\"\",IF(進行表shinko!F50<180,\"×\",\"○\"))","v":"×"},{"$f":"IF(進行表shinko!F51=\"\",\"\",IF(進行表shinko!F51<180,\"×\",\"○\"))","v":"×"},{"$f":"IF(進行表shinko!F52=\"\",\"\",IF(進行表shinko!F52<180,\"×\",\"○\"))","v":""},{"$f":"IF(COUNTA(C23:J23)=8,\"\",COUNTIF(C23:J23,\"○\"))","v":""},6,{"$f":"IF(進行表shinko!F53=\"\",\"\",IF(進行表shinko!F53<180,\"×\",\"○\"))","v":"○"},{"$f":"IF(進行表shinko!F54=\"\",\"\",IF(進行表shinko!F54<180,\"×\",\"○\"))","v":"×"},{"$f":"IF(進行表shinko!F55=\"\",\"\",IF(進行表shinko!F55<180,\"×\",\"○\"))","v":"×"},{"$f":"IF(進行表shinko!F56=\"\",\"\",IF(進行表shinko!F56<180,\"×\",\"○\"))","v":"×"},{"$f":"IF(進行表shinko!F57=\"\",\"\",IF(進行表shinko!F57<180,\"×\",\"○\"))","v":"○"},{"$f":"IF(進行表shinko!F58=\"\",\"\",IF(進行表shinko!F58<180,\"×\",\"○\"))","v":"×"},{"$f":"IF(進行表shinko!F59=\"\",\"\",IF(進行表shinko!F59<180,\"×\",\"○\"))","v":"○"},{"$f":"IF(進行表shinko!F60=\"\",\"\",IF(進行表shinko!F60<180,\"×\",\"○\"))","v":""},{"$f":"IF(COUNTA(M23:T23)=8,\"\",COUNTIF(M23:T23,\"○\"))","v":""},7,{"$f":"IF(進行表shinko!F61=\"\",\"\",IF(進行表shinko!F61<180,\"×\",\"○\"))","v":""},{"$f":"IF(進行表shinko!F62=\"\",\"\",IF(進行表shinko!F62<180,\"×\",\"○\"))","v":""},{"$f":"IF(進行表shinko!F63=\"\",\"\",IF(進行表shinko!F63<180,\"×\",\"○\"))","v":""},{"$f":"IF(進行表shinko!F64=\"\",\"\",IF(進行表shinko!F64<180,\"×\",\"○\"))","v":""},{"$f":"IF(進行表shinko!F65=\"\",\"\",IF(進行表shinko!F65<180,\"×\",\"○\"))","v":""},{"$f":"IF(進行表shinko!F66=\"\",\"\",IF(進行表shinko!F66<180,\"×\",\"○\"))","v":""},{"$f":"IF(進行表shinko!F67=\"\",\"\",IF(進行表shinko!F67<180,\"×\",\"○\"))","v":""},{"$f":"IF(進行表shinko!F68=\"\",\"\",IF(進行表shinko!F68<180,\"×\",\"○\"))","v":""},{"$f":"IF(COUNTA(W23:AD23)=8,\"\",COUNTIF(W23:AD23,\"○\"))","v":""},null,null,null,null,null,null,null,null,null,{"$f":"IF(COUNTA(AG23:AN23)=8,\"\",COUNTIF(AG23:AN23,\"○\"))","v":0}]
[null,null,{"$f":"IF(進行表shinko!G45=\"\",\"\",IF(進行表shinko!G45<180,\"×\",\"○\"))","v":"×"},{"$f":"IF(進行表shinko!G46=\"\",\"\",IF(進行表shinko!G46<180,\"×\",\"○\"))","v":"×"},{"$f":"IF(進行表shinko!G47=\"\",\"\",IF(進行表shinko!G47<180,\"×\",\"○\"))","v":"×"},{"$f":"IF(進行表shinko!G48=\"\",\"\",IF(進行表shinko!G48<180,\"×\",\"○\"))","v":"×"},{"$f":"IF(進行表shinko!G49=\"\",\"\",IF(進行表shinko!G49<180,\"×\",\"○\"))","v":"×"},{"$f":"IF(進行表shinko!G50=\"\",\"\",IF(進行表shinko!G50<180,\"×\",\"○\"))","v":"○"},{"$f":"IF(進行表shinko!G51=\"\",\"\",IF(進行表shinko!G51<180,\"×\",\"○\"))","v":"○"},{"$f":"IF(進行表shinko!G52=\"\",\"\",IF(進行表shinko!G52<180,\"×\",\"○\"))","v":""},{"$f":"IF(COUNTA(C24:J24)=8,\"\",COUNTIF(C24:J24,\"○\"))","v":""},null,{"$f":"IF(進行表shinko!G53=\"\",\"\",IF(進行表shinko!G53<180,\"×\",\"○\"))","v":"×"},{"$f":"IF(進行表shinko!G54=\"\",\"\",IF(進行表shinko!G54<180,\"×\",\"○\"))","v":"○"},{"$f":"IF(進行表shinko!G55=\"\",\"\",IF(進行表shinko!G55<180,\"×\",\"○\"))","v":"○"},{"$f":"IF(進行表shinko!G56=\"\",\"\",IF(進行表shinko!G56<180,\"×\",\"○\"))","v":"○"},{"$f":"IF(進行表shinko!G57=\"\",\"\",IF(進行表shinko!G57<180,\"×\",\"○\"))","v":"×"},{"$f":"IF(進行表shinko!G58=\"\",\"\",IF(進行表shinko!G58<180,\"×\",\"○\"))","v":"○"},{"$f":"IF(進行表shinko!G59=\"\",\"\",IF(進行表shinko!G59<180,\"×\",\"○\"))","v":"×"},{"$f":"IF(進行表shinko!G60=\"\",\"\",IF(進行表shinko!G60<180,\"×\",\"○\"))","v":""},{"$f":"IF(COUNTA(M24:T24)=8,\"\",COUNTIF(M24:T24,\"○\"))","v":""},null,{"$f":"IF(進行表shinko!G61=\"\",\"\",IF(進行表shinko!G61<180,\"×\",\"○\"))","v":""},{"$f":"IF(進行表shinko!G62=\"\",\"\",IF(進行表shinko!G62<180,\"×\",\"○\"))","v":""},{"$f":"IF(進行表shinko!G63=\"\",\"\",IF(進行表shinko!G63<180,\"×\",\"○\"))","v":""},{"$f":"IF(進行表shinko!G64=\"\",\"\",IF(進行表shinko!G64<180,\"×\",\"○\"))","v":""},{"$f":"IF(進行表shinko!G65=\"\",\"\",IF(進行表shinko!G65<180,\"×\",\"○\"))","v":""},{"$f":"IF(進行表shinko!G66=\"\",\"\",IF(進行表shinko!G66<180,\"×\",\"○\"))","v":""},{"$f":"IF(進行表shinko!G67=\"\",\"\",IF(進行表shinko!G67<180,\"×\",\"○\"))","v":""},{"$f":"IF(進行表shinko!G68=\"\",\"\",IF(進行表shinko!G68<180,\"×\",\"○\"))","v":""},{"$f":"IF(COUNTA(W24:AD24)=8,\"\",COUNTIF(W24:AD24,\"○\"))","v":""},null,null,null,null,null,null,null,null,null,{"$f":"IF(COUNTA(AG24:AN24)=8,\"\",COUNTIF(AG24:AN24,\"○\"))","v":0}]
[null,null,{"$f":"IF(進行表shinko!I45=\"\",\"\",進行表shinko!I45)","v":"長谷川進"},{"$f":"IF(進行表shinko!I46=\"\",\"\",進行表shinko!I46)","v":"井本高史"},{"$f":"IF(進行表shinko!I47=\"\",\"\",進行表shinko!I47)","v":"宮野早織"},{"$f":"IF(進行表shinko!I48=\"\",\"\",進行表shinko!I48)","v":"金澤茂昌"},{"$f":"IF(進行表shinko!I49=\"\",\"\",進行表shinko!I49)","v":"白戸玲人"},{"$f":"IF(進行表shinko!I50=\"\",\"\",進行表shinko!I50)","v":"吉向翔平"},{"$f":"IF(進行表shinko!I51=\"\",\"\",進行表shinko!I51)","v":"岩本剛"},{"$f":"IF(進行表shinko!I52=\"\",\"\",進行表shinko!I52)","v":""},{"$f":"IF(AO15=\"\",\"\",AO15+K24)","v":""},null,{"$f":"IF(進行表shinko!I53=\"\",\"\",進行表shinko!I53)","v":"井本高史"},{"$f":"IF(進行表shinko!I54=\"\",\"\",進行表shinko!I54)","v":"宮野早織"},{"$f":"IF(進行表shinko!I55=\"\",\"\",進行表shinko!I55)","v":"金澤茂昌"},{"$f":"IF(進行表shinko!I56=\"\",\"\",進行表shinko!I56)","v":"白戸玲人"},{"$f":"IF(進行表shinko!I57=\"\",\"\",進行表shinko!I57)","v":"吉向翔平"},{"$f":"IF(進行表shinko!I58=\"\",\"\",進行表shinko!I58)","v":"岩本剛"},{"$f":"IF(進行表shinko!I59=\"\",\"\",進行表shinko!I59)","v":"長谷川進"},{"$f":"IF(進行表shinko!I60=\"\",\"\",進行表shinko!I60)","v":""},{"$f":"IF(K24=\"\",\"\",K24+U24)","v":""},null,{"$f":"IF(進行表shinko!I61=\"\",\"\",進行表shinko!I61)","v":"宮野早織"},{"$f":"IF(進行表shinko!I62=\"\",\"\",進行表shinko!I62)","v":"金澤茂昌"},{"$f":"IF(進行表shinko!I63=\"\",\"\",進行表shinko!I63)","v":"白戸玲人"},{"$f":"IF(進行表shinko!I64=\"\",\"\",進行表shinko!I64)","v":"吉向翔平"},{"$f":"IF(進行表shinko!I65=\"\",\"\",進行表shinko!I65)","v":"岩本剛"},{"$f":"IF(進行表shinko!I66=\"\",\"\",進行表shinko!I66)","v":"長谷川進"},{"$f":"IF(進行表shinko!I67=\"\",\"\",進行表shinko!I67)","v":"井本高史"},{"$f":"IF(進行表shinko!I68=\"\",\"\",進行表shinko!I68)","v":""},{"$f":"IF(U24=\"\",\"\",U24+AE24)","v":""},null,null,null,null,null,null,null,null,null,{"$f":"IF(AE24=\"\",\"\",AE24+AO24)","v":""}]
[]
[]
[]
[null,{"$f":"登録touroku!C20","v":"京都"},null,"HR",null,{"$f":"登録touroku!E20","v":"奈良"},null,null,null,null,null,1,2,3,4,5,6,7,8,"total point",null,null,null,null,null,null,null,null,1,2,3,4,5,6,7,8,"total point"]
[null,"選手名",null,"点","選手名",null,"点",null,null,null,null,{"$f":"登録touroku!E21","v":"金澤茂昌"},{"$f":"登録touroku!E22","v":"白戸玲人"},{"$f":"登録touroku!E23","v":"吉向翔平"},{"$f":"登録touroku!E24","v":"岩本剛"},{"$f":"登録touroku!E25","v":"長谷川進"},{"$f":"登録touroku!E26","v":"井本高史"},{"$f":"登録touroku!E27","v":"宮野早織"},null,"W","L","負点","失点","R",null,null,null,null,{"$f":"I33","v":"今村哲也"},{"$f":"I34","v":"金光隆男"},{"$f":"I35","v":"田附裕次"},{"$f":"I36","v":"吉田智直"},{"$f":"I37","v":"小堀泰次郎"},{"$f":"I38","v":"上倉淑敬"},{"$f":"I39","v":"森田由佳里"},null,"W","L","負点","失点","R"]
[]
[]
[{"$f":"T33*100000-U33*10000+V33-W33","v":0},null,null,null,null,null,null,1,{"$f":"登録touroku!C21","v":"今村哲也"},null,null,{"$f":"IF(進行表shinko!F13=\"\",\"\",IF(進行表shinko!F13<180,進行表shinko!F13,\"W\"))","v":"W"},{"$f":"IF(進行表shinko!F21=\"\",\"\",IF(進行表shinko!F21<180,進行表shinko!F21,\"W\"))","v":"W"},{"$f":"IF(進行表shinko!F29=\"\",\"\",IF(進行表shinko!F29<180,進行表shinko!F29,\"W\"))","v":"W"},{"$f":"IF(進行表shinko!F37=\"\",\"\",IF(進行表shinko!F37<180,進行表shinko!F37,\"W\"))","v":83},{"$f":"IF(進行表shinko!F45=\"\",\"\",IF(進行表shinko!F45<180,進行表shinko!F45,\"W\"))","v":"W"},{"$f":"IF(進行表shinko!F53=\"\",\"\",IF(進行表shinko!F53<180,進行表shinko!F53,\"W\"))","v":"W"},{"$f":"IF(進行表shinko!F61=\"\",\"\",IF(進行表shinko!F61<180,進行表shinko!F61,\"W\"))","v":""},{"$f":"IF(進行表shinko!F69=\"\",\"\",IF(進行表shinko!F69<180,進行表shinko!F69,\"W\"))","v":""},null,null,null,null,null,1,{"$f":"登録touroku!E21","v":"金澤茂昌"},null,null,{"$f":"IF(進行表shinko!G13=\"\",\"\",IF(進行表shinko!G13<180,進行表shinko!G13,\"W\"))","v":69},{"$f":"IF(進行表shinko!G70=\"\",\"\",IF(進行表shinko!G70<180,進行表shinko!G70,\"W\"))","v":""},{"$f":"IF(進行表shinko!G63=\"\",\"\",IF(進行表shinko!G63<180,進行表shinko!G63,\"W\"))","v":""},{"$f":"IF(進行表shinko!G56=\"\",\"\",IF(進行表shinko!G56<180,進行表shinko!G56,\"W\"))","v":"W"},{"$f":"IF(進行表shinko!G49=\"\",\"\",IF(進行表shinko!G49<180,進行表shinko!G49,\"W\"))","v":158},{"$f":"IF(進行表shinko!G42=\"\",\"\",IF(進行表shinko!G42<180,進行表shinko!G42,\"W\"))","v":50},{"$f":"IF(進行表shinko!G35=\"\",\"\",IF(進行表shinko!G35<180,進行表shinko!G35,\"W\"))","v":"W"},{"$f":"IF(進行表shinko!G28=\"\",\"\",IF(進行表shinko!G28<180,進行表shinko!G28,\"W\"))","v":""},null,null,null,null,null,{"$f":"AK33*100000-AL33*10000+AM33-AN33","v":0}]
[0,null,null,null,null,null,null,2,{"$f":"登録touroku!C22","v":"金光隆男"},null,null,{"$f":"IF(進行表shinko!F70=\"\",\"\",IF(進行表shinko!F70<180,進行表shinko!F70,\"W\"))","v":""},{"$f":"IF(進行表shinko!F14=\"\",\"\",IF(進行表shinko!F14<180,進行表shinko!F14,\"W\"))","v":"W"},{"$f":"IF(進行表shinko!F22=\"\",\"\",IF(進行表shinko!F22<180,進行表shinko!F22,\"W\"))","v":95},{"$f":"IF(進行表shinko!F30=\"\",\"\",IF(進行表shinko!F30<180,進行表shinko!F30,\"W\"))","v":47},{"$f":"IF(進行表shinko!F38=\"\",\"\",IF(進行表shinko!F38<180,進行表shinko!F38,\"W\"))","v":176},{"$f":"IF(進行表shinko!F46=\"\",\"\",IF(進行表shinko!F46<180,進行表shinko!F46,\"W\"))","v":"W"},{"$f":"IF(進行表shinko!F54=\"\",\"\",IF(進行表shinko!F54<180,進行表shinko!F54,\"W\"))","v":106},{"$f":"IF(進行表shinko!F62=\"\",\"\",IF(進行表shinko!F62<180,進行表shinko!F62,\"W\"))","v":""},null,null,null,null,null,2,{"$f":"登録touroku!E22","v":"白戸玲人"},null,null,{"$f":"IF(進行表shinko!G21=\"\",\"\",IF(進行表shinko!G21<180,進行表shinko!G21,\"W\"))","v":62},{"$f":"IF(進行表shinko!G14=\"\",\"\",IF(進行表shinko!G14<180,進行表shinko!G14,\"W\"))","v":60},{"$f":"IF(進行表shinko!G71=\"\",\"\",IF(進行表shinko!G71<180,進行表shinko!G71,\"W\"))","v":""},{"$f":"IF(進行表shinko!G64=\"\",\"\",IF(進行表shinko!G64<180,進行表shinko!G64,\"W\"))","v":""},{"$f":"IF(進行表shinko!G57=\"\",\"\",IF(進行表shinko!G57<180,進行表shinko!G57,\"W\"))","v":140},{"$f":"IF(進行表shinko!G50=\"\",\"\",IF(進行表shinko!G50<180,進行表shinko!G50,\"W\"))","v":"W"},{"$f":"IF(進行表shinko!G43=\"\",\"\",IF(進行表shinko!G43<180,進行表shinko!G43,\"W\"))","v":"W"},{"$f":"IF(進行表shinko!G36=\"\",\"\",IF(進行表shinko!G36<180,進行表shinko!G36,\"W\"))","v":""},null,null,null,null,null,0]
[0,null,null,null,null,null,null,3,{"$f":"登録touroku!C23","v":"田附裕次"},null,null,{"$f":"IF(進行表shinko!F63=\"\",\"\",IF(進行表shinko!F63<180,進行表shinko!F63,\"W\"))","v":""},{"$f":"IF(進行表shinko!F71=\"\",\"\",IF(進行表shinko!F71<180,進行表shinko!F71,\"W\"))","v":""},{"$f":"IF(進行表shinko!F15=\"\",\"\",IF(進行表shinko!F15<180,進行表shinko!F15,\"W\"))","v":122},{"$f":"IF(進行表shinko!F23=\"\",\"\",IF(進行表shinko!F23<180,進行表shinko!F23,\"W\"))","v":32},{"$f":"IF(進行表shinko!F31=\"\",\"\",IF(進行表shinko!F31<180,進行表shinko!F31,\"W\"))","v":"W"},{"$f":"IF(進行表shinko!F39=\"\",\"\",IF(進行表shinko!F39<180,進行表shinko!F39,\"W\"))","v":"W"},{"$f":"IF(進行表shinko!F47=\"\",\"\",IF(進行表shinko!F47<180,進行表shinko!F47,\"W\"))","v":"W"},{"$f":"IF(進行表shinko!F55=\"\",\"\",IF(進行表shinko!F55<180,進行表shinko!F55,\"W\"))","v":101},null,null,null,null,null,3,{"$f":"登録touroku!E23","v":"吉向翔平"},null,null,{"$f":"IF(進行表shinko!G29=\"\",\"\",IF(進行表shinko!G29<180,進行表shinko!G29,\"W\"))","v":122},{"$f":"IF(進行表shinko!G22=\"\",\"\",IF(進行表shinko!G22<180,進行表shinko!G22,\"W\"))","v":"W"},{"$f":"IF(進行表shinko!G15=\"\",\"\",IF(進行表shinko!G15<180,進行表shinko!G15,\"W\"))","v":"W"},{"$f":"IF(進行表shinko!G72=\"\",\"\",IF(進行表shinko!G72<180,進行表shinko!G72,\"W\"))","v":""},{"$f":"IF(進行表shinko!G65=\"\",\"\",IF(進行表shinko!G65<180,進行表shinko!G65,\"W\"))","v":""},{"$f":"IF(進行表shinko!G58=\"\",\"\",IF(進行表shinko!G58<180,進行表shinko!G58,\"W\"))","v":"W"},{"$f":"IF(進行表shinko!G51=\"\",\"\",IF(進行表shinko!G51<180,進行表shinko!G51,\"W\"))","v":"W"},{"$f":"IF(進行表shinko!G44=\"\",\"\",IF(進行表shinko!G44<180,進行表shinko!G44,\"W\"))","v":""},null,null,null,null,null,0]
[0,null,null,null,null,null,null,4,{"$f":"登録touroku!C24","v":"吉田智直"},null,null,{"$f":"IF(進行表shinko!F56=\"\",\"\",IF(進行表shinko!F56<180,進行表shinko!F56,\"W\"))","v":97},{"$f":"IF(進行表shinko!F64=\"\",\"\",IF(進行表shinko!F64<180,進行表shinko!F64,\"W\"))","v":""},{"$f":"IF(進行表shinko!F72=\"\",\"\",IF(進行表shinko!F72<180,進行表shinko!F72,\"W\"))","v":""},{"$f":"IF(進行表shinko!F16=\"\",\"\",IF(進行表shinko!F16<180,進行表shinko!F16,\"W\"))","v":"W"},{"$f":"IF(進行表shinko!F24=\"\",\"\",IF(進行表shinko!F24<180,進行表shinko!F24,\"W\"))","v":"W"},{"$f":"IF(進行表shinko!F32=\"\",\"\",IF(進行表shinko!F32<180,進行表shinko!F32,\"W\"))","v":"W"},{"$f":"IF(進行表shinko!F40=\"\",\"\",IF(進行表shinko!F40<180,進行表shinko!F40,\"W\"))","v":"W"},{"$f":"IF(進行表shinko!F48=\"\",\"\",IF(進行表shinko!F48<180,進行表shinko!F48,\"W\"))","v":"W"},null,null,null,null,null,4,{"$f":"登録touroku!E24","v":"岩本剛"},null,null,{"$f":"IF(進行表shinko!G37=\"\",\"\",IF(進行表shinko!G37<180,進行表shinko!G37,\"W\"))","v":"W"},{"$f":"IF(進行表shinko!G30=\"\",\"\",IF(進行表shinko!G30<180,進行表shinko!G30,\"W\"))","v":"W"},{"$f":"IF(進行表shinko!G23=\"\",\"\",IF(進行表shinko!G23<180,進行表shinko!G23,\"W\"))","v":"W"},{"$f":"IF(進行表shinko!G16=\"\",\"\",IF(進行表shinko!G16<180,進行表shinko!G16,\"W\"))","v":45},{"$f":"IF(進行表shinko!G73=\"\",\"\",IF(進行表shinko!G73<180,進行表shinko!G73,\"W\"))","v":""},{"$f":"IF(進行表shinko!G66=\"\",\"\",IF(進行表shinko!G66<180,進行表shinko!G66,\"W\"))","v":""},{"$f":"IF(進行表shinko!G59=\"\",\"\",IF(進行表shinko!G59<180,進行表shinko!G59,\"W\"))","v":127},{"$f":"IF(進行表shinko!G52=\"\",\"\",IF(進行表shinko!G52<180,進行表shinko!G52,\"W\"))","v":""},null,null,null,null,null,0]
[0,null,null,null,null,null,null,5,{"$f":"登録touroku!C25","v":"小堀泰次郎"},null,null,{"$f":"IF(進行表shinko!F49=\"\",\"\",IF(進行表shinko!F49<180,進行表shinko!F49,\"W\"))","v":"W"},{"$f":"IF(進行表shinko!F57=\"\",\"\",IF(進行表shinko!F57<180,進行表shinko!F57,\"W\"))","v":"W"},{"$f":"IF(進行表shinko!F65=\"\",\"\",IF(進行表shinko!F65<180,進行表shinko!F65,\"W\"))","v":""},{"$f":"IF(進行表shinko!F73=\"\",\"\",IF(進行表shinko!F73<180,進行表shinko!F73,\"W\"))","v":""},{"$f":"IF(進行表shinko!F17=\"\",\"\",IF(進行表shinko!F17<180,進行表shinko!F17,\"W\"))","v":"W"},{"$f":"IF(進行表shinko!F25=\"\",\"\",IF(進行表shinko!F25<180,進行表shinko!F25,\"W\"))","v":"W"},{"$f":"IF(進行表shinko!F33=\"\",\"\",IF(進行表shinko!F33<180,進行表shinko!F33,\"W\"))","v":"W"},{"$f":"IF(進行表shinko!F41=\"\",\"\",IF(進行表shinko!F41<180,進行表shinko!F41,\"W\"))","v":119},null,null,null,null,null,5,{"$f":"登録touroku!E25","v":"長谷川進"},null,null,{"$f":"IF(進行表shinko!G45=\"\",\"\",IF(進行表shinko!G45<180,進行表shinko!G45,\"W\"))","v":86},{"$f":"IF(進行表shinko!G38=\"\",\"\",IF(進行表shinko!G38<180,進行表shinko!G38,\"W\"))","v":"W"},{"$f":"IF(進行表shinko!G31=\"\",\"\",IF(進行表shinko!G31<180,進行表shinko!G31,\"W\"))","v":29},{"$f":"IF(進行表shinko!G24=\"\",\"\",IF(進行表shinko!G24<180,進行表shinko!G24,\"W\"))","v":169},{"$f":"IF(進行表shinko!G17=\"\",\"\",IF(進行表shinko!G17<180,進行表shinko!G17,\"W\"))","v":108},{"$f":"IF(進行表shinko!G74=\"\",\"\",IF(進行表shinko!G74<180,進行表shinko!G74,\"W\"))","v":""},{"$f":"IF(進行表shinko!G67=\"\",\"\",IF(進行表shinko!G67<180,進行表shinko!G67,\"W\"))","v":""},{"$f":"IF(進行表shinko!G60=\"\",\"\",IF(進行表shinko!G60<180,進行表shinko!G60,\"W\"))","v":""},null,null,null,null,null,0]
[0,null,null,null,null,null,null,6,{"$f":"登録touroku!C26","v":"上倉淑敬"},null,null,{"$f":"IF(進行表shinko!F42=\"\",\"\",IF(進行表shinko!F42<180,進行表shinko!F42,\"W\"))","v":"W"},{"$f":"IF(進行表shinko!F50=\"\",\"\",IF(進行表shinko!F50<180,進行表shinko!F50,\"W\"))","v":89},{"$f":"IF(進行表shinko!F58=\"\",\"\",IF(進行表shinko!F58<180,進行表shinko!F58,\"W\"))","v":6},{"$f":"IF(進行表shinko!F66=\"\",\"\",IF(進行表shinko!F66<180,進行表shinko!F66,\"W\"))","v":""},{"$f":"IF(進行表shinko!F74=\"\",\"\",IF(進行表shinko!F74<180,進行表shinko!F74,\"W\"))","v":""},{"$f":"IF(進行表shinko!F18=\"\",\"\",IF(進行表shinko!F18<180,進行表shinko!F18,\"W\"))","v":"W"},{"$f":"IF(進行表shinko!F26=\"\",\"\",IF(進行表shinko!F26<180,進行表shinko!F26,\"W\"))","v":"W"},{"$f":"IF(進行表shinko!F34=\"\",\"\",IF(進行表shinko!F34<180,進行表shinko!F34,\"W\"))","v":87},null,null,null,null,null,6,{"$f":"登録touroku!E26","v":"井本高史"},null,null,{"$f":"IF(進行表shinko!G53=\"\",\"\",IF(進行表shinko!G53<180,進行表shinko!G53,\"W\"))","v":67},{"$f":"IF(進行表shinko!G46=\"\",\"\",IF(進行表shinko!G46<180,進行表shinko!G45,\"W\"))","v":86},{"$f":"IF(進行表shinko!G39=\"\",\"\",IF(進行表shinko!G39<180,進行表shinko!G39,\"W\"))","v":31},{"$f":"IF(進行表shinko!G32=\"\",\"\",IF(進行表shinko!G32<180,進行表shinko!G32,\"W\"))","v":20},{"$f":"IF(進行表shinko!G25=\"\",\"\",IF(進行表shinko!G25<180,進行表shinko!G25,\"W\"))","v":54},{"$f":"IF(進行表shinko!G18=\"\",\"\",IF(進行表shinko!G18<180,進行表shinko!G18,\"W\"))","v":102},{"$f":"IF(進行表shinko!G75=\"\",\"\",IF(進行表shinko!G75<180,進行表shinko!G75,\"W\"))","v":""},{"$f":"IF(進行表shinko!G68=\"\",\"\",IF(進行表shinko!G68<180,進行表shinko!G68,\"W\"))","v":""},null,null,null,null,null,0]
[0,null,null,null,null,null,null,7,{"$f":"登録touroku!C27","v":"森田由佳里"},null,null,{"$f":"IF(進行表shinko!F35=\"\",\"\",IF(進行表shinko!F35<180,進行表shinko!F35,\"W\"))","v":49},{"$f":"IF(進行表shinko!F43=\"\",\"\",IF(進行表shinko!F43<180,進行表shinko!F43,\"W\"))","v":23},{"$f":"IF(進行表shinko!F51=\"\",\"\",IF(進行表shinko!F51<180,進行表shinko!F51,\"W\"))","v":107},{"$f":"IF(進行表shinko!F59=\"\",\"\",IF(進行表shinko!F59<180,進行表shinko!F59,\"W\"))","v":"W"},{"$f":"IF(進行表shinko!F67=\"\",\"\",IF(進行表shinko!F67<180,進行表shinko!F67,\"W\"))","v":""},{"$f":"IF(進行表shinko!F75=\"\",\"\",IF(進行表shinko!F75<180,進行表shinko!F75,\"W\"))","v":""},{"$f":"IF(進行表shinko!F19=\"\",\"\",IF(進行表shinko!F19<180,進行表shinko!F19,\"W\"))","v":"W"},{"$f":"IF(進行表shinko!F27=\"\",\"\",IF(進行表shinko!F27<180,進行表shinko!F27,\"W\"))","v":"W"},null,null,null,null,null,7,{"$f":"登録touroku!E27","v":"宮野早織"},null,null,{"$f":"IF(進行表shinko!G61=\"\",\"\",IF(進行表shinko!G61<180,進行表shinko!G61,\"W\"))","v":""},{"$f":"IF(進行表shinko!G54=\"\",\"\",IF(進行表shinko!G54<180,進行表shinko!G54,\"W\"))","v":"W"},{"$f":"IF(進行表shinko!G47=\"\",\"\",IF(進行表shinko!G47<180,進行表shinko!G47,\"W\"))","v":99},{"$f":"IF(進行表shinko!G40=\"\",\"\",IF(進行表shinko!G40<180,進行表shinko!G40,\"W\"))","v":98},{"$f":"IF(進行表shinko!G33=\"\",\"\",IF(進行表shinko!G33<180,進行表shinko!G33,\"W\"))","v":105},{"$f":"IF(進行表shinko!G26=\"\",\"\",IF(進行表shinko!G26<180,進行表shinko!G26,\"W\"))","v":81},{"$f":"IF(進行表shinko!G19=\"\",\"\",IF(進行表shinko!G19<180,進行表shinko!G19,\"W\"))","v":63},{"$f":"IF(進行表shinko!G76=\"\",\"\",IF(進行表shinko!G76<180,進行表shinko!G76,\"W\"))","v":""},null,null,null,null,null,0]
[0,null,null,null,null,null,null,null,null,null,null,{"$f":"IF(進行表shinko!F28=\"\",\"\",IF(進行表shinko!F28<180,進行表shinko!F28,\"W\"))","v":""},{"$f":"IF(進行表shinko!F36=\"\",\"\",IF(進行表shinko!F36<180,進行表shinko!F36,\"W\"))","v":""},{"$f":"IF(進行表shinko!F44=\"\",\"\",IF(進行表shinko!F44<180,進行表shinko!F44,\"W\"))","v":""},{"$f":"IF(進行表shinko!F52=\"\",\"\",IF(進行表shinko!F52<180,進行表shinko!F52,\"W\"))","v":""},{"$f":"IF(進行表shinko!F60=\"\",\"\",IF(進行表shinko!F60<180,進行表shinko!F60,\"W\"))","v":""},{"$f":"IF(進行表shinko!F68=\"\",\"\",IF(進行表shinko!F68<180,進行表shinko!F68,\"W\"))","v":""},{"$f":"IF(進行表shinko!F76=\"\",\"\",IF(進行表shinko!F76<180,進行表shinko!F76,\"W\"))","v":""},{"$f":"IF(進行表shinko!F20=\"\",\"\",IF(進行表shinko!F20<180,進行表shinko!F20,\"W\"))","v":""},null,null,null,null,null,null,null,null,null,{"$f":"IF(進行表shinko!G69=\"\",\"\",IF(進行表shinko!G69<180,進行表shinko!G69,\"W\"))","v":""},{"$f":"IF(進行表shinko!G62=\"\",\"\",IF(進行表shinko!G62<180,進行表shinko!G62,\"W\"))","v":""},{"$f":"IF(進行表shinko!G55=\"\",\"\",IF(進行表shinko!G55<180,進行表shinko!G55,\"W\"))","v":"W"},{"$f":"IF(進行表shinko!G48=\"\",\"\",IF(進行表shinko!G48<180,進行表shinko!G48,\"W\"))","v":15},{"$f":"IF(進行表shinko!G41=\"\",\"\",IF(進行表shinko!G41<180,進行表shinko!G41,\"W\"))","v":"W"},{"$f":"IF(進行表shinko!G34=\"\",\"\",IF(進行表shinko!G34<180,進行表shinko!G34,\"W\"))","v":"W"},{"$f":"IF(進行表shinko!G27=\"\",\"\",IF(進行表shinko!G27<180,進行表shinko!G27,\"W\"))","v":164},{"$f":"IF(進行表shinko!G20=\"\",\"\",IF(進行表shinko!G20<180,進行表shinko!G20,\"W\"))","v":""},null,null,null,null,null,0]

{"sheet":"Sheet1","index":7,"n_rows":0,"n_cols":0,"rows_kept":0,"cut":false,"hidden":false,"merged":[]}