{"text_format":"1","workbook":"xlsx","n_sheets":6,"sheets":["登録","対戦カード","★個人成績表★","★対戦リーグ表★","結果入力表","★総合結果表★"],"not_rendered":{"charts":0,"images":3,"macros":1,"external_links":0,"defined_names":7,"comments":0,"pivot_tables":0},"unopened":[],"bounds":{"document_bytes":16777216,"sheet_cells":100000,"rows_first":2000,"rows_last":500,"rows_between":2000,"halvings":0,"cell_chars":16384,"cell_head_chars":4096},"cells_cut":0,"cells_raw":0,"read":"whole","date_system":"1900"}

{"sheet":"登録","index":0,"n_rows":211,"n_cols":70,"rows_kept":211,"cut":false,"hidden":false,"merged":[[18,1,18,2],[17,3,17,4],[18,3,18,4],[17,1,17,2],[16,6,16,7],[18,6,18,7],[16,18,16,19],[16,21,16,22],[4,4,4,6],[4,8,4,9],[17,18,17,19],[17,21,17,22],[16,15,16,16],[7,10,7,13],[8,10,8,13],[9,10,9,13],[10,10,10,13],[16,12,16,13],[16,9,16,10],[17,6,17,7],[18,9,18,10],[18,15,18,16],[17,15,17,16],[18,18,18,19],[18,21,18,22],[17,9,17,10],[21,18,21,19],[21,21,21,22],[20,15,20,16],[0,8,0,11],[19,1,19,2],[19,3,19,4],[19,6,19,7],[19,9,19,10],[16,1,16,2],[2,4,2,7],[14,1,15,2],[16,3,16,4],[11,10,11,13],[21,12,21,13],[20,12,20,13],[18,12,18,13],[21,1,21,2],[21,3,21,4],[21,6,21,7],[21,9,21,10],[21,15,21,16],[20,18,20,19],[20,21,20,22],[20,1,20,2],[20,3,20,4],[20,6,20,7],[20,9,20,10],[19,18,19,19],[19,21,19,22],[17,12,17,13],[19,12,19,13],[19,15,19,16]]}
["対抗戦名称",null,null,null,"第",31,"回",null,"京阪神和奈滋",null,null,null,"対抗戦",null,null,null,null,null,null,null,null,null,null,null,null,null,null,null,null,null,"選手ID","チーム","選手名","持点",null,null,null,null,null,"G-No",{"$f":"Q5","v":6},"クラブ",null,null,null,null,null,null,null,null,null,null,null,null,"対戦順クラブID",null,null,null,null,null,"対抗戦順クラブ名"]
[null,null,null,null,null,null,null,null,null,null,null,null,null,null,null,null,null,null,null,null,null,null,null,null,null,null,null,null,null,null,11,{"$f":"B$17","v":"KRC"},{"$f":"D17","v":"松好　太一"},{"$f":"F17","v":120},1,"第1節",null,null,null,1,3,1,{"$f":"VLOOKUP(AO2,$AZ$3:$BA$8,2,FALSE)","v":"SBC"},{"$f":"VLOOKUP(VALUE(AO2&AP2),$AE$2:$AG$55,3,FALSE)","v":"林　秀忠"},{"$f":"VLOOKUP(VALUE(AU2&AV2),$AE$2:$AG$55,3,FALSE)","v":"吉向　翔平"},{"$f":"VLOOKUP(AU2,$AZ$3:$BA$8,2,FALSE)","v":"NRC"},4,1,null,null,null,"クラブID","クラブ名",null,"6クラブ",null,null,null,null,null,"6クラブ",null,null,null,null,null,"5クラブ"]
["開催日",null,null,null,"2019-01-13",null,null,null,null,null,null,null,null,null,null,null,null,null,null,null,null,null,null,null,null,null,null,null,null,null,12,"KRC",{"$f":"G17","v":"清水　義晴"},{"$f":"I17","v":120},2,null,null,null,null,2,{"$f":"AO2","v":3},2,"SBC","大橋　義治","岩本　剛",{"$f":"VLOOKUP(AU3,$AZ$3:$BA$8,2,FALSE)","v":"NRC"},{"$f":"AU2","v":4},2,null,null,null,1,{"$f":"B17","v":"KRC"},null,6,5,4,3,2,null,{"$f":"IF(VLOOKUP(BC3,$AZ$3:$BA$8,2,TRUE)=0,\"\",VLOOKUP(BC3,$AZ$3:$BA$8,2,TRUE))","v":"WRC"},"ORC","NRC","SBC","HRC",null,{"$f":"BJ3","v":"ORC"},{"$f":"BK3","v":"NRC"},{"$f":"BL3","v":"SBC"},{"$f":"BM3","v":"HRC"}]
[null,null,null,null,null,null,null,null,null,null,null,null,null,null,null,null,null,null,null,null,null,null,null,null,null,null,null,null,null,null,13,"KRC",{"$f":"J17","v":"鈴木　康文"},{"$f":"L17","v":120},3,null,null,null,null,3,3,3,"SBC","山中　康寛","白戸　玲人","NRC",4,3,null,null,null,2,"HRC",null,5,3,6,4,1,null,"ORC","SBC","WRC","NRC","KRC",null,{"$f":"BI4","v":"ORC"},{"$f":"BJ4","v":"SBC"},{"$f":"BL4","v":"NRC"},{"$f":"BM4","v":"KRC"}]
["会場",null,null,null,"玉出エース",null,null,"（","奈良",null,"）",null,null,null,null,null,{"$f":"COUNTA(D17:E22)","v":6},"クラブ",null,{"$f":"COUNTA(D17,G17,J17,M17,P17,S17,V17,Y17)","v":7},"名対抗",null,null,null,null,null,null,null,null,null,14,"KRC",{"$f":"M17","v":"早川　徹"},{"$f":"O17","v":120},4,null,null,null,null,4,3,4,"SBC","西峰　久祐","植田　慎也","NRC",4,4,null,null,null,3,"SBC",null,4,2,5,1,6,null,"NRC","HRC","ORC","KRC","WRC",null,{"$f":"BI5","v":"NRC"},{"$f":"BJ5","v":"HRC"},{"$f":"BK5","v":"ORC"},{"$f":"BL5","v":"KRC"}]
[null,null,null,null,null,null,null,null,null,null,null,null,null,null,null,null,null,null,null,null,null,null,null,null,null,null,null,null,null,null,15,"KRC",{"$f":"P17","v":"井関　一成"},{"$f":"R17","v":120},5,null,null,null,null,5,3,5,"SBC","大橋　正寛","近藤　拓馬","NRC",4,5,null,null,null,4,"NRC",null,3,6,1,2,5,null,"SBC","WRC","KRC","HRC","ORC",null,{"$f":"BI6","v":"SBC"},{"$f":"BK6","v":"KRC"},{"$f":"BL6","v":"HRC"},{"$f":"BM6","v":"ORC"}]
["【持点の設定】",null,null,null,"C","：","クラス",null,"点数",null,"備考",null,null,null,null,null,null,null,null,null,null,null,null,null,null,null,null,null,null,null,16,"KRC",{"$f":"S17","v":"今村　哲也"},{"$f":"U17","v":120},6,null,null,null,null,6,3,6,"SBC","秋田　倫央","長谷川　進","NRC",4,6,null,null,null,5,"ORC",null,2,1,3,6,4,null,"HRC","KRC","SBC","WRC","NRC",null,{"$f":"BI7","v":"HRC"},{"$f":"BJ7","v":"KRC"},{"$f":"BK7","v":"SBC"},{"$f":"BM7","v":"NRC"}]
[null,null,null,null,"M","：","男性",null,120,"点",null,null,null,null,null,null,null,null,null,null,null,null,null,null,null,null,null,null,null,null,17,"KRC",{"$f":"V17","v":"森田由佳里"},{"$f":"X17","v":100},7,null,null,null,null,7,3,7,"SBC","大橋　洋子","白戸　恭子","NRC",4,7,null,null,null,6,"WRC",null,1,4,2,5,3,null,"KRC","NRC","HRC","ORC","SBC"]
[null,null,null,null,"W","：","女性",null,100,"点",null,null,null,null,null,null,null,null,null,null,null,null,null,null,null,null,null,null,null,null,18,"KRC",{"$f":"Y17","v":0},{"$f":"AA17","v":0},8,null,null,null,null,8,2,1,"HRC","鐵山　泰三","松居　勝巳","ORC",5,1]
[null,null,null,null,null,"：",null,null,null,"点",null,null,null,null,null,null,null,null,null,null,null,null,null,null,null,null,null,null,null,null,19,"KRC",null,null,9,null,null,null,null,9,2,2,"HRC","堂園　雅也","藤明　宏樹","ORC",5,2]
[null,null,null,null,null,"：",null,null,null,"点",null,null,null,null,null,null,null,null,null,null,null,null,null,null,null,null,null,null,null,null,21,{"$f":"B$18","v":"HRC"},{"$f":"D18","v":"鐵山　泰三"},{"$f":"F18","v":120},10,null,null,null,null,10,2,3,"HRC","宮本　一","吉岡　保俊","ORC",5,3,null,null,null,6,"クラブ",null,5,"クラブ"]
[null,null,null,null,null,"：",null,null,null,"点",null,null,null,null,null,null,null,null,null,null,null,null,null,null,null,null,null,null,null,null,22,"HRC",{"$f":"G18","v":"堂園　雅也"},{"$f":"I18","v":120},11,null,null,null,null,11,2,4,"HRC","伊藤　登","村上　泰辰","ORC",5,4,null,null,"1節目","1順目",3,4,3,4]
[null,null,null,null,null,null,null,null,null,null,null,null,null,null,null,null,null,null,null,null,null,null,null,null,null,null,null,null,null,null,23,"HRC",{"$f":"J18","v":"宮本　一"},{"$f":"L18","v":120},12,null,null,null,null,12,2,5,"HRC","宮井健太郎","小原　嘉丈","ORC",5,5,null,null,null,null,2,5,2,5]
["出場選手",null,null,null,null,null,null,null,null,null,null,null,null,null,null,null,null,null,null,null,null,null,null,null,null,null,null,null,null,null,24,"HRC",{"$f":"M18","v":"伊藤　登"},{"$f":"O18","v":120},13,null,null,null,null,13,2,6,"HRC","白澤雄一郎","乾　伸綱","ORC",5,6,null,null,null,null,1,6,1,4]
[null,"チーム",null,1,null,null,2,null,null,3,null,null,4,null,null,5,null,null,6,null,null,7,null,null,null,null,null,null,null,null,25,"HRC",{"$f":"P18","v":"宮井健太郎"},{"$f":"R18","v":120},14,null,null,null,null,14,2,7,"HRC","河地　恵里","山崎真紀子","ORC",5,7,null,null,null,"2順目",2,3,2,3]
[null,null,null,"選手名",null,"持点","選手名",null,"持点","選手名",null,"持点","選手名",null,"持点","選手名",null,"持点","選手名",null,"持点","選手名",null,"持点",null,null,null,null,null,null,26,"HRC",{"$f":"S18","v":"白澤雄一郎"},{"$f":"U18","v":120},15,null,null,null,null,15,1,1,"KRC","松好　太一","末岡　修","WRC",{"$f":"IF(AO1=5,4,6)","v":6},1,null,null,null,null,6,4,1,5]
[null,"KRC",null,"松好　太一",null,120,"清水　義晴",null,120,"鈴木　康文",null,120,"早川　徹",null,120,"井関　一成",null,120,"今村　哲也",null,120,"森田由佳里",null,100,null,null,null,null,null,null,27,"HRC",{"$f":"V18","v":"河地　恵里"},{"$f":"X18","v":100},16,null,null,null,null,16,{"$f":"AO16","v":1},2,"KRC","清水　義晴","和田宗一郎","WRC",{"$f":"AU16","v":6},2,null,null,null,null,1,5,4,2]
[null,"HRC",null,"鐵山　泰三",null,120,"堂園　雅也",null,120,"宮本　一",null,120,"伊藤　登",null,120,"宮井健太郎",null,120,"白澤雄一郎",null,120,"河地　恵里",null,100,null,null,null,null,null,null,28,"HRC",{"$f":"Y18","v":0},{"$f":"AA18","v":0},17,null,null,null,null,17,1,3,"KRC","鈴木　康文","杉本　博章","WRC",6,3,null,null,null,"3順目",6,2,3,5]
[null,"SBC",null,"林　秀忠",null,120,"大橋　義治",null,120,"山中　康寛",null,120,"西峰　久祐",null,120,"大橋　正寛",null,120,"秋田　倫央",null,120,"大橋　洋子",null,100,null,null,null,null,null,null,29,"HRC",null,null,18,null,null,null,null,18,1,4,"KRC","早川　徹","中本　雅大","WRC",6,4,null,null,null,null,5,3,1,2]
[null,"NRC",null,"吉向　翔平",null,120,"岩本　剛",null,120,"白戸　玲人",null,120,"植田　慎也",null,120,"近藤　拓馬",null,120,"長谷川　進",null,120,"白戸　恭子",null,100,null,null,null,null,null,null,31,{"$f":"B$19","v":"SBC"},{"$f":"D19","v":"林　秀忠"},{"$f":"F19","v":120},19,null,null,null,null,19,1,5,"KRC","井関　一成","山中　康介","WRC",6,5,null,null,null,null,1,4,4,5]
[null,"ORC",null,"松居　勝巳",null,120,"藤明　宏樹",null,120,"吉岡　保俊",null,120,"村上　泰辰",null,120,"小原　嘉丈",null,120,"乾　伸綱",null,120,"山崎真紀子",null,100,null,null,null,null,null,null,32,"SBC",{"$f":"G19","v":"大橋　義治"},{"$f":"I19","v":120},20,null,null,null,null,20,1,6,"KRC","今村　哲也","芝先　泰生","WRC",6,6,null,null,null,"4順目",5,6,3,1]
[null,"WRC",null,"末岡　修",null,120,"和田宗一郎",null,120,"杉本　博章",null,120,"中本　雅大",null,120,"山中　康介",null,120,"芝先　泰生",null,120,"松房ゆかり",null,100,null,null,null,null,null,null,33,"SBC",{"$f":"J19","v":"山中　康寛"},{"$f":"L19","v":120},21,null,null,null,null,21,1,7,"KRC","森田由佳里","松房ゆかり","WRC",6,7,null,null,null,null,4,2,2,5]
[null,null,null,null,null,null,null,null,null,null,null,null,null,null,null,null,null,null,null,null,null,null,null,null,null,null,null,null,null,null,34,"SBC",{"$f":"M19","v":"西峰　久祐"},{"$f":"O19","v":120},22,null,null,null,null,22,2,1,"HRC","鐵山　泰三","林　秀忠","SBC",3,1,null,null,null,null,1,3,3,4]
[null,null,null,null,null,null,null,null,null,null,null,null,null,null,null,null,null,null,null,null,null,null,null,null,null,null,null,null,null,null,35,"SBC",{"$f":"P19","v":"大橋　正寛"},{"$f":"R19","v":120},23,null,null,null,null,23,{"$f":"AO23","v":2},2,"HRC","堂園　雅也","大橋　義治","SBC",{"$f":"AU23","v":3},2,null,null,null,"5順目",4,5,1,5]
[null,null,null,null,null,null,null,null,null,null,null,null,"くにゆき",null,null,"こうじ",null,null,null,null,null,null,null,null,null,null,null,null,null,null,36,"SBC",{"$f":"S19","v":"秋田　倫央"},{"$f":"U19","v":120},24,null,null,null,null,24,2,3,"HRC","宮本　一","山中　康寛","SBC",3,3,null,null,null,null,3,6,3,2]
[null,null,null,null,null,null,null,null,null,null,null,null,"やすひろ",null,null,null,null,null,null,null,null,null,null,null,null,null,null,null,null,null,37,"SBC",{"$f":"V19","v":"大橋　洋子"},{"$f":"X19","v":100},25,null,null,null,null,25,2,4,"HRC","伊藤　登","西峰　久祐","SBC",3,4,null,null,null,null,1,2,1,4]
[null,null,null,null,null,null,null,null,null,null,null,null,null,null,null,null,null,null,null,null,null,null,null,null,null,null,null,null,null,null,38,"SBC",{"$f":"Y19","v":0},{"$f":"AA19","v":0},26,null,null,null,null,26,2,5,"HRC","宮井健太郎","大橋　正寛","SBC",3,5,null,null,"2節目","1順目",3,4,3,5]
[null,null,null,null,null,null,null,null,null,null,null,null,null,null,null,null,null,null,null,null,null,null,null,null,null,null,null,null,null,null,39,"SBC",null,null,27,null,null,null,null,27,2,6,"HRC","白澤雄一郎","秋田　倫央","SBC",3,6,null,null,null,null,2,5,4,2]
[null,null,null,null,null,null,null,null,null,null,null,null,null,null,null,null,null,null,null,null,null,null,null,null,null,null,null,null,null,null,41,{"$f":"B$20","v":"NRC"},{"$f":"D20","v":"吉向　翔平"},{"$f":"F20","v":120},28,null,null,null,null,28,2,7,"HRC","河地　恵里","大橋　洋子","SBC",3,7,null,null,null,null,1,6,3,1]
[null,null,null,null,null,null,null,null,null,null,null,null,null,null,null,null,null,null,null,null,null,null,null,null,null,null,null,null,null,null,42,"NRC",{"$f":"G20","v":"岩本　剛"},{"$f":"I20","v":120},29,null,null,null,null,29,{"$f":"IF(AO1=5,1,6)","v":6},1,"WRC","末岡　修","吉向　翔平","NRC",{"$f":"IF(AO1=5,5,4)","v":4},1,null,null,null,"2順目",2,3,4,5]
[null,null,null,null,null,null,null,null,null,null,null,null,null,null,null,null,null,null,null,null,null,null,null,null,null,null,null,null,null,null,43,"NRC",{"$f":"J20","v":"白戸　玲人"},{"$f":"L20","v":120},30,null,null,null,null,30,{"$f":"AO30","v":6},2,"WRC","和田宗一郎","岩本　剛","NRC",{"$f":"AU30","v":4},2,null,null,null,null,6,4,1,2]
[null,null,null,null,null,null,null,null,null,null,null,null,null,null,null,null,null,null,null,null,null,null,null,null,null,null,null,null,null,null,44,"NRC",{"$f":"M20","v":"植田　慎也"},{"$f":"O20","v":120},31,null,null,null,null,31,6,3,"WRC","杉本　博章","白戸　玲人","NRC",4,3,null,null,null,null,1,5]
[null,null,null,null,null,null,null,null,null,null,null,null,null,null,null,null,null,null,null,null,null,null,null,null,null,null,null,null,null,null,45,"NRC",{"$f":"P20","v":"近藤　拓馬"},{"$f":"R20","v":120},32,null,null,null,null,32,6,4,"WRC","中本　雅大","植田　慎也","NRC",4,4,null,null,null,"3順目",6,2]
[null,null,null,null,null,null,null,null,null,null,null,null,null,null,null,null,null,null,null,null,null,null,null,null,null,null,null,null,null,null,46,"NRC",{"$f":"S20","v":"長谷川　進"},{"$f":"U20","v":120},33,null,null,null,null,33,6,5,"WRC","山中　康介","近藤　拓馬","NRC",4,5,null,null,null,null,5,3]
[null,null,null,null,null,null,null,null,null,null,null,null,null,null,null,null,null,null,null,null,null,null,null,null,null,null,null,null,null,null,47,"NRC",{"$f":"V20","v":"白戸　恭子"},{"$f":"X20","v":100},34,null,null,null,null,34,6,6,"WRC","芝先　泰生","長谷川　進","NRC",4,6,null,null,null,null,1,4]
[null,null,null,null,null,null,null,null,null,null,null,null,null,null,null,null,null,null,null,null,null,null,null,null,null,null,null,null,null,null,48,"NRC",{"$f":"Y20","v":0},{"$f":"AA20","v":0},35,null,null,null,null,35,6,7,"WRC","松房ゆかり","白戸　恭子","NRC",4,7,null,null,null,"4順目",5,6]
[null,null,null,null,null,null,null,null,null,null,null,null,null,null,null,null,null,null,null,null,null,null,null,null,null,null,null,null,null,null,49,"NRC",null,null,36,null,null,null,null,36,{"$f":"IF(AO1=5,4,1)","v":1},1,"KRC","松好　太一","松居　勝巳","ORC",{"$f":"IF(AO1=5,2,5)","v":5},1,null,null,null,null,4,2]
[null,null,null,null,null,null,null,null,null,null,null,null,null,null,null,null,null,null,null,null,null,null,null,null,null,null,null,null,null,null,51,{"$f":"B$21","v":"ORC"},{"$f":"D21","v":"松居　勝巳"},{"$f":"F21","v":120},37,null,null,null,null,37,1,2,"KRC","清水　義晴","藤明　宏樹","ORC",{"$f":"AU37","v":5},2,null,null,null,null,1,3]
[null,null,null,null,null,null,null,null,null,null,null,null,null,null,null,null,null,null,null,null,null,null,null,null,null,null,null,null,null,null,52,"ORC",{"$f":"G21","v":"藤明　宏樹"},{"$f":"I21","v":120},38,null,null,null,null,38,1,3,"KRC","鈴木　康文","吉岡　保俊","ORC",5,3,null,null,null,"5順目",4,5]
[null,null,null,null,null,null,null,null,null,null,null,null,null,null,null,null,null,null,null,null,null,null,null,null,null,null,null,null,null,null,53,"ORC",{"$f":"J21","v":"吉岡　保俊"},{"$f":"L21","v":120},39,null,null,null,null,39,1,4,"KRC","早川　徹","村上　泰辰","ORC",5,4,null,null,null,null,3,6]
[null,null,null,null,null,null,null,null,null,null,null,null,null,null,null,null,null,null,null,null,null,null,null,null,null,null,null,null,null,null,54,"ORC",{"$f":"M21","v":"村上　泰辰"},{"$f":"O21","v":120},40,null,null,null,null,40,1,5,"KRC","井関　一成","小原　嘉丈","ORC",5,5,null,null,null,null,1,2]
[null,null,null,null,null,null,null,null,null,null,null,null,null,null,null,null,null,null,null,null,null,null,null,null,null,null,null,null,null,null,55,"ORC",{"$f":"P21","v":"小原　嘉丈"},{"$f":"R21","v":120},41,null,null,null,null,41,1,6,"KRC","今村　哲也","乾　伸綱","ORC",5,6]
[null,null,null,null,null,null,null,null,null,null,null,null,null,null,null,null,null,null,null,null,null,null,null,null,null,null,null,null,null,null,56,"ORC",{"$f":"S21","v":"乾　伸綱"},{"$f":"U21","v":120},42,null,null,null,null,42,1,7,"KRC","森田由佳里","山崎真紀子","ORC",5,7]
[null,null,null,null,null,null,null,null,null,null,null,null,null,null,null,null,null,null,null,null,null,null,null,null,null,null,null,null,null,null,57,"ORC",{"$f":"V21","v":"山崎真紀子"},{"$f":"X21","v":100},43,null,null,null,null,43,{"$f":"IF(AO1=5,3,6)","v":6},1,"WRC","末岡　修","鐵山　泰三","HRC",{"$f":"IF(AO1=5,5,2)","v":2},1]
[null,null,null,null,null,null,null,null,null,null,null,null,null,null,null,null,null,null,null,null,null,null,null,null,null,null,null,null,null,null,58,"ORC",{"$f":"Y21","v":0},{"$f":"AA21","v":0},44,null,null,null,null,44,6,2,"WRC","和田宗一郎","堂園　雅也","HRC",{"$f":"AU44","v":2},2]
[null,null,null,null,null,null,null,null,null,null,null,null,null,null,null,null,null,null,null,null,null,null,null,null,null,null,null,null,null,null,59,"ORC",null,null,45,null,null,null,null,45,6,3,"WRC","杉本　博章","宮本　一","HRC",2,3]
[null,null,null,null,null,null,null,null,null,null,null,null,null,null,null,null,null,null,null,null,null,null,null,null,null,null,null,null,null,null,61,{"$f":"B$22","v":"WRC"},{"$f":"D22","v":"末岡　修"},{"$f":"F22","v":120},46,null,null,null,null,46,6,4,"WRC","中本　雅大","伊藤　登","HRC",2,4]
[null,null,null,null,null,null,null,null,null,null,null,null,null,null,null,null,null,null,null,null,null,null,null,null,null,null,null,null,null,null,62,"WRC",{"$f":"G22","v":"和田宗一郎"},{"$f":"I22","v":120},47,null,null,null,null,47,6,5,"WRC","山中　康介","宮井健太郎","HRC",2,5]
[null,null,null,null,null,null,null,null,null,null,null,null,null,null,null,null,null,null,null,null,null,null,null,null,null,null,null,null,null,null,63,"WRC",{"$f":"J22","v":"杉本　博章"},{"$f":"L22","v":120},48,null,null,null,null,48,6,6,"WRC","芝先　泰生","白澤雄一郎","HRC",2,6]
[null,null,null,null,null,null,null,null,null,null,null,null,null,null,null,null,null,null,null,null,null,null,null,null,null,null,null,null,null,null,64,"WRC",{"$f":"M22","v":"中本　雅大"},{"$f":"O22","v":120},49,null,null,null,null,49,6,7,"WRC","松房ゆかり","河地　恵里","HRC",2,7]
[null,null,null,null,null,null,null,null,null,null,null,null,null,null,null,null,null,null,null,null,null,null,null,null,null,null,null,null,null,null,65,"WRC",{"$f":"P22","v":"山中　康介"},{"$f":"R22","v":120},50,null,null,null,null,50,{"$f":"IF(AO1=5,1,5)","v":5},1,"ORC","松居　勝巳","林　秀忠","SBC",{"$f":"IF(AO1=5,2,3)","v":3},1]
[null,null,null,null,null,null,null,null,null,null,null,null,null,null,null,null,null,null,null,null,null,null,null,null,null,null,null,null,null,null,66,"WRC",{"$f":"S22","v":"芝先　泰生"},{"$f":"U22","v":120},51,null,null,null,null,51,5,2,"ORC","藤明　宏樹","大橋　義治","SBC",{"$f":"AU51","v":3},2]
[null,null,null,null,null,null,null,null,null,null,null,null,null,null,null,null,null,null,null,null,null,null,null,null,null,null,null,null,null,null,67,"WRC",{"$f":"V22","v":"松房ゆかり"},{"$f":"X22","v":100},52,null,null,null,null,52,5,3,"ORC","吉岡　保俊","山中　康寛","SBC",3,3]
[null,null,null,null,null,null,null,null,null,null,null,null,null,null,null,null,null,null,null,null,null,null,null,null,null,null,null,null,null,null,68,"WRC",{"$f":"Y22","v":0},{"$f":"AA22","v":0},53,null,null,null,null,53,5,4,"ORC","村上　泰辰","西峰　久祐","SBC",3,4]
[null,null,null,null,null,null,null,null,null,null,null,null,null,null,null,null,null,null,null,null,null,null,null,null,null,null,null,null,null,null,69,"WRC",null,null,54,null,null,null,null,54,5,5,"ORC","小原　嘉丈","大橋　正寛","SBC",3,5]
[null,null,null,null,null,null,null,null,null,null,null,null,null,null,null,null,null,null,null,null,null,null,null,null,null,null,null,null,null,null,null,null,null,null,55,null,null,null,null,55,5,6,"ORC","乾　伸綱","秋田　倫央","SBC",3,6]
[null,null,null,null,null,null,null,null,null,null,null,null,null,null,null,null,null,null,null,null,null,null,null,null,null,null,null,null,null,null,null,null,null,null,56,null,null,null,null,56,5,7,"ORC","山崎真紀子","大橋　洋子","SBC",3,7]
[null,null,null,null,null,null,null,null,null,null,null,null,null,null,null,null,null,null,null,null,null,null,null,null,null,null,null,null,null,null,null,null,null,null,57,null,null,null,null,57,{"$f":"IF(AO1=5,4,1)","v":1},1,"KRC","松好　太一","吉向　翔平","NRC",{"$f":"IF(AO1=5,5,4)","v":4},1]
[null,null,null,null,null,null,null,null,null,null,null,null,null,null,null,null,null,null,null,null,null,null,null,null,null,null,null,null,null,null,null,null,null,null,58,null,null,null,null,58,1,2,"KRC","清水　義晴","岩本　剛","NRC",{"$f":"AU58","v":4},2]
[null,null,null,null,null,null,null,null,null,null,null,null,null,null,null,null,null,null,null,null,null,null,null,null,null,null,null,null,null,null,null,null,null,null,59,null,null,null,null,59,1,3,"KRC","鈴木　康文","白戸　玲人","NRC",4,3]
[null,null,null,null,null,null,null,null,null,null,null,null,null,null,null,null,null,null,null,null,null,null,null,null,null,null,null,null,null,null,null,null,null,null,60,null,null,null,null,60,1,4,"KRC","早川　徹","植田　慎也","NRC",4,4]
[null,null,null,null,null,null,null,null,null,null,null,null,null,null,null,null,null,null,null,null,null,null,null,null,null,null,null,null,null,null,null,null,null,null,61,null,null,null,null,61,1,5,"KRC","井関　一成","近藤　拓馬","NRC",4,5]
[null,null,null,null,null,null,null,null,null,null,null,null,null,null,null,null,null,null,null,null,null,null,null,null,null,null,null,null,null,null,null,null,null,null,62,null,null,null,null,62,1,6,"KRC","今村　哲也","長谷川　進","NRC",4,6]
[null,null,null,null,null,null,null,null,null,null,null,null,null,null,null,null,null,null,null,null,null,null,null,null,null,null,null,null,null,null,null,null,null,null,63,null,null,null,null,63,1,7,"KRC","森田由佳里","白戸　恭子","NRC",4,7]
[null,null,null,null,null,null,null,null,null,null,null,null,null,null,null,null,null,null,null,null,null,null,null,null,null,null,null,null,null,null,null,null,null,null,64,null,null,null,null,64,{"$f":"IF(AO1=5,2,5)","v":5},1,"ORC","松居　勝巳","末岡　修","WRC",{"$f":"IF(AO1=5,1,6)","v":6},1]
[null,null,null,null,null,null,null,null,null,null,null,null,null,null,null,null,null,null,null,null,null,null,null,null,null,null,null,null,null,null,null,null,null,null,65,null,null,null,null,65,5,2,{"$f":"VLOOKUP(AO66,$AZ$3:$BA$8,2,FALSE)","v":"ORC"},{"$f":"VLOOKUP(VALUE(AO66&AP66),$AE$2:$AG$55,3,FALSE)","v":"藤明　宏樹"},{"$f":"VLOOKUP(VALUE(AU66&AV66),$AE$2:$AG$55,3,FALSE)","v":"和田宗一郎"},"WRC",{"$f":"AU65","v":6},2]
[null,null,null,null,null,null,null,null,null,null,null,null,null,null,null,null,null,null,null,null,null,null,null,null,null,null,null,null,null,null,null,null,null,null,66,null,null,null,null,66,5,3,"ORC","吉岡　保俊","杉本　博章",{"$f":"VLOOKUP(AU67,$AZ$3:$BA$8,2,FALSE)","v":"WRC"},6,3]
[null,null,null,null,null,null,null,null,null,null,null,null,null,null,null,null,null,null,null,null,null,null,null,null,null,null,null,null,null,null,null,null,null,null,67,null,null,null,null,67,5,4,"ORC","村上　泰辰","中本　雅大","WRC",6,4]
[null,null,null,null,null,null,null,null,null,null,null,null,null,null,null,null,null,null,null,null,null,null,null,null,null,null,null,null,null,null,null,null,null,null,68,null,null,null,null,68,5,5,"ORC","小原　嘉丈","山中　康介","WRC",6,5]
[null,null,null,null,null,null,null,null,null,null,null,null,null,null,null,null,null,null,null,null,null,null,null,null,null,null,null,null,null,null,null,null,null,null,69,null,null,null,null,69,5,6,"ORC","乾　伸綱","芝先　泰生","WRC",6,6]
[null,null,null,null,null,null,null,null,null,null,null,null,null,null,null,null,null,null,null,null,null,null,null,null,null,null,null,null,null,null,null,null,null,null,70,null,null,null,null,70,5,7,"ORC","山崎真紀子","松房ゆかり","WRC",6,7]
[null,null,null,null,null,null,null,null,null,null,null,null,null,null,null,null,null,null,null,null,null,null,null,null,null,null,null,null,null,null,null,null,null,null,71,{"$f":"IF($AO$1=6,\"\",\"第2節\")","v":""},null,null,null,71,{"$f":"IF(AO1=5,2,4)","v":4},1,"NRC","吉向　翔平","鐵山　泰三","HRC",{"$f":"IF(AO1=5,5,2)","v":2},1]
[null,null,null,null,null,null,null,null,null,null,null,null,null,null,null,null,null,null,null,null,null,null,null,null,null,null,null,null,null,null,null,null,null,null,72,null,null,null,null,72,4,2,"NRC","岩本　剛","堂園　雅也","HRC",{"$f":"AU72","v":2},2]
[null,null,null,null,null,null,null,null,null,null,null,null,null,null,null,null,null,null,null,null,null,null,null,null,null,null,null,null,null,null,null,null,null,null,73,null,null,null,null,73,4,3,"NRC","白戸　玲人","宮本　一","HRC",2,3]
[null,null,null,null,null,null,null,null,null,null,null,null,null,null,null,null,null,null,null,null,null,null,null,null,null,null,null,null,null,null,null,null,null,null,74,null,null,null,null,74,4,4,"NRC","植田　慎也","伊藤　登","HRC",2,4]
[null,null,null,null,null,null,null,null,null,null,null,null,null,null,null,null,null,null,null,null,null,null,null,null,null,null,null,null,null,null,null,null,null,null,75,null,null,null,null,75,4,5,"NRC","近藤　拓馬","宮井健太郎","HRC",2,5]
[null,null,null,null,null,null,null,null,null,null,null,null,null,null,null,null,null,null,null,null,null,null,null,null,null,null,null,null,null,null,null,null,null,null,76,null,null,null,null,76,4,6,"NRC","長谷川　進","白澤雄一郎","HRC",2,6]
[null,null,null,null,null,null,null,null,null,null,null,null,null,null,null,null,null,null,null,null,null,null,null,null,null,null,null,null,null,null,null,null,null,null,77,null,null,null,null,77,4,7,"NRC","白戸　恭子","河地　恵里","HRC",2,7]
[null,null,null,null,null,null,null,null,null,null,null,null,null,null,null,null,null,null,null,null,null,null,null,null,null,null,null,null,null,null,null,null,null,null,78,null,null,null,null,78,{"$f":"IF(AO1=5,3,1)","v":1},1,"KRC","松好　太一","林　秀忠","SBC",{"$f":"IF(AO1=5,4,3)","v":3},1]
[null,null,null,null,null,null,null,null,null,null,null,null,null,null,null,null,null,null,null,null,null,null,null,null,null,null,null,null,null,null,null,null,null,null,79,null,null,null,null,79,1,2,"KRC","清水　義晴","大橋　義治","SBC",{"$f":"AU79","v":3},2]
[null,null,null,null,null,null,null,null,null,null,null,null,null,null,null,null,null,null,null,null,null,null,null,null,null,null,null,null,null,null,null,null,null,null,80,null,null,null,null,80,1,3,"KRC","鈴木　康文","山中　康寛","SBC",3,3]
[null,null,null,null,null,null,null,null,null,null,null,null,null,null,null,null,null,null,null,null,null,null,null,null,null,null,null,null,null,null,null,null,null,null,81,null,null,null,null,81,1,4,"KRC","早川　徹","西峰　久祐","SBC",3,4]
[null,null,null,null,null,null,null,null,null,null,null,null,null,null,null,null,null,null,null,null,null,null,null,null,null,null,null,null,null,null,null,null,null,null,82,null,null,null,null,82,1,5,"KRC","井関　一成","大橋　正寛","SBC",3,5]
[null,null,null,null,null,null,null,null,null,null,null,null,null,null,null,null,null,null,null,null,null,null,null,null,null,null,null,null,null,null,null,null,null,null,83,null,null,null,null,83,1,6,"KRC","今村　哲也","秋田　倫央","SBC",3,6]
[null,null,null,null,null,null,null,null,null,null,null,null,null,null,null,null,null,null,null,null,null,null,null,null,null,null,null,null,null,null,null,null,null,null,84,null,null,null,null,84,1,7,"KRC","森田由佳里","大橋　洋子","SBC",3,7]
[null,null,null,null,null,null,null,null,null,null,null,null,null,null,null,null,null,null,null,null,null,null,null,null,null,null,null,null,null,null,null,null,null,null,85,null,null,null,null,85,{"$f":"IF(AO1=5,1,4)","v":4},1,"NRC","吉向　翔平","松居　勝巳","ORC",{"$f":"IF(AO1=5,5,5)","v":5},1]
[null,null,null,null,null,null,null,null,null,null,null,null,null,null,null,null,null,null,null,null,null,null,null,null,null,null,null,null,null,null,null,null,null,null,86,null,null,null,null,86,4,2,"NRC","岩本　剛","藤明　宏樹","ORC",{"$f":"AU86","v":5},2]
[null,null,null,null,null,null,null,null,null,null,null,null,null,null,null,null,null,null,null,null,null,null,null,null,null,null,null,null,null,null,null,null,null,null,87,null,null,null,null,87,4,3,"NRC","白戸　玲人","吉岡　保俊","ORC",5,3]
[null,null,null,null,null,null,null,null,null,null,null,null,null,null,null,null,null,null,null,null,null,null,null,null,null,null,null,null,null,null,null,null,null,null,88,null,null,null,null,88,4,4,"NRC","植田　慎也","村上　泰辰","ORC",5,4]
[null,null,null,null,null,null,null,null,null,null,null,null,null,null,null,null,null,null,null,null,null,null,null,null,null,null,null,null,null,null,null,null,null,null,89,null,null,null,null,89,4,5,"NRC","近藤　拓馬","小原　嘉丈","ORC",5,5]
[null,null,null,null,null,null,null,null,null,null,null,null,null,null,null,null,null,null,null,null,null,null,null,null,null,null,null,null,null,null,null,null,null,null,90,null,null,null,null,90,4,6,"NRC","長谷川　進","乾　伸綱","ORC",5,6]
[null,null,null,null,null,null,null,null,null,null,null,null,null,null,null,null,null,null,null,null,null,null,null,null,null,null,null,null,null,null,null,null,null,null,91,null,null,null,null,91,4,7,"NRC","白戸　恭子","山崎真紀子","ORC",5,7]
[null,null,null,null,null,null,null,null,null,null,null,null,null,null,null,null,null,null,null,null,null,null,null,null,null,null,null,null,null,null,null,null,null,null,92,null,null,null,null,92,{"$f":"IF(AO1=5,3,3)","v":3},1,"SBC","林　秀忠","末岡　修","WRC",{"$f":"IF(AO1=5,2,6)","v":6},1]
[null,null,null,null,null,null,null,null,null,null,null,null,null,null,null,null,null,null,null,null,null,null,null,null,null,null,null,null,null,null,null,null,null,null,93,null,null,null,null,93,3,2,"SBC","大橋　義治","和田宗一郎","WRC",{"$f":"AU93","v":6},2]
[null,null,null,null,null,null,null,null,null,null,null,null,null,null,null,null,null,null,null,null,null,null,null,null,null,null,null,null,null,null,null,null,null,null,94,null,null,null,null,94,{"$f":"AO94","v":3},3,"SBC","山中　康寛","杉本　博章","WRC",6,3]
[null,null,null,null,null,null,null,null,null,null,null,null,null,null,null,null,null,null,null,null,null,null,null,null,null,null,null,null,null,null,null,null,null,null,95,null,null,null,null,95,{"$f":"AO95","v":3},4,"SBC","西峰　久祐","中本　雅大","WRC",6,4]
[null,null,null,null,null,null,null,null,null,null,null,null,null,null,null,null,null,null,null,null,null,null,null,null,null,null,null,null,null,null,null,null,null,null,96,null,null,null,null,96,{"$f":"AO96","v":3},5,"SBC","大橋　正寛","山中　康介","WRC",6,5]
[null,null,null,null,null,null,null,null,null,null,null,null,null,null,null,null,null,null,null,null,null,null,null,null,null,null,null,null,null,null,null,null,null,null,97,null,null,null,null,97,{"$f":"AO97","v":3},6,"SBC","秋田　倫央","芝先　泰生","WRC",6,6]
[null,null,null,null,null,null,null,null,null,null,null,null,null,null,null,null,null,null,null,null,null,null,null,null,null,null,null,null,null,null,null,null,null,null,98,null,null,null,null,98,{"$f":"AO98","v":3},7,"SBC","大橋　洋子","松房ゆかり","WRC",6,7]
[null,null,null,null,null,null,null,null,null,null,null,null,null,null,null,null,null,null,null,null,null,null,null,null,null,null,null,null,null,null,null,null,null,null,99,null,null,null,null,99,{"$f":"IF(AO1=5,1,1)","v":1},1,"KRC","松好　太一","鐵山　泰三","HRC",{"$f":"IF(AO1=5,4,2)","v":2},1]
[null,null,null,null,null,null,null,null,null,null,null,null,null,null,null,null,null,null,null,null,null,null,null,null,null,null,null,null,null,null,null,null,null,null,100,null,null,null,null,100,{"$f":"AO100","v":1},2,"KRC","清水　義晴","堂園　雅也","HRC",{"$f":"AU100","v":2},2]
[null,null,null,null,null,null,null,null,null,null,null,null,null,null,null,null,null,null,null,null,null,null,null,null,null,null,null,null,null,null,null,null,null,null,101,null,null,null,null,101,1,3,"KRC","鈴木　康文","宮本　一","HRC",2,3]
[null,null,null,null,null,null,null,null,null,null,null,null,null,null,null,null,null,null,null,null,null,null,null,null,null,null,null,null,null,null,null,null,null,null,102,null,null,null,null,102,1,4,"KRC","早川　徹","伊藤　登","HRC",2,4]
[null,null,null,null,null,null,null,null,null,null,null,null,null,null,null,null,null,null,null,null,null,null,null,null,null,null,null,null,null,null,null,null,null,null,103,null,null,null,null,103,1,5,"KRC","井関　一成","宮井健太郎","HRC",2,5]
[null,null,null,null,null,null,null,null,null,null,null,null,null,null,null,null,null,null,null,null,null,null,null,null,null,null,null,null,null,null,null,null,null,null,104,null,null,null,null,104,1,6,"KRC","今村　哲也","白澤雄一郎","HRC",2,6]
[null,null,null,null,null,null,null,null,null,null,null,null,null,null,null,null,null,null,null,null,null,null,null,null,null,null,null,null,null,null,null,null,null,null,105,null,null,null,null,105,1,7,"KRC","森田由佳里","河地　恵里","HRC",2,7]
[null,null,null,null,null,null,null,null,null,null,null,null,null,null,null,null,null,null,null,null,null,null,null,null,null,null,null,null,null,null,null,null,null,null,106,{"$f":"IF($AO$1=6,\"第2節\",\"\")","v":"第2節"},null,null,null,106,{"$f":"IF(AO1=5,3,3)","v":3},3,"SBC","山中　康寛","植田　慎也","NRC",{"$f":"IF(AO1=5,5,4)","v":4},4]
[null,null,null,null,null,null,null,null,null,null,null,null,null,null,null,null,null,null,null,null,null,null,null,null,null,null,null,null,null,null,null,null,null,null,107,null,null,null,null,107,{"$f":"AO107","v":3},4,"SBC","西峰　久祐","近藤　拓馬","NRC",{"$f":"AU107","v":4},5]
[null,null,null,null,null,null,null,null,null,null,null,null,null,null,null,null,null,null,null,null,null,null,null,null,null,null,null,null,null,null,null,null,null,null,108,null,null,null,null,108,3,5,"SBC","大橋　正寛","長谷川　進","NRC",4,6]
[null,null,null,null,null,null,null,null,null,null,null,null,null,null,null,null,null,null,null,null,null,null,null,null,null,null,null,null,null,null,null,null,null,null,109,null,null,null,null,109,3,6,"SBC","秋田　倫央","白戸　恭子","NRC",4,7]
[null,null,null,null,null,null,null,null,null,null,null,null,null,null,null,null,null,null,null,null,null,null,null,null,null,null,null,null,null,null,null,null,null,null,110,null,null,null,null,110,3,7,"SBC","大橋　洋子","吉向　翔平","NRC",4,1]
[null,null,null,null,null,null,null,null,null,null,null,null,null,null,null,null,null,null,null,null,null,null,null,null,null,null,null,null,null,null,null,null,null,null,111,null,null,null,null,111,3,1,"SBC","林　秀忠","岩本　剛","NRC",4,2]
[null,null,null,null,null,null,null,null,null,null,null,null,null,null,null,null,null,null,null,null,null,null,null,null,null,null,null,null,null,null,null,null,null,null,112,null,null,null,null,112,3,2,"SBC","大橋　義治","白戸　玲人","NRC",4,3]
[null,null,null,null,null,null,null,null,null,null,null,null,null,null,null,null,null,null,null,null,null,null,null,null,null,null,null,null,null,null,null,null,null,null,113,null,null,null,null,113,{"$f":"IF(AO1=5,4,2)","v":2},2,"HRC","堂園　雅也","小原　嘉丈","ORC",{"$f":"IF(AO1=5,2,5)","v":5},5]
[null,null,null,null,null,null,null,null,null,null,null,null,null,null,null,null,null,null,null,null,null,null,null,null,null,null,null,null,null,null,null,null,null,null,114,null,null,null,null,114,{"$f":"AO114","v":2},3,"HRC","宮本　一","乾　伸綱","ORC",{"$f":"AU114","v":5},6]
[null,null,null,null,null,null,null,null,null,null,null,null,null,null,null,null,null,null,null,null,null,null,null,null,null,null,null,null,null,null,null,null,null,null,115,null,null,null,null,115,2,4,"HRC","伊藤　登","山崎真紀子","ORC",5,7]
[null,null,null,null,null,null,null,null,null,null,null,null,null,null,null,null,null,null,null,null,null,null,null,null,null,null,null,null,null,null,null,null,null,null,116,null,null,null,null,116,2,5,"HRC","宮井健太郎","松居　勝巳","ORC",5,1]
[null,null,null,null,null,null,null,null,null,null,null,null,null,null,null,null,null,null,null,null,null,null,null,null,null,null,null,null,null,null,null,null,null,null,117,null,null,null,null,117,2,6,"HRC","白澤雄一郎","藤明　宏樹","ORC",5,2]
[null,null,null,null,null,null,null,null,null,null,null,null,null,null,null,null,null,null,null,null,null,null,null,null,null,null,null,null,null,null,null,null,null,null,118,null,null,null,null,118,2,7,"HRC","河地　恵里","吉岡　保俊","ORC",5,3]
[null,null,null,null,null,null,null,null,null,null,null,null,null,null,null,null,null,null,null,null,null,null,null,null,null,null,null,null,null,null,null,null,null,null,119,null,null,null,null,119,2,1,"HRC","鐵山　泰三","村上　泰辰","ORC",5,4]
[null,null,null,null,null,null,null,null,null,null,null,null,null,null,null,null,null,null,null,null,null,null,null,null,null,null,null,null,null,null,null,null,null,null,120,null,null,null,null,120,{"$f":"IF(AO1=5,3,1)","v":1},1,"KRC","松好　太一","芝先　泰生","WRC",{"$f":"IF(AO1=5,1,6)","v":6},6]
[null,null,null,null,null,null,null,null,null,null,null,null,null,null,null,null,null,null,null,null,null,null,null,null,null,null,null,null,null,null,null,null,null,null,121,null,null,null,null,121,{"$f":"AO121","v":1},2,"KRC","清水　義晴","松房ゆかり","WRC",{"$f":"AU121","v":6},7]
[null,null,null,null,null,null,null,null,null,null,null,null,null,null,null,null,null,null,null,null,null,null,null,null,null,null,null,null,null,null,null,null,null,null,122,null,null,null,null,122,1,3,"KRC","鈴木　康文","末岡　修","WRC",6,1]
[null,null,null,null,null,null,null,null,null,null,null,null,null,null,null,null,null,null,null,null,null,null,null,null,null,null,null,null,null,null,null,null,null,null,123,null,null,null,null,123,1,4,"KRC","早川　徹","和田宗一郎","WRC",6,2]
[null,null,null,null,null,null,null,null,null,null,null,null,null,null,null,null,null,null,null,null,null,null,null,null,null,null,null,null,null,null,null,null,null,null,124,null,null,null,null,124,1,5,"KRC","井関　一成","杉本　博章","WRC",6,3]
[null,null,null,null,null,null,null,null,null,null,null,null,null,null,null,null,null,null,null,null,null,null,null,null,null,null,null,null,null,null,null,null,null,null,125,null,null,null,null,125,1,6,"KRC","今村　哲也","中本　雅大","WRC",6,4]
[null,null,null,null,null,null,null,null,null,null,null,null,null,null,null,null,null,null,null,null,null,null,null,null,null,null,null,null,null,null,null,null,null,null,126,null,null,null,null,126,1,7,"KRC","森田由佳里","山中　康介","WRC",6,5]
[null,null,null,null,null,null,null,null,null,null,null,null,null,null,null,null,null,null,null,null,null,null,null,null,null,null,null,null,null,null,null,null,null,null,127,null,null,null,null,127,{"$f":"IF(AO1=5,4,2)","v":2},2,"HRC","堂園　雅也","山中　康寛","SBC",{"$f":"IF(AO1=5,5,3)","v":3},3]
[null,null,null,null,null,null,null,null,null,null,null,null,null,null,null,null,null,null,null,null,null,null,null,null,null,null,null,null,null,null,null,null,null,null,128,null,null,null,null,128,{"$f":"AO128","v":2},3,"HRC","宮本　一","西峰　久祐","SBC",{"$f":"AU128","v":3},4]
[null,null,null,null,null,null,null,null,null,null,null,null,null,null,null,null,null,null,null,null,null,null,null,null,null,null,null,null,null,null,null,null,null,null,129,null,null,null,null,129,2,4,{"$f":"VLOOKUP(AO130,$AZ$3:$BA$8,2,FALSE)","v":"HRC"},{"$f":"VLOOKUP(VALUE(AO130&AP130),$AE$2:$AG$55,3,FALSE)","v":"伊藤　登"},{"$f":"VLOOKUP(VALUE(AU130&AV130),$AE$2:$AG$55,3,FALSE)","v":"大橋　正寛"},"SBC",3,5]
[null,null,null,null,null,null,null,null,null,null,null,null,null,null,null,null,null,null,null,null,null,null,null,null,null,null,null,null,null,null,null,null,null,null,130,null,null,null,null,130,2,5,"HRC","宮井健太郎","秋田　倫央",{"$f":"VLOOKUP(AU131,$AZ$3:$BA$8,2,FALSE)","v":"SBC"},3,6]
[null,null,null,null,null,null,null,null,null,null,null,null,null,null,null,null,null,null,null,null,null,null,null,null,null,null,null,null,null,null,null,null,null,null,131,null,null,null,null,131,2,6,"HRC","白澤雄一郎","大橋　洋子","SBC",3,7]
[null,null,null,null,null,null,null,null,null,null,null,null,null,null,null,null,null,null,null,null,null,null,null,null,null,null,null,null,null,null,null,null,null,null,132,null,null,null,null,132,2,7,"HRC","河地　恵里","林　秀忠","SBC",3,1]
[null,null,null,null,null,null,null,null,null,null,null,null,null,null,null,null,null,null,null,null,null,null,null,null,null,null,null,null,null,null,null,null,null,null,133,null,null,null,null,133,2,1,"HRC","鐵山　泰三","大橋　義治","SBC",3,2]
[null,null,null,null,null,null,null,null,null,null,null,null,null,null,null,null,null,null,null,null,null,null,null,null,null,null,null,null,null,null,null,null,null,null,134,null,null,null,null,134,{"$f":"IF(AO1=5,1,6)","v":6},6,"WRC","芝先　泰生","植田　慎也","NRC",{"$f":"IF(AO1=5,2,4)","v":4},4]
[null,null,null,null,null,null,null,null,null,null,null,null,null,null,null,null,null,null,null,null,null,null,null,null,null,null,null,null,null,null,null,null,null,null,135,null,null,null,null,135,{"$f":"AO135","v":6},7,"WRC","松房ゆかり","近藤　拓馬","NRC",{"$f":"AU135","v":4},5]
[null,null,null,null,null,null,null,null,null,null,null,null,null,null,null,null,null,null,null,null,null,null,null,null,null,null,null,null,null,null,null,null,null,null,136,null,null,null,null,136,6,1,"WRC","末岡　修","長谷川　進","NRC",4,6]
[null,null,null,null,null,null,null,null,null,null,null,null,null,null,null,null,null,null,null,null,null,null,null,null,null,null,null,null,null,null,null,null,null,null,137,null,null,null,null,137,6,2,"WRC","和田宗一郎","白戸　恭子","NRC",4,7]
[null,null,null,null,null,null,null,null,null,null,null,null,null,null,null,null,null,null,null,null,null,null,null,null,null,null,null,null,null,null,null,null,null,null,138,null,null,null,null,138,6,3,"WRC","杉本　博章","吉向　翔平","NRC",4,1]
[null,null,null,null,null,null,null,null,null,null,null,null,null,null,null,null,null,null,null,null,null,null,null,null,null,null,null,null,null,null,null,null,null,null,139,null,null,null,null,139,6,4,"WRC","中本　雅大","岩本　剛","NRC",4,2]
[null,null,null,null,null,null,null,null,null,null,null,null,null,null,null,null,null,null,null,null,null,null,null,null,null,null,null,null,null,null,null,null,null,null,140,null,null,null,null,140,6,5,"WRC","山中　康介","白戸　玲人","NRC",4,3]
[null,null,null,null,null,null,null,null,null,null,null,null,null,null,null,null,null,null,null,null,null,null,null,null,null,null,null,null,null,null,null,null,null,null,141,null,null,null,null,{"$f":"IF($AO$1=5,\"\",AN141+1)","v":141},{"$f":"IF(AO1=5,\"\",1)","v":1},1,"KRC","松好　太一","小原　嘉丈","ORC",{"$f":"IF(AO1=5,\"\",5)","v":5},5]
[null,null,null,null,null,null,null,null,null,null,null,null,null,null,null,null,null,null,null,null,null,null,null,null,null,null,null,null,null,null,null,null,null,null,142,null,null,null,null,{"$f":"IF($AO$1=5,\"\",AN142+1)","v":142},{"$f":"AO142","v":1},2,"KRC","清水　義晴","乾　伸綱","ORC",{"$f":"AU142","v":5},6]
[null,null,null,null,null,null,null,null,null,null,null,null,null,null,null,null,null,null,null,null,null,null,null,null,null,null,null,null,null,null,null,null,null,null,143,null,null,null,null,143,1,3,"KRC","鈴木　康文","山崎真紀子","ORC",5,7]
[null,null,null,null,null,null,null,null,null,null,null,null,null,null,null,null,null,null,null,null,null,null,null,null,null,null,null,null,null,null,null,null,null,null,144,null,null,null,null,144,1,4,"KRC","早川　徹","松居　勝巳","ORC",5,1]
[null,null,null,null,null,null,null,null,null,null,null,null,null,null,null,null,null,null,null,null,null,null,null,null,null,null,null,null,null,null,null,null,null,null,145,null,null,null,null,145,1,5,"KRC","井関　一成","藤明　宏樹","ORC",5,2]
[null,null,null,null,null,null,null,null,null,null,null,null,null,null,null,null,null,null,null,null,null,null,null,null,null,null,null,null,null,null,null,null,null,null,146,null,null,null,null,146,1,6,"KRC","今村　哲也","吉岡　保俊","ORC",5,3]
[null,null,null,null,null,null,null,null,null,null,null,null,null,null,null,null,null,null,null,null,null,null,null,null,null,null,null,null,null,null,null,null,null,null,147,null,null,null,null,147,1,7,"KRC","森田由佳里","村上　泰辰","ORC",5,4]
[null,null,null,null,null,null,null,null,null,null,null,null,null,null,null,null,null,null,null,null,null,null,null,null,null,null,null,null,null,null,null,null,null,null,148,null,null,null,null,148,{"$f":"IF(AO1=5,\"\",6)","v":6},6,"WRC","芝先　泰生","堂園　雅也","HRC",{"$f":"IF(AO1=5,\"\",2)","v":2},2]
[null,null,null,null,null,null,null,null,null,null,null,null,null,null,null,null,null,null,null,null,null,null,null,null,null,null,null,null,null,null,null,null,null,null,149,null,null,null,null,149,{"$f":"AO149","v":6},7,"WRC","松房ゆかり","宮本　一","HRC",{"$f":"AU149","v":2},3]
[null,null,null,null,null,null,null,null,null,null,null,null,null,null,null,null,null,null,null,null,null,null,null,null,null,null,null,null,null,null,null,null,null,null,150,null,null,null,null,150,6,1,"WRC","末岡　修","伊藤　登","HRC",2,4]
[null,null,null,null,null,null,null,null,null,null,null,null,null,null,null,null,null,null,null,null,null,null,null,null,null,null,null,null,null,null,null,null,null,null,151,null,null,null,null,151,6,2,"WRC","和田宗一郎","宮井健太郎","HRC",2,5]
[null,null,null,null,null,null,null,null,null,null,null,null,null,null,null,null,null,null,null,null,null,null,null,null,null,null,null,null,null,null,null,null,null,null,152,null,null,null,null,152,6,3,"WRC","杉本　博章","白澤雄一郎","HRC",2,6]
[null,null,null,null,null,null,null,null,null,null,null,null,null,null,null,null,null,null,null,null,null,null,null,null,null,null,null,null,null,null,null,null,null,null,153,null,null,null,null,153,6,4,"WRC","中本　雅大","河地　恵里","HRC",2,7]
[null,null,null,null,null,null,null,null,null,null,null,null,null,null,null,null,null,null,null,null,null,null,null,null,null,null,null,null,null,null,null,null,null,null,154,null,null,null,null,154,6,5,"WRC","山中　康介","鐵山　泰三","HRC",2,1]
[null,null,null,null,null,null,null,null,null,null,null,null,null,null,null,null,null,null,null,null,null,null,null,null,null,null,null,null,null,null,null,null,null,null,155,null,null,null,null,155,{"$f":"IF(AO1=5,\"\",5)","v":5},5,"ORC","小原　嘉丈","山中　康寛","SBC",{"$f":"IF(AO1=5,\"\",3)","v":3},3]
[null,null,null,null,null,null,null,null,null,null,null,null,null,null,null,null,null,null,null,null,null,null,null,null,null,null,null,null,null,null,null,null,null,null,156,null,null,null,null,156,{"$f":"AO156","v":5},6,"ORC","乾　伸綱","西峰　久祐","SBC",{"$f":"AU156","v":3},4]
[null,null,null,null,null,null,null,null,null,null,null,null,null,null,null,null,null,null,null,null,null,null,null,null,null,null,null,null,null,null,null,null,null,null,157,null,null,null,null,157,5,7,"ORC","山崎真紀子","大橋　正寛","SBC",3,5]
[null,null,null,null,null,null,null,null,null,null,null,null,null,null,null,null,null,null,null,null,null,null,null,null,null,null,null,null,null,null,null,null,null,null,158,null,null,null,null,158,5,1,"ORC","松居　勝巳","秋田　倫央","SBC",3,6]
[null,null,null,null,null,null,null,null,null,null,null,null,null,null,null,null,null,null,null,null,null,null,null,null,null,null,null,null,null,null,null,null,null,null,159,null,null,null,null,159,5,2,"ORC","藤明　宏樹","大橋　洋子","SBC",3,7]
[null,null,null,null,null,null,null,null,null,null,null,null,null,null,null,null,null,null,null,null,null,null,null,null,null,null,null,null,null,null,null,null,null,null,160,null,null,null,null,160,5,3,"ORC","吉岡　保俊","林　秀忠","SBC",3,1]
[null,null,null,null,null,null,null,null,null,null,null,null,null,null,null,null,null,null,null,null,null,null,null,null,null,null,null,null,null,null,null,null,null,null,161,null,null,null,null,161,5,4,"ORC","村上　泰辰","大橋　義治","SBC",3,2]
[null,null,null,null,null,null,null,null,null,null,null,null,null,null,null,null,null,null,null,null,null,null,null,null,null,null,null,null,null,null,null,null,null,null,162,null,null,null,null,162,{"$f":"IF(AO1=5,\"\",1)","v":1},1,"KRC","松好　太一","植田　慎也","NRC",{"$f":"IF(AO1=5,\"\",4)","v":4},4]
[null,null,null,null,null,null,null,null,null,null,null,null,null,null,null,null,null,null,null,null,null,null,null,null,null,null,null,null,null,null,null,null,null,null,163,null,null,null,null,163,{"$f":"AO163","v":1},2,"KRC","清水　義晴","近藤　拓馬","NRC",{"$f":"AU163","v":4},5]
[null,null,null,null,null,null,null,null,null,null,null,null,null,null,null,null,null,null,null,null,null,null,null,null,null,null,null,null,null,null,null,null,null,null,164,null,null,null,null,164,1,3,"KRC","鈴木　康文","長谷川　進","NRC",4,6]
[null,null,null,null,null,null,null,null,null,null,null,null,null,null,null,null,null,null,null,null,null,null,null,null,null,null,null,null,null,null,null,null,null,null,165,null,null,null,null,165,1,4,"KRC","早川　徹","白戸　恭子","NRC",4,7]
[null,null,null,null,null,null,null,null,null,null,null,null,null,null,null,null,null,null,null,null,null,null,null,null,null,null,null,null,null,null,null,null,null,null,166,null,null,null,null,166,1,5,"KRC","井関　一成","吉向　翔平","NRC",4,1]
[null,null,null,null,null,null,null,null,null,null,null,null,null,null,null,null,null,null,null,null,null,null,null,null,null,null,null,null,null,null,null,null,null,null,167,null,null,null,null,167,1,6,"KRC","今村　哲也","岩本　剛","NRC",4,2]
[null,null,null,null,null,null,null,null,null,null,null,null,null,null,null,null,null,null,null,null,null,null,null,null,null,null,null,null,null,null,null,null,null,null,168,null,null,null,null,168,1,7,"KRC","森田由佳里","白戸　玲人","NRC",4,3]
[null,null,null,null,null,null,null,null,null,null,null,null,null,null,null,null,null,null,null,null,null,null,null,null,null,null,null,null,null,null,null,null,null,null,169,null,null,null,null,169,{"$f":"IF(AO1=5,\"\",5)","v":5},5,"ORC","小原　嘉丈","芝先　泰生","WRC",{"$f":"IF(AO1=5,\"\",6)","v":6},6]
[null,null,null,null,null,null,null,null,null,null,null,null,null,null,null,null,null,null,null,null,null,null,null,null,null,null,null,null,null,null,null,null,null,null,170,null,null,null,null,170,{"$f":"AO170","v":5},6,"ORC","乾　伸綱","松房ゆかり","WRC",{"$f":"AU170","v":6},7]
[null,null,null,null,null,null,null,null,null,null,null,null,null,null,null,null,null,null,null,null,null,null,null,null,null,null,null,null,null,null,null,null,null,null,171,null,null,null,null,171,5,7,"ORC","山崎真紀子","末岡　修","WRC",6,1]
[null,null,null,null,null,null,null,null,null,null,null,null,null,null,null,null,null,null,null,null,null,null,null,null,null,null,null,null,null,null,null,null,null,null,172,null,null,null,null,172,5,1,"ORC","松居　勝巳","和田宗一郎","WRC",6,2]
[null,null,null,null,null,null,null,null,null,null,null,null,null,null,null,null,null,null,null,null,null,null,null,null,null,null,null,null,null,null,null,null,null,null,173,null,null,null,null,173,5,2,"ORC","藤明　宏樹","杉本　博章","WRC",6,3]
[null,null,null,null,null,null,null,null,null,null,null,null,null,null,null,null,null,null,null,null,null,null,null,null,null,null,null,null,null,null,null,null,null,null,174,null,null,null,null,174,5,3,"ORC","吉岡　保俊","中本　雅大","WRC",6,4]
[null,null,null,null,null,null,null,null,null,null,null,null,null,null,null,null,null,null,null,null,null,null,null,null,null,null,null,null,null,null,null,null,null,null,175,null,null,null,null,175,5,4,"ORC","村上　泰辰","山中　康介","WRC",6,5]
[null,null,null,null,null,null,null,null,null,null,null,null,null,null,null,null,null,null,null,null,null,null,null,null,null,null,null,null,null,null,null,null,null,null,176,null,null,null,null,176,{"$f":"IF(AO1=5,\"\",4)","v":4},4,"NRC","植田　慎也","堂園　雅也","HRC",{"$f":"IF(AO1=5,\"\",2)","v":2},2]
[null,null,null,null,null,null,null,null,null,null,null,null,null,null,null,null,null,null,null,null,null,null,null,null,null,null,null,null,null,null,null,null,null,null,177,null,null,null,null,177,{"$f":"AO177","v":4},5,"NRC","近藤　拓馬","宮本　一","HRC",{"$f":"AU177","v":2},3]
[null,null,null,null,null,null,null,null,null,null,null,null,null,null,null,null,null,null,null,null,null,null,null,null,null,null,null,null,null,null,null,null,null,null,178,null,null,null,null,178,4,6,"NRC","長谷川　進","伊藤　登","HRC",2,4]
[null,null,null,null,null,null,null,null,null,null,null,null,null,null,null,null,null,null,null,null,null,null,null,null,null,null,null,null,null,null,null,null,null,null,179,null,null,null,null,179,4,7,"NRC","白戸　恭子","宮井健太郎","HRC",2,5]
[null,null,null,null,null,null,null,null,null,null,null,null,null,null,null,null,null,null,null,null,null,null,null,null,null,null,null,null,null,null,null,null,null,null,180,null,null,null,null,180,4,1,"NRC","吉向　翔平","白澤雄一郎","HRC",2,6]
[null,null,null,null,null,null,null,null,null,null,null,null,null,null,null,null,null,null,null,null,null,null,null,null,null,null,null,null,null,null,null,null,null,null,181,null,null,null,null,181,4,2,"NRC","岩本　剛","河地　恵里","HRC",2,7]
[null,null,null,null,null,null,null,null,null,null,null,null,null,null,null,null,null,null,null,null,null,null,null,null,null,null,null,null,null,null,null,null,null,null,182,null,null,null,null,182,4,3,"NRC","白戸　玲人","鐵山　泰三","HRC",2,1]
[null,null,null,null,null,null,null,null,null,null,null,null,null,null,null,null,null,null,null,null,null,null,null,null,null,null,null,null,null,null,null,null,null,null,183,null,null,null,null,183,{"$f":"IF(AO1=5,\"\",1)","v":1},1,"KRC","松好　太一","山中　康寛","SBC",{"$f":"IF(AO1=5,\"\",3)","v":3},3]
[null,null,null,null,null,null,null,null,null,null,null,null,null,null,null,null,null,null,null,null,null,null,null,null,null,null,null,null,null,null,null,null,null,null,184,null,null,null,null,184,{"$f":"AO184","v":1},2,"KRC","清水　義晴","西峰　久祐","SBC",{"$f":"AU184","v":3},4]
[null,null,null,null,null,null,null,null,null,null,null,null,null,null,null,null,null,null,null,null,null,null,null,null,null,null,null,null,null,null,null,null,null,null,185,null,null,null,null,185,1,3,"KRC","鈴木　康文","大橋　正寛","SBC",3,5]
[null,null,null,null,null,null,null,null,null,null,null,null,null,null,null,null,null,null,null,null,null,null,null,null,null,null,null,null,null,null,null,null,null,null,186,null,null,null,null,186,1,4,"KRC","早川　徹","秋田　倫央","SBC",3,6]
[null,null,null,null,null,null,null,null,null,null,null,null,null,null,null,null,null,null,null,null,null,null,null,null,null,null,null,null,null,null,null,null,null,null,187,null,null,null,null,187,1,5,"KRC","井関　一成","大橋　洋子","SBC",3,7]
[null,null,null,null,null,null,null,null,null,null,null,null,null,null,null,null,null,null,null,null,null,null,null,null,null,null,null,null,null,null,null,null,null,null,188,null,null,null,null,188,1,6,"KRC","今村　哲也","林　秀忠","SBC",3,1]
[null,null,null,null,null,null,null,null,null,null,null,null,null,null,null,null,null,null,null,null,null,null,null,null,null,null,null,null,null,null,null,null,null,null,189,null,null,null,null,189,1,7,"KRC","森田由佳里","大橋　義治","SBC",3,2]
[null,null,null,null,null,null,null,null,null,null,null,null,null,null,null,null,null,null,null,null,null,null,null,null,null,null,null,null,null,null,null,null,null,null,190,null,null,null,null,190,{"$f":"IF(AO1=5,\"\",4)","v":4},4,"NRC","植田　慎也","小原　嘉丈","ORC",{"$f":"IF(AO1=5,\"\",5)","v":5},5]
[null,null,null,null,null,null,null,null,null,null,null,null,null,null,null,null,null,null,null,null,null,null,null,null,null,null,null,null,null,null,null,null,null,null,191,null,null,null,null,191,{"$f":"AO191","v":4},5,"NRC","近藤　拓馬","乾　伸綱","ORC",{"$f":"AU191","v":5},6]
[null,null,null,null,null,null,null,null,null,null,null,null,null,null,null,null,null,null,null,null,null,null,null,null,null,null,null,null,null,null,null,null,null,null,192,null,null,null,null,192,4,6,"NRC","長谷川　進","山崎真紀子","ORC",5,7]
[null,null,null,null,null,null,null,null,null,null,null,null,null,null,null,null,null,null,null,null,null,null,null,null,null,null,null,null,null,null,null,null,null,null,193,null,null,null,null,193,4,7,{"$f":"VLOOKUP(AO194,$AZ$3:$BA$8,2,FALSE)","v":"NRC"},{"$f":"VLOOKUP(VALUE(AO194&AP194),$AE$2:$AG$55,3,FALSE)","v":"白戸　恭子"},{"$f":"VLOOKUP(VALUE(AU194&AV194),$AE$2:$AG$55,3,FALSE)","v":"松居　勝巳"},"ORC",5,1]
[null,null,null,null,null,null,null,null,null,null,null,null,null,null,null,null,null,null,null,null,null,null,null,null,null,null,null,null,null,null,null,null,null,null,194,null,null,null,null,194,4,1,"NRC","吉向　翔平","藤明　宏樹",{"$f":"VLOOKUP(AU195,$AZ$3:$BA$8,2,FALSE)","v":"ORC"},5,2]
[null,null,null,null,null,null,null,null,null,null,null,null,null,null,null,null,null,null,null,null,null,null,null,null,null,null,null,null,null,null,null,null,null,null,195,null,null,null,null,195,4,2,"NRC","岩本　剛","吉岡　保俊","ORC",5,3]
[null,null,null,null,null,null,null,null,null,null,null,null,null,null,null,null,null,null,null,null,null,null,null,null,null,null,null,null,null,null,null,null,null,null,196,null,null,null,null,196,4,3,"NRC","白戸　玲人","村上　泰辰","ORC",5,4]
[null,null,null,null,null,null,null,null,null,null,null,null,null,null,null,null,null,null,null,null,null,null,null,null,null,null,null,null,null,null,null,null,null,null,197,null,null,null,null,197,{"$f":"IF(AO1=5,\"\",3)","v":3},3,"SBC","山中　康寛","芝先　泰生","WRC",{"$f":"IF(AO1=5,\"\",6)","v":6},6]
[null,null,null,null,null,null,null,null,null,null,null,null,null,null,null,null,null,null,null,null,null,null,null,null,null,null,null,null,null,null,null,null,null,null,198,null,null,null,null,198,{"$f":"AO198","v":3},4,"SBC","西峰　久祐","松房ゆかり","WRC",{"$f":"AU198","v":6},7]
[null,null,null,null,null,null,null,null,null,null,null,null,null,null,null,null,null,null,null,null,null,null,null,null,null,null,null,null,null,null,null,null,null,null,199,null,null,null,null,199,3,5,"SBC","大橋　正寛","末岡　修","WRC",6,1]
[null,null,null,null,null,null,null,null,null,null,null,null,null,null,null,null,null,null,null,null,null,null,null,null,null,null,null,null,null,null,null,null,null,null,200,null,null,null,null,200,3,6,"SBC","秋田　倫央","和田宗一郎","WRC",6,2]
[null,null,null,null,null,null,null,null,null,null,null,null,null,null,null,null,null,null,null,null,null,null,null,null,null,null,null,null,null,null,null,null,null,null,201,null,null,null,null,201,3,7,"SBC","大橋　洋子","杉本　博章","WRC",6,3]
[null,null,null,null,null,null,null,null,null,null,null,null,null,null,null,null,null,null,null,null,null,null,null,null,null,null,null,null,null,null,null,null,null,null,202,null,null,null,null,202,3,1,"SBC","林　秀忠","中本　雅大","WRC",6,4]
[null,null,null,null,null,null,null,null,null,null,null,null,null,null,null,null,null,null,null,null,null,null,null,null,null,null,null,null,null,null,null,null,null,null,203,null,null,null,null,203,3,2,"SBC","大橋　義治","山中　康介","WRC",6,5]
[null,null,null,null,null,null,null,null,null,null,null,null,null,null,null,null,null,null,null,null,null,null,null,null,null,null,null,null,null,null,null,null,null,null,204,null,null,null,null,204,{"$f":"IF(AO1=5,\"\",1)","v":1},1,"KRC","松好　太一","堂園　雅也","HRC",{"$f":"IF(AO1=5,\"\",2)","v":2},2]
[null,null,null,null,null,null,null,null,null,null,null,null,null,null,null,null,null,null,null,null,null,null,null,null,null,null,null,null,null,null,null,null,null,null,205,null,null,null,null,205,{"$f":"AO205","v":1},2,"KRC","清水　義晴","宮本　一","HRC",{"$f":"AU205","v":2},3]
[null,null,null,null,null,null,null,null,null,null,null,null,null,null,null,null,null,null,null,null,null,null,null,null,null,null,null,null,null,null,null,null,null,null,206,null,null,null,null,{"$f":"IF($AO$1=5,\"\",AN206+1)","v":206},1,3,"KRC","鈴木　康文","伊藤　登","HRC",2,4]
[null,null,null,null,null,null,null,null,null,null,null,null,null,null,null,null,null,null,null,null,null,null,null,null,null,null,null,null,null,null,null,null,null,null,207,null,null,null,null,{"$f":"IF($AO$1=5,\"\",AN207+1)","v":207},1,4,"KRC","早川　徹","宮井健太郎","HRC",2,5]
[null,null,null,null,null,null,null,null,null,null,null,null,null,null,null,null,null,null,null,null,null,null,null,null,null,null,null,null,null,null,null,null,null,null,208,null,null,null,null,{"$f":"IF($AO$1=5,\"\",AN208+1)","v":208},1,5,"KRC","井関　一成","白澤雄一郎","HRC",2,6]
[null,null,null,null,null,null,null,null,null,null,null,null,null,null,null,null,null,null,null,null,null,null,null,null,null,null,null,null,null,null,null,null,null,null,209,null,null,null,null,{"$f":"IF($AO$1=5,\"\",AN209+1)","v":209},1,6,"KRC","今村　哲也","河地　恵里","HRC",2,7]
[null,null,null,null,null,null,null,null,null,null,null,null,null,null,null,null,null,null,null,null,null,null,null,null,null,null,null,null,null,null,null,null,null,null,210,null,null,null,null,{"$f":"IF($AO$1=5,\"\",AN210+1)","v":210},1,7,"KRC","森田由佳里","鐵山　泰三","HRC",2,1]

{"sheet":"対戦カード","index":1,"n_rows":310,"n_cols":64,"rows_kept":310,"cut":false,"hidden":false,"merged":[]}
[null,null,null,null,null,null,null,null,null," ",{"$f":"★個人成績表★!$A$1","v":"第31回　京阪神和奈滋対抗戦　　　(奈良；玉出エース)"}]
[]
[null,"印刷範囲の設定",null,null,null,null,null,null,null,null,"G-No",null,null,null,"T-No"]
[]
[null,null,null,null,null,null,null,null,null,null,null,null,null,"所属"]
[null,null,null,null,null,null,null,null,null,null,null,null,null,"氏名"]
[null,null,null,null,null,null,null,null,null,null,null,null,null,"得点"]
[null,null,null,null,null,null,null,null,null,null,null,null,null,"HR"]
[]
[null,null,null,null,null,null,null,null,null,null,null,null,null,null,"レフリー"]
[null,{"$f":"★個人成績表★!$A$1","v":"第31回　京阪神和奈滋対抗戦　　　(奈良；玉出エース)"},null,null,null,null,null,null,null,null,{"$f":"★個人成績表★!$A$1","v":"第31回　京阪神和奈滋対抗戦　　　(奈良；玉出エース)"},null,null,null,null,null,null,null,null,{"$f":"★個人成績表★!$A$1","v":"第31回　京阪神和奈滋対抗戦　　　(奈良；玉出エース)"},null,null,null,null,null,null,null,null,{"$f":"★個人成績表★!$A$1","v":"第31回　京阪神和奈滋対抗戦　　　(奈良；玉出エース)"},null,null,null,null,null,null,null,null,{"$f":"★個人成績表★!$A$1","v":"第31回　京阪神和奈滋対抗戦　　　(奈良；玉出エース)"},null,null,null,null,null,null,null,null,{"$f":"★個人成績表★!$A$1","v":"第31回　京阪神和奈滋対抗戦　　　(奈良；玉出エース)"},null,null,null,null,null,null,null,null,{"$f":"★個人成績表★!$A$1","v":"第31回　京阪神和奈滋対抗戦　　　(奈良；玉出エース)"},null,null,null,null,null,null,null," "]
[]
[null,"G-No",1,null,null,"T-No",null,null,null,null,"G-No",{"$f":"C13+1","v":2},null,null,"T-No",null,null,null,null,"G-No",{"$f":"L13+1","v":3},null,null,"T-No",null,null,null,null,"G-No",{"$f":"U13+1","v":4},null,null,"T-No",null,null,null,null,"G-No",{"$f":"AD13+1","v":5},null,null,"T-No",null,null,null,null,"G-No",{"$f":"AM13+1","v":6},null,null,"T-No",null,null,null,null,"G-No",{"$f":"AV13+1","v":7},null,null,"T-No"]
[]
[null,{"$f":"VLOOKUP(C13,結果入力表!$B$2:$J$212,2,FALSE)","v":"SBC"},null,null,"所属",{"$f":"VLOOKUP(C13,結果入力表!$B$2:$J$212,9,FALSE)","v":"NRC"},null,null,null,null,{"$f":"VLOOKUP(L13,結果入力表!$B$2:$J$212,2,FALSE)","v":"SBC"},null,null,"所属",{"$f":"VLOOKUP(L13,結果入力表!$B$2:$J$212,9,FALSE)","v":"NRC"},null,null,null,null,{"$f":"VLOOKUP(U13,結果入力表!$B$2:$J$212,2,FALSE)","v":"SBC"},null,null,"所属",{"$f":"VLOOKUP(U13,結果入力表!$B$2:$J$212,9,FALSE)","v":"NRC"},null,null,null,null,{"$f":"VLOOKUP(AD13,結果入力表!$B$2:$J$212,2,FALSE)","v":"SBC"},null,null,"所属",{"$f":"VLOOKUP(AD13,結果入力表!$B$2:$J$212,9,FALSE)","v":"NRC"},null,null,null,null,{"$f":"VLOOKUP(AM13,結果入力表!$B$2:$J$212,2,FALSE)","v":"SBC"},null,null,"所属",{"$f":"VLOOKUP(AM13,結果入力表!$B$2:$J$212,9,FALSE)","v":"NRC"},null,null,null,null,{"$f":"VLOOKUP(AV13,結果入力表!$B$2:$J$212,2,FALSE)","v":"SBC"},null,null,"所属",{"$f":"VLOOKUP(AV13,結果入力表!$B$2:$J$212,9,FALSE)","v":"NRC"},null,null,null,null,{"$f":"VLOOKUP(BE13,結果入力表!$B$2:$J$212,2,FALSE)","v":"SBC"},null,null,"所属",{"$f":"VLOOKUP(BE13,結果入力表!$B$2:$J$212,9,FALSE)","v":"NRC"}]
[null,{"$f":"VLOOKUP(C13,結果入力表!$B$2:$J$212,3,FALSE)","v":"林　秀忠"},null,null,"氏名",{"$f":"VLOOKUP(C13,結果入力表!$B$2:$J$212,8,FALSE)","v":"吉向　翔平"},null,null,null,null,{"$f":"VLOOKUP(L13,結果入力表!$B$2:$J$212,3,FALSE)","v":"大橋　義治"},null,null,"氏名",{"$f":"VLOOKUP(L13,結果入力表!$B$2:$J$212,8,FALSE)","v":"岩本　剛"},null,null,null,null,{"$f":"VLOOKUP(U13,結果入力表!$B$2:$J$212,3,FALSE)","v":"山中　康寛"},null,null,"氏名",{"$f":"VLOOKUP(U13,結果入力表!$B$2:$J$212,8,FALSE)","v":"白戸　玲人"},null,null,null,null,{"$f":"VLOOKUP(AD13,結果入力表!$B$2:$J$212,3,FALSE)","v":"西峰　久祐"},null,null,"氏名",{"$f":"VLOOKUP(AD13,結果入力表!$B$2:$J$212,8,FALSE)","v":"植田　慎也"},null,null,null,null,{"$f":"VLOOKUP(AM13,結果入力表!$B$2:$J$212,3,FALSE)","v":"大橋　正寛"},null,null,"氏名",{"$f":"VLOOKUP(AM13,結果入力表!$B$2:$J$212,8,FALSE)","v":"近藤　拓馬"},null,null,null,null,{"$f":"VLOOKUP(AV13,結果入力表!$B$2:$J$212,3,FALSE)","v":"秋田　倫央"},null,null,"氏名",{"$f":"VLOOKUP(AV13,結果入力表!$B$2:$J$212,8,FALSE)","v":"長谷川　進"},null,null,null,null,{"$f":"VLOOKUP(BE13,結果入力表!$B$2:$J$212,3,FALSE)","v":"大橋　洋子"},null,null,"氏名",{"$f":"VLOOKUP(BE13,結果入力表!$B$2:$J$212,8,FALSE)","v":"白戸　恭子"}]
[null,null,null,null,"得点",null,null,null,null,null,null,null,null,"得点",null,null,null,null,null,null,null,null,"得点",null,null,null,null,null,null,null,null,"得点",null,null,null,null,null,null,null,null,"得点",null,null,null,null,null,null,null,null,"得点",null,null,null,null,null,null,null,null,"得点"]
[null,null,null,null,"HR",null,null,null,null,null,null,null,null,"HR",null,null,null,null,null,null,null,null,"HR",null,null,null,null,null,null,null,null,"HR",null,null,null,null,null,null,null,null,"HR",null,null,null,null,null,null,null,null,"HR",null,null,null,null,null,null,null,null,"HR"]
[]
[null,null,null,null,null,"レフリー",null,null,null,null,null,null,null,null,"レフリー",null,null,null,null,null,null,null,null,"レフリー",null,null,null,null,null,null,null,null,"レフリー",null,null,null,null,null,null,null,null,"レフリー",null,null,null,null,null,null,null,null,"レフリー",null,null,null,null,null,null,null,null,"レフリー"]
[null,{"$f":"★個人成績表★!$A$1","v":"第31回　京阪神和奈滋対抗戦　　　(奈良；玉出エース)"},null,null,null,null,null,null,null,null,{"$f":"★個人成績表★!$A$1","v":"第31回　京阪神和奈滋対抗戦　　　(奈良；玉出エース)"},null,null,null,null,null,null,null,null,{"$f":"★個人成績表★!$A$1","v":"第31回　京阪神和奈滋対抗戦　　　(奈良；玉出エース)"},null,null,null,null,null,null,null,null,{"$f":"★個人成績表★!$A$1","v":"第31回　京阪神和奈滋対抗戦　　　(奈良；玉出エース)"},null,null,null,null,null,null,null,null,{"$f":"★個人成績表★!$A$1","v":"第31回　京阪神和奈滋対抗戦　　　(奈良；玉出エース)"},null,null,null,null,null,null,null,null,{"$f":"★個人成績表★!$A$1","v":"第31回　京阪神和奈滋対抗戦　　　(奈良；玉出エース)"},null,null,null,null,null,null,null,null,{"$f":"★個人成績表★!$A$1","v":"第31回　京阪神和奈滋対抗戦　　　(奈良；玉出エース)"},null,null,null,null,null,null,null," "]
[]
[null,"G-No",{"$f":"BE13+1","v":8},null,null,"T-No",null,null,null,null,"G-No",{"$f":"C23+1","v":9},null,null,"T-No",null,null,null,null,"G-No",{"$f":"L23+1","v":10},null,null,"T-No",null,null,null,null,"G-No",{"$f":"U23+1","v":11},null,null,"T-No",null,null,null,null,"G-No",{"$f":"AD23+1","v":12},null,null,"T-No",null,null,null,null,"G-No",{"$f":"AM23+1","v":13},null,null,"T-No",null,null,null,null,"G-No",{"$f":"AV23+1","v":14},null,null,"T-No"]
[]
[null,{"$f":"VLOOKUP(C23,結果入力表!$B$2:$J$212,2,FALSE)","v":"HRC"},null,null,"所属",{"$f":"VLOOKUP(C23,結果入力表!$B$2:$J$212,9,FALSE)","v":"ORC"},null,null,null,null,{"$f":"VLOOKUP(L23,結果入力表!$B$2:$J$212,2,FALSE)","v":"HRC"},null,null,"所属",{"$f":"VLOOKUP(L23,結果入力表!$B$2:$J$212,9,FALSE)","v":"ORC"},null,null,null,null,{"$f":"VLOOKUP(U23,結果入力表!$B$2:$J$212,2,FALSE)","v":"HRC"},null,null,"所属",{"$f":"VLOOKUP(U23,結果入力表!$B$2:$J$212,9,FALSE)","v":"ORC"},null,null,null,null,{"$f":"VLOOKUP(AD23,結果入力表!$B$2:$J$212,2,FALSE)","v":"HRC"},null,null,"所属",{"$f":"VLOOKUP(AD23,結果入力表!$B$2:$J$212,9,FALSE)","v":"ORC"},null,null,null,null,{"$f":"VLOOKUP(AM23,結果入力表!$B$2:$J$212,2,FALSE)","v":"HRC"},null,null,"所属",{"$f":"VLOOKUP(AM23,結果入力表!$B$2:$J$212,9,FALSE)","v":"ORC"},null,null,null,null,{"$f":"VLOOKUP(AV23,結果入力表!$B$2:$J$212,2,FALSE)","v":"HRC"},null,null,"所属",{"$f":"VLOOKUP(AV23,結果入力表!$B$2:$J$212,9,FALSE)","v":"ORC"},null,null,null,null,{"$f":"VLOOKUP(BE23,結果入力表!$B$2:$J$212,2,FALSE)","v":"HRC"},null,null,"所属",{"$f":"VLOOKUP(BE23,結果入力表!$B$2:$J$212,9,FALSE)","v":"ORC"}]
[null,{"$f":"VLOOKUP(C23,結果入力表!$B$2:$J$212,3,FALSE)","v":"鐵山　泰三"},null,null,"氏名",{"$f":"VLOOKUP(C23,結果入力表!$B$2:$J$212,8,FALSE)","v":"松居　勝巳"},null,null,null,null,{"$f":"VLOOKUP(L23,結果入力表!$B$2:$J$212,3,FALSE)","v":"堂園　雅也"},null,null,"氏名",{"$f":"VLOOKUP(L23,結果入力表!$B$2:$J$212,8,FALSE)","v":"藤明　宏樹"},null,null,null,null,{"$f":"VLOOKUP(U23,結果入力表!$B$2:$J$212,3,FALSE)","v":"宮本　一"},null,null,"氏名",{"$f":"VLOOKUP(U23,結果入力表!$B$2:$J$212,8,FALSE)","v":"吉岡　保俊"},null,null,null,null,{"$f":"VLOOKUP(AD23,結果入力表!$B$2:$J$212,3,FALSE)","v":"伊藤　登"},null,null,"氏名",{"$f":"VLOOKUP(AD23,結果入力表!$B$2:$J$212,8,FALSE)","v":"村上　泰辰"},null,null,null,null,{"$f":"VLOOKUP(AM23,結果入力表!$B$2:$J$212,3,FALSE)","v":"宮井健太郎"},null,null,"氏名",{"$f":"VLOOKUP(AM23,結果入力表!$B$2:$J$212,8,FALSE)","v":"小原　嘉丈"},null,null,null,null,{"$f":"VLOOKUP(AV23,結果入力表!$B$2:$J$212,3,FALSE)","v":"白澤雄一郎"},null,null,"氏名",{"$f":"VLOOKUP(AV23,結果入力表!$B$2:$J$212,8,FALSE)","v":"乾　伸綱"},null,null,null,null,{"$f":"VLOOKUP(BE23,結果入力表!$B$2:$J$212,3,FALSE)","v":"河地　恵里"},null,null,"氏名",{"$f":"VLOOKUP(BE23,結果入力表!$B$2:$J$212,8,FALSE)","v":"山崎真紀子"}]
[null,null,null,null,"得点",null,null,null,null,null,null,null,null,"得点",null,null,null,null,null,null,null,null,"得点",null,null,null,null,null,null,null,null,"得点",null,null,null,null,null,null,null,null,"得点",null,null,null,null,null,null,null,null,"得点",null,null,null,null,null,null,null,null,"得点"]
[null,null,null,null,"HR",null,null,null,null,null,null,null,null,"HR",null,null,null,null,null,null,null,null,"HR",null,null,null,null,null,null,null,null,"HR",null,null,null,null,null,null,null,null,"HR",null,null,null,null,null,null,null,null,"HR",null,null,null,null,null,null,null,null,"HR"]
[]
[null,null,null,null,null,"レフリー",null,null,null,null,null,null,null,null,"レフリー",null,null,null,null,null,null,null,null,"レフリー",null,null,null,null,null,null,null,null,"レフリー",null,null,null,null,null,null,null,null,"レフリー",null,null,null,null,null,null,null,null,"レフリー",null,null,null,null,null,null,null,null,"レフリー"]
[null,{"$f":"★個人成績表★!$A$1","v":"第31回　京阪神和奈滋対抗戦　　　(奈良；玉出エース)"},null,null,null,null,null,null,null,null,{"$f":"★個人成績表★!$A$1","v":"第31回　京阪神和奈滋対抗戦　　　(奈良；玉出エース)"},null,null,null,null,null,null,null,null,{"$f":"★個人成績表★!$A$1","v":"第31回　京阪神和奈滋対抗戦　　　(奈良；玉出エース)"},null,null,null,null,null,null,null,null,{"$f":"★個人成績表★!$A$1","v":"第31回　京阪神和奈滋対抗戦　　　(奈良；玉出エース)"},null,null,null,null,null,null,null,null,{"$f":"★個人成績表★!$A$1","v":"第31回　京阪神和奈滋対抗戦　　　(奈良；玉出エース)"},null,null,null,null,null,null,null,null,{"$f":"★個人成績表★!$A$1","v":"第31回　京阪神和奈滋対抗戦　　　(奈良；玉出エース)"},null,null,null,null,null,null,null,null,{"$f":"★個人成績表★!$A$1","v":"第31回　京阪神和奈滋対抗戦　　　(奈良；玉出エース)"},null,null,null,null,null,null,null," "]
[]
[null,"G-No",{"$f":"BE23+1","v":15},null,null,"T-No",null,null,null,null,"G-No",{"$f":"C33+1","v":16},null,null,"T-No",null,null,null,null,"G-No",{"$f":"L33+1","v":17},null,null,"T-No",null,null,null,null,"G-No",{"$f":"U33+1","v":18},null,null,"T-No",null,null,null,null,"G-No",{"$f":"AD33+1","v":19},null,null,"T-No",null,null,null,null,"G-No",{"$f":"AM33+1","v":20},null,null,"T-No",null,null,null,null,"G-No",{"$f":"AV33+1","v":21},null,null,"T-No"]
[]
[null,{"$f":"VLOOKUP(C33,結果入力表!$B$2:$J$212,2,FALSE)","v":"KRC"},null,null,"所属",{"$f":"VLOOKUP(C33,結果入力表!$B$2:$J$212,9,FALSE)","v":"WRC"},null,null,null,null,{"$f":"VLOOKUP(L33,結果入力表!$B$2:$J$212,2,FALSE)","v":"KRC"},null,null,"所属",{"$f":"VLOOKUP(L33,結果入力表!$B$2:$J$212,9,FALSE)","v":"WRC"},null,null,null,null,{"$f":"VLOOKUP(U33,結果入力表!$B$2:$J$212,2,FALSE)","v":"KRC"},null,null,"所属",{"$f":"VLOOKUP(U33,結果入力表!$B$2:$J$212,9,FALSE)","v":"WRC"},null,null,null,null,{"$f":"VLOOKUP(AD33,結果入力表!$B$2:$J$212,2,FALSE)","v":"KRC"},null,null,"所属",{"$f":"VLOOKUP(AD33,結果入力表!$B$2:$J$212,9,FALSE)","v":"WRC"},null,null,null,null,{"$f":"VLOOKUP(AM33,結果入力表!$B$2:$J$212,2,FALSE)","v":"KRC"},null,null,"所属",{"$f":"VLOOKUP(AM33,結果入力表!$B$2:$J$212,9,FALSE)","v":"WRC"},null,null,null,null,{"$f":"VLOOKUP(AV33,結果入力表!$B$2:$J$212,2,FALSE)","v":"KRC"},null,null,"所属",{"$f":"VLOOKUP(AV33,結果入力表!$B$2:$J$212,9,FALSE)","v":"WRC"},null,null,null,null,{"$f":"VLOOKUP(BE33,結果入力表!$B$2:$J$212,2,FALSE)","v":"KRC"},null,null,"所属",{"$f":"VLOOKUP(BE33,結果入力表!$B$2:$J$212,9,FALSE)","v":"WRC"}]
[null,{"$f":"VLOOKUP(C33,結果入力表!$B$2:$J$212,3,FALSE)","v":"松好　太一"},null,null,"氏名",{"$f":"VLOOKUP(C33,結果入力表!$B$2:$J$212,8,FALSE)","v":"末岡　修"},null,null,null,null,{"$f":"VLOOKUP(L33,結果入力表!$B$2:$J$212,3,FALSE)","v":"清水　義晴"},null,null,"氏名",{"$f":"VLOOKUP(L33,結果入力表!$B$2:$J$212,8,FALSE)","v":"和田宗一郎"},null,null,null,null,{"$f":"VLOOKUP(U33,結果入力表!$B$2:$J$212,3,FALSE)","v":"鈴木　康文"},null,null,"氏名",{"$f":"VLOOKUP(U33,結果入力表!$B$2:$J$212,8,FALSE)","v":"杉本　博章"},null,null,null,null,{"$f":"VLOOKUP(AD33,結果入力表!$B$2:$J$212,3,FALSE)","v":"早川　徹"},null,null,"氏名",{"$f":"VLOOKUP(AD33,結果入力表!$B$2:$J$212,8,FALSE)","v":"中本　雅大"},null,null,null,null,{"$f":"VLOOKUP(AM33,結果入力表!$B$2:$J$212,3,FALSE)","v":"井関　一成"},null,null,"氏名",{"$f":"VLOOKUP(AM33,結果入力表!$B$2:$J$212,8,FALSE)","v":"山中　康介"},null,null,null,null,{"$f":"VLOOKUP(AV33,結果入力表!$B$2:$J$212,3,FALSE)","v":"今村　哲也"},null,null,"氏名",{"$f":"VLOOKUP(AV33,結果入力表!$B$2:$J$212,8,FALSE)","v":"芝先　泰生"},null,null,null,null,{"$f":"VLOOKUP(BE33,結果入力表!$B$2:$J$212,3,FALSE)","v":"森田由佳里"},null,null,"氏名",{"$f":"VLOOKUP(BE33,結果入力表!$B$2:$J$212,8,FALSE)","v":"松房ゆかり"}]
[null,null,null,null,"得点",null,null,null,null,null,null,null,null,"得点",null,null,null,null,null,null,null,null,"得点",null,null,null,null,null,null,null,null,"得点",null,null,null,null,null,null,null,null,"得点",null,null,null,null,null,null,null,null,"得点",null,null,null,null,null,null,null,null,"得点"]
[null,null,null,null,"HR",null,null,null,null,null,null,null,null,"HR",null,null,null,null,null,null,null,null,"HR",null,null,null,null,null,null,null,null,"HR",null,null,null,null,null,null,null,null,"HR",null,null,null,null,null,null,null,null,"HR",null,null,null,null,null,null,null,null,"HR"]
[]
[null,null,null,null,null,"レフリー",null,null,null,null,null,null,null,null,"レフリー",null,null,null,null,null,null,null,null,"レフリー",null,null,null,null,null,null,null,null,"レフリー",null,null,null,null,null,null,null,null,"レフリー",null,null,null,null,null,null,null,null,"レフリー",null,null,null,null,null,null,null,null,"レフリー"]
[null,{"$f":"★個人成績表★!$A$1","v":"第31回　京阪神和奈滋対抗戦　　　(奈良；玉出エース)"},null,null,null,null,null,null,null,null,{"$f":"★個人成績表★!$A$1","v":"第31回　京阪神和奈滋対抗戦　　　(奈良；玉出エース)"},null,null,null,null,null,null,null,null,{"$f":"★個人成績表★!$A$1","v":"第31回　京阪神和奈滋対抗戦　　　(奈良；玉出エース)"},null,null,null,null,null,null,null,null,{"$f":"★個人成績表★!$A$1","v":"第31回　京阪神和奈滋対抗戦　　　(奈良；玉出エース)"},null,null,null,null,null,null,null,null,{"$f":"★個人成績表★!$A$1","v":"第31回　京阪神和奈滋対抗戦　　　(奈良；玉出エース)"},null,null,null,null,null,null,null,null,{"$f":"★個人成績表★!$A$1","v":"第31回　京阪神和奈滋対抗戦　　　(奈良；玉出エース)"},null,null,null,null,null,null,null,null,{"$f":"★個人成績表★!$A$1","v":"第31回　京阪神和奈滋対抗戦　　　(奈良；玉出エース)"},null,null,null,null,null,null,null," "]
[]
[null,"G-No",{"$f":"BE33+1","v":22},null,null,"T-No",null,null,null,null,"G-No",{"$f":"C43+1","v":23},null,null,"T-No",null,null,null,null,"G-No",{"$f":"L43+1","v":24},null,null,"T-No",null,null,null,null,"G-No",{"$f":"U43+1","v":25},null,null,"T-No",null,null,null,null,"G-No",{"$f":"AD43+1","v":26},null,null,"T-No",null,null,null,null,"G-No",{"$f":"AM43+1","v":27},null,null,"T-No",null,null,null,null,"G-No",{"$f":"AV43+1","v":28},null,null,"T-No"]
[]
[null,{"$f":"VLOOKUP(C43,結果入力表!$B$2:$J$212,2,FALSE)","v":"HRC"},null,null,"所属",{"$f":"VLOOKUP(C43,結果入力表!$B$2:$J$212,9,FALSE)","v":"SBC"},null,null,null,null,{"$f":"VLOOKUP(L43,結果入力表!$B$2:$J$212,2,FALSE)","v":"HRC"},null,null,"所属",{"$f":"VLOOKUP(L43,結果入力表!$B$2:$J$212,9,FALSE)","v":"SBC"},null,null,null,null,{"$f":"VLOOKUP(U43,結果入力表!$B$2:$J$212,2,FALSE)","v":"HRC"},null,null,"所属",{"$f":"VLOOKUP(U43,結果入力表!$B$2:$J$212,9,FALSE)","v":"SBC"},null,null,null,null,{"$f":"VLOOKUP(AD43,結果入力表!$B$2:$J$212,2,FALSE)","v":"HRC"},null,null,"所属",{"$f":"VLOOKUP(AD43,結果入力表!$B$2:$J$212,9,FALSE)","v":"SBC"},null,null,null,null,{"$f":"VLOOKUP(AM43,結果入力表!$B$2:$J$212,2,FALSE)","v":"HRC"},null,null,"所属",{"$f":"VLOOKUP(AM43,結果入力表!$B$2:$J$212,9,FALSE)","v":"SBC"},null,null,null,null,{"$f":"VLOOKUP(AV43,結果入力表!$B$2:$J$212,2,FALSE)","v":"HRC"},null,null,"所属",{"$f":"VLOOKUP(AV43,結果入力表!$B$2:$J$212,9,FALSE)","v":"SBC"},null,null,null,null,{"$f":"VLOOKUP(BE43,結果入力表!$B$2:$J$212,2,FALSE)","v":"HRC"},null,null,"所属",{"$f":"VLOOKUP(BE43,結果入力表!$B$2:$J$212,9,FALSE)","v":"SBC"}]
[null,{"$f":"VLOOKUP(C43,結果入力表!$B$2:$J$212,3,FALSE)","v":"鐵山　泰三"},null,null,"氏名",{"$f":"VLOOKUP(C43,結果入力表!$B$2:$J$212,8,FALSE)","v":"林　秀忠"},null,null,null,null,{"$f":"VLOOKUP(L43,結果入力表!$B$2:$J$212,3,FALSE)","v":"堂園　雅也"},null,null,"氏名",{"$f":"VLOOKUP(L43,結果入力表!$B$2:$J$212,8,FALSE)","v":"大橋　義治"},null,null,null,null,{"$f":"VLOOKUP(U43,結果入力表!$B$2:$J$212,3,FALSE)","v":"宮本　一"},null,null,"氏名",{"$f":"VLOOKUP(U43,結果入力表!$B$2:$J$212,8,FALSE)","v":"山中　康寛"},null,null,null,null,{"$f":"VLOOKUP(AD43,結果入力表!$B$2:$J$212,3,FALSE)","v":"伊藤　登"},null,null,"氏名",{"$f":"VLOOKUP(AD43,結果入力表!$B$2:$J$212,8,FALSE)","v":"西峰　久祐"},null,null,null,null,{"$f":"VLOOKUP(AM43,結果入力表!$B$2:$J$212,3,FALSE)","v":"宮井健太郎"},null,null,"氏名",{"$f":"VLOOKUP(AM43,結果入力表!$B$2:$J$212,8,FALSE)","v":"大橋　正寛"},null,null,null,null,{"$f":"VLOOKUP(AV43,結果入力表!$B$2:$J$212,3,FALSE)","v":"白澤雄一郎"},null,null,"氏名",{"$f":"VLOOKUP(AV43,結果入力表!$B$2:$J$212,8,FALSE)","v":"秋田　倫央"},null,null,null,null,{"$f":"VLOOKUP(BE43,結果入力表!$B$2:$J$212,3,FALSE)","v":"河地　恵里"},null,null,"氏名",{"$f":"VLOOKUP(BE43,結果入力表!$B$2:$J$212,8,FALSE)","v":"大橋　洋子"}]
[null,null,null,null,"得点",null,null,null,null,null,null,null,null,"得点",null,null,null,null,null,null,null,null,"得点",null,null,null,null,null,null,null,null,"得点",null,null,null,null,null,null,null,null,"得点",null,null,null,null,null,null,null,null,"得点",null,null,null,null,null,null,null,null,"得点"]
[null,null,null,null,"HR",null,null,null,null,null,null,null,null,"HR",null,null,null,null,null,null,null,null,"HR",null,null,null,null,null,null,null,null,"HR",null,null,null,null,null,null,null,null,"HR",null,null,null,null,null,null,null,null,"HR",null,null,null,null,null,null,null,null,"HR"]
[]
[null,null,null,null,null,"レフリー",null,null,null,null,null,null,null,null,"レフリー",null,null,null,null,null,null,null,null,"レフリー",null,null,null,null,null,null,null,null,"レフリー",null,null,null,null,null,null,null,null,"レフリー",null,null,null,null,null,null,null,null,"レフリー",null,null,null,null,null,null,null,null,"レフリー"]
[null,{"$f":"★個人成績表★!$A$1","v":"第31回　京阪神和奈滋対抗戦　　　(奈良；玉出エース)"},null,null,null,null,null,null,null,null,{"$f":"★個人成績表★!$A$1","v":"第31回　京阪神和奈滋対抗戦　　　(奈良；玉出エース)"},null,null,null,null,null,null,null,null,{"$f":"★個人成績表★!$A$1","v":"第31回　京阪神和奈滋対抗戦　　　(奈良；玉出エース)"},null,null,null,null,null,null,null,null,{"$f":"★個人成績表★!$A$1","v":"第31回　京阪神和奈滋対抗戦　　　(奈良；玉出エース)"},null,null,null,null,null,null,null,null,{"$f":"★個人成績表★!$A$1","v":"第31回　京阪神和奈滋対抗戦　　　(奈良；玉出エース)"},null,null,null,null,null,null,null,null,{"$f":"★個人成績表★!$A$1","v":"第31回　京阪神和奈滋対抗戦　　　(奈良；玉出エース)"},null,null,null,null,null,null,null,null,{"$f":"★個人成績表★!$A$1","v":"第31回　京阪神和奈滋対抗戦　　　(奈良；玉出エース)"},null,null,null,null,null,null,null," "]
[]
[null,"G-No",{"$f":"BE43+1","v":29},null,null,"T-No",null,null,null,null,"G-No",{"$f":"C53+1","v":30},null,null,"T-No",null,null,null,null,"G-No",{"$f":"L53+1","v":31},null,null,"T-No",null,null,null,null,"G-No",{"$f":"U53+1","v":32},null,null,"T-No",null,null,null,null,"G-No",{"$f":"AD53+1","v":33},null,null,"T-No",null,null,null,null,"G-No",{"$f":"AM53+1","v":34},null,null,"T-No",null,null,null,null,"G-No",{"$f":"AV53+1","v":35},null,null,"T-No"]
[]
[null,{"$f":"VLOOKUP(C53,結果入力表!$B$2:$J$212,2,FALSE)","v":"WRC"},null,null,"所属",{"$f":"VLOOKUP(C53,結果入力表!$B$2:$J$212,9,FALSE)","v":"NRC"},null,null,null,null,{"$f":"VLOOKUP(L53,結果入力表!$B$2:$J$212,2,FALSE)","v":"WRC"},null,null,"所属",{"$f":"VLOOKUP(L53,結果入力表!$B$2:$J$212,9,FALSE)","v":"NRC"},null,null,null,null,{"$f":"VLOOKUP(U53,結果入力表!$B$2:$J$212,2,FALSE)","v":"WRC"},null,null,"所属",{"$f":"VLOOKUP(U53,結果入力表!$B$2:$J$212,9,FALSE)","v":"NRC"},null,null,null,null,{"$f":"VLOOKUP(AD53,結果入力表!$B$2:$J$212,2,FALSE)","v":"WRC"},null,null,"所属",{"$f":"VLOOKUP(AD53,結果入力表!$B$2:$J$212,9,FALSE)","v":"NRC"},null,null,null,null,{"$f":"VLOOKUP(AM53,結果入力表!$B$2:$J$212,2,FALSE)","v":"WRC"},null,null,"所属",{"$f":"VLOOKUP(AM53,結果入力表!$B$2:$J$212,9,FALSE)","v":"NRC"},null,null,null,null,{"$f":"VLOOKUP(AV53,結果入力表!$B$2:$J$212,2,FALSE)","v":"WRC"},null,null,"所属",{"$f":"VLOOKUP(AV53,結果入力表!$B$2:$J$212,9,FALSE)","v":"NRC"},null,null,null,null,{"$f":"VLOOKUP(BE53,結果入力表!$B$2:$J$212,2,FALSE)","v":"WRC"},null,null,"所属",{"$f":"VLOOKUP(BE53,結果入力表!$B$2:$J$212,9,FALSE)","v":"NRC"}]
[null,{"$f":"VLOOKUP(C53,結果入力表!$B$2:$J$212,3,FALSE)","v":"末岡　修"},null,null,"氏名",{"$f":"VLOOKUP(C53,結果入力表!$B$2:$J$212,8,FALSE)","v":"吉向　翔平"},null,null,null,null,{"$f":"VLOOKUP(L53,結果入力表!$B$2:$J$212,3,FALSE)","v":"和田宗一郎"},null,null,"氏名",{"$f":"VLOOKUP(L53,結果入力表!$B$2:$J$212,8,FALSE)","v":"岩本　剛"},null,null,null,null,{"$f":"VLOOKUP(U53,結果入力表!$B$2:$J$212,3,FALSE)","v":"杉本　博章"},null,null,"氏名",{"$f":"VLOOKUP(U53,結果入力表!$B$2:$J$212,8,FALSE)","v":"白戸　玲人"},null,null,null,null,{"$f":"VLOOKUP(AD53,結果入力表!$B$2:$J$212,3,FALSE)","v":"中本　雅大"},null,null,"氏名",{"$f":"VLOOKUP(AD53,結果入力表!$B$2:$J$212,8,FALSE)","v":"植田　慎也"},null,null,null,null,{"$f":"VLOOKUP(AM53,結果入力表!$B$2:$J$212,3,FALSE)","v":"山中　康介"},null,null,"氏名",{"$f":"VLOOKUP(AM53,結果入力表!$B$2:$J$212,8,FALSE)","v":"近藤　拓馬"},null,null,null,null,{"$f":"VLOOKUP(AV53,結果入力表!$B$2:$J$212,3,FALSE)","v":"芝先　泰生"},null,null,"氏名",{"$f":"VLOOKUP(AV53,結果入力表!$B$2:$J$212,8,FALSE)","v":"長谷川　進"},null,null,null,null,{"$f":"VLOOKUP(BE53,結果入力表!$B$2:$J$212,3,FALSE)","v":"松房ゆかり"},null,null,"氏名",{"$f":"VLOOKUP(BE53,結果入力表!$B$2:$J$212,8,FALSE)","v":"白戸　恭子"}]
[null,null,null,null,"得点",null,null,null,null,null,null,null,null,"得点",null,null,null,null,null,null,null,null,"得点",null,null,null,null,null,null,null,null,"得点",null,null,null,null,null,null,null,null,"得点",null,null,null,null,null,null,null,null,"得点",null,null,null,null,null,null,null,null,"得点"]
[null,null,null,null,"HR",null,null,null,null,null,null,null,null,"HR",null,null,null,null,null,null,null,null,"HR",null,null,null,null,null,null,null,null,"HR",null,null,null,null,null,null,null,null,"HR",null,null,null,null,null,null,null,null,"HR",null,null,null,null,null,null,null,null,"HR"]
[]
[null,null,null,null,null,"レフリー",null,null,null,null,null,null,null,null,"レフリー",null,null,null,null,null,null,null,null,"レフリー",null,null,null,null,null,null,null,null,"レフリー",null,null,null,null,null,null,null,null,"レフリー",null,null,null,null,null,null,null,null,"レフリー",null,null,null,null,null,null,null,null,"レフリー"]
[null,{"$f":"★個人成績表★!$A$1","v":"第31回　京阪神和奈滋対抗戦　　　(奈良；玉出エース)"},null,null,null,null,null,null,null,null,{"$f":"★個人成績表★!$A$1","v":"第31回　京阪神和奈滋対抗戦　　　(奈良；玉出エース)"},null,null,null,null,null,null,null,null,{"$f":"★個人成績表★!$A$1","v":"第31回　京阪神和奈滋対抗戦　　　(奈良；玉出エース)"},null,null,null,null,null,null,null,null,{"$f":"★個人成績表★!$A$1","v":"第31回　京阪神和奈滋対抗戦　　　(奈良；玉出エース)"},null,null,null,null,null,null,null,null,{"$f":"★個人成績表★!$A$1","v":"第31回　京阪神和奈滋対抗戦　　　(奈良；玉出エース)"},null,null,null,null,null,null,null,null,{"$f":"★個人成績表★!$A$1","v":"第31回　京阪神和奈滋対抗戦　　　(奈良；玉出エース)"},null,null,null,null,null,null,null,null,{"$f":"★個人成績表★!$A$1","v":"第31回　京阪神和奈滋対抗戦　　　(奈良；玉出エース)"},null,null,null,null,null,null,null," "]
[]
[null,"G-No",{"$f":"BE53+1","v":36},null,null,"T-No",null,null,null,null,"G-No",{"$f":"C63+1","v":37},null,null,"T-No",null,null,null,null,"G-No",{"$f":"L63+1","v":38},null,null,"T-No",null,null,null,null,"G-No",{"$f":"U63+1","v":39},null,null,"T-No",null,null,null,null,"G-No",{"$f":"AD63+1","v":40},null,null,"T-No",null,null,null,null,"G-No",{"$f":"AM63+1","v":41},null,null,"T-No",null,null,null,null,"G-No",{"$f":"AV63+1","v":42},null,null,"T-No"]
[]
[null,{"$f":"VLOOKUP(C63,結果入力表!$B$2:$J$212,2,FALSE)","v":"KRC"},null,null,"所属",{"$f":"VLOOKUP(C63,結果入力表!$B$2:$J$212,9,FALSE)","v":"ORC"},null,null,null,null,{"$f":"VLOOKUP(L63,結果入力表!$B$2:$J$212,2,FALSE)","v":"KRC"},null,null,"所属",{"$f":"VLOOKUP(L63,結果入力表!$B$2:$J$212,9,FALSE)","v":"ORC"},null,null,null,null,{"$f":"VLOOKUP(U63,結果入力表!$B$2:$J$212,2,FALSE)","v":"KRC"},null,null,"所属",{"$f":"VLOOKUP(U63,結果入力表!$B$2:$J$212,9,FALSE)","v":"ORC"},null,null,null,null,{"$f":"VLOOKUP(AD63,結果入力表!$B$2:$J$212,2,FALSE)","v":"KRC"},null,null,"所属",{"$f":"VLOOKUP(AD63,結果入力表!$B$2:$J$212,9,FALSE)","v":"ORC"},null,null,null,null,{"$f":"VLOOKUP(AM63,結果入力表!$B$2:$J$212,2,FALSE)","v":"KRC"},null,null,"所属",{"$f":"VLOOKUP(AM63,結果入力表!$B$2:$J$212,9,FALSE)","v":"ORC"},null,null,null,null,{"$f":"VLOOKUP(AV63,結果入力表!$B$2:$J$212,2,FALSE)","v":"KRC"},null,null,"所属",{"$f":"VLOOKUP(AV63,結果入力表!$B$2:$J$212,9,FALSE)","v":"ORC"},null,null,null,null,{"$f":"VLOOKUP(BE63,結果入力表!$B$2:$J$212,2,FALSE)","v":"KRC"},null,null,"所属",{"$f":"VLOOKUP(BE63,結果入力表!$B$2:$J$212,9,FALSE)","v":"ORC"}]
[null,{"$f":"VLOOKUP(C63,結果入力表!$B$2:$J$212,3,FALSE)","v":"松好　太一"},null,null,"氏名",{"$f":"VLOOKUP(C63,結果入力表!$B$2:$J$212,8,FALSE)","v":"松居　勝巳"},null,null,null,null,{"$f":"VLOOKUP(L63,結果入力表!$B$2:$J$212,3,FALSE)","v":"清水　義晴"},null,null,"氏名",{"$f":"VLOOKUP(L63,結果入力表!$B$2:$J$212,8,FALSE)","v":"藤明　宏樹"},null,null,null,null,{"$f":"VLOOKUP(U63,結果入力表!$B$2:$J$212,3,FALSE)","v":"鈴木　康文"},null,null,"氏名",{"$f":"VLOOKUP(U63,結果入力表!$B$2:$J$212,8,FALSE)","v":"吉岡　保俊"},null,null,null,null,{"$f":"VLOOKUP(AD63,結果入力表!$B$2:$J$212,3,FALSE)","v":"早川　徹"},null,null,"氏名",{"$f":"VLOOKUP(AD63,結果入力表!$B$2:$J$212,8,FALSE)","v":"村上　泰辰"},null,null,null,null,{"$f":"VLOOKUP(AM63,結果入力表!$B$2:$J$212,3,FALSE)","v":"井関　一成"},null,null,"氏名",{"$f":"VLOOKUP(AM63,結果入力表!$B$2:$J$212,8,FALSE)","v":"小原　嘉丈"},null,null,null,null,{"$f":"VLOOKUP(AV63,結果入力表!$B$2:$J$212,3,FALSE)","v":"今村　哲也"},null,null,"氏名",{"$f":"VLOOKUP(AV63,結果入力表!$B$2:$J$212,8,FALSE)","v":"乾　伸綱"},null,null,null,null,{"$f":"VLOOKUP(BE63,結果入力表!$B$2:$J$212,3,FALSE)","v":"森田由佳里"},null,null,"氏名",{"$f":"VLOOKUP(BE63,結果入力表!$B$2:$J$212,8,FALSE)","v":"山崎真紀子"}]
[null,null,null,null,"得点",null,null,null,null,null,null,null,null,"得点",null,null,null,null,null,null,null,null,"得点",null,null,null,null,null,null,null,null,"得点",null,null,null,null,null,null,null,null,"得点",null,null,null,null,null,null,null,null,"得点",null,null,null,null,null,null,null,null,"得点"]
[null,null,null,null,"HR",null,null,null,null,null,null,null,null,"HR",null,null,null,null,null,null,null,null,"HR",null,null,null,null,null,null,null,null,"HR",null,null,null,null,null,null,null,null,"HR",null,null,null,null,null,null,null,null,"HR",null,null,null,null,null,null,null,null,"HR"]
[]
[null,null,null,null,null,"レフリー",null,null,null,null,null,null,null,null,"レフリー",null,null,null,null,null,null,null,null,"レフリー",null,null,null,null,null,null,null,null,"レフリー",null,null,null,null,null,null,null,null,"レフリー",null,null,null,null,null,null,null,null,"レフリー",null,null,null,null,null,null,null,null,"レフリー"]
[null,{"$f":"★個人成績表★!$A$1","v":"第31回　京阪神和奈滋対抗戦　　　(奈良；玉出エース)"},null,null,null,null,null,null,null,null,{"$f":"★個人成績表★!$A$1","v":"第31回　京阪神和奈滋対抗戦　　　(奈良；玉出エース)"},null,null,null,null,null,null,null,null,{"$f":"★個人成績表★!$A$1","v":"第31回　京阪神和奈滋対抗戦　　　(奈良；玉出エース)"},null,null,null,null,null,null,null,null,{"$f":"★個人成績表★!$A$1","v":"第31回　京阪神和奈滋対抗戦　　　(奈良；玉出エース)"},null,null,null,null,null,null,null,null,{"$f":"★個人成績表★!$A$1","v":"第31回　京阪神和奈滋対抗戦　　　(奈良；玉出エース)"},null,null,null,null,null,null,null,null,{"$f":"★個人成績表★!$A$1","v":"第31回　京阪神和奈滋対抗戦　　　(奈良；玉出エース)"},null,null,null,null,null,null,null,null,{"$f":"★個人成績表★!$A$1","v":"第31回　京阪神和奈滋対抗戦　　　(奈良；玉出エース)"},null,null,null,null,null,null,null," "]
[]
[null,"G-No",{"$f":"BE63+1","v":43},null,null,"T-No",null,null,null,null,"G-No",{"$f":"C73+1","v":44},null,null,"T-No",null,null,null,null,"G-No",{"$f":"L73+1","v":45},null,null,"T-No",null,null,null,null,"G-No",{"$f":"U73+1","v":46},null,null,"T-No",null,null,null,null,"G-No",{"$f":"AD73+1","v":47},null,null,"T-No",null,null,null,null,"G-No",{"$f":"AM73+1","v":48},null,null,"T-No",null,null,null,null,"G-No",{"$f":"AV73+1","v":49},null,null,"T-No"]
[]
[null,{"$f":"VLOOKUP(C73,結果入力表!$B$2:$J$212,2,FALSE)","v":"WRC"},null,null,"所属",{"$f":"VLOOKUP(C73,結果入力表!$B$2:$J$212,9,FALSE)","v":"HRC"},null,null,null,null,{"$f":"VLOOKUP(L73,結果入力表!$B$2:$J$212,2,FALSE)","v":"WRC"},null,null,"所属",{"$f":"VLOOKUP(L73,結果入力表!$B$2:$J$212,9,FALSE)","v":"HRC"},null,null,null,null,{"$f":"VLOOKUP(U73,結果入力表!$B$2:$J$212,2,FALSE)","v":"WRC"},null,null,"所属",{"$f":"VLOOKUP(U73,結果入力表!$B$2:$J$212,9,FALSE)","v":"HRC"},null,null,null,null,{"$f":"VLOOKUP(AD73,結果入力表!$B$2:$J$212,2,FALSE)","v":"WRC"},null,null,"所属",{"$f":"VLOOKUP(AD73,結果入力表!$B$2:$J$212,9,FALSE)","v":"HRC"},null,null,null,null,{"$f":"VLOOKUP(AM73,結果入力表!$B$2:$J$212,2,FALSE)","v":"WRC"},null,null,"所属",{"$f":"VLOOKUP(AM73,結果入力表!$B$2:$J$212,9,FALSE)","v":"HRC"},null,null,null,null,{"$f":"VLOOKUP(AV73,結果入力表!$B$2:$J$212,2,FALSE)","v":"WRC"},null,null,"所属",{"$f":"VLOOKUP(AV73,結果入力表!$B$2:$J$212,9,FALSE)","v":"HRC"},null,null,null,null,{"$f":"VLOOKUP(BE73,結果入力表!$B$2:$J$212,2,FALSE)","v":"WRC"},null,null,"所属",{"$f":"VLOOKUP(BE73,結果入力表!$B$2:$J$212,9,FALSE)","v":"HRC"}]
[null,{"$f":"VLOOKUP(C73,結果入力表!$B$2:$J$212,3,FALSE)","v":"末岡　修"},null,null,"氏名",{"$f":"VLOOKUP(C73,結果入力表!$B$2:$J$212,8,FALSE)","v":"鐵山　泰三"},null,null,null,null,{"$f":"VLOOKUP(L73,結果入力表!$B$2:$J$212,3,FALSE)","v":"和田宗一郎"},null,null,"氏名",{"$f":"VLOOKUP(L73,結果入力表!$B$2:$J$212,8,FALSE)","v":"堂園　雅也"},null,null,null,null,{"$f":"VLOOKUP(U73,結果入力表!$B$2:$J$212,3,FALSE)","v":"杉本　博章"},null,null,"氏名",{"$f":"VLOOKUP(U73,結果入力表!$B$2:$J$212,8,FALSE)","v":"宮本　一"},null,null,null,null,{"$f":"VLOOKUP(AD73,結果入力表!$B$2:$J$212,3,FALSE)","v":"中本　雅大"},null,null,"氏名",{"$f":"VLOOKUP(AD73,結果入力表!$B$2:$J$212,8,FALSE)","v":"伊藤　登"},null,null,null,null,{"$f":"VLOOKUP(AM73,結果入力表!$B$2:$J$212,3,FALSE)","v":"山中　康介"},null,null,"氏名",{"$f":"VLOOKUP(AM73,結果入力表!$B$2:$J$212,8,FALSE)","v":"宮井健太郎"},null,null,null,null,{"$f":"VLOOKUP(AV73,結果入力表!$B$2:$J$212,3,FALSE)","v":"芝先　泰生"},null,null,"氏名",{"$f":"VLOOKUP(AV73,結果入力表!$B$2:$J$212,8,FALSE)","v":"白澤雄一郎"},null,null,null,null,{"$f":"VLOOKUP(BE73,結果入力表!$B$2:$J$212,3,FALSE)","v":"松房ゆかり"},null,null,"氏名",{"$f":"VLOOKUP(BE73,結果入力表!$B$2:$J$212,8,FALSE)","v":"河地　恵里"}]
[null,null,null,null,"得点",null,null,null,null,null,null,null,null,"得点",null,null,null,null,null,null,null,null,"得点",null,null,null,null,null,null,null,null,"得点",null,null,null,null,null,null,null,null,"得点",null,null,null,null,null,null,null,null,"得点",null,null,null,null,null,null,null,null,"得点"]
[null,null,null,null,"HR",null,null,null,null,null,null,null,null,"HR",null,null,null,null,null,null,null,null,"HR",null,null,null,null,null,null,null,null,"HR",null,null,null,null,null,null,null,null,"HR",null,null,null,null,null,null,null,null,"HR",null,null,null,null,null,null,null,null,"HR"]
[]
[null,null,null,null,null,"レフリー",null,null,null,null,null,null,null,null,"レフリー",null,null,null,null,null,null,null,null,"レフリー",null,null,null,null,null,null,null,null,"レフリー",null,null,null,null,null,null,null,null,"レフリー",null,null,null,null,null,null,null,null,"レフリー",null,null,null,null,null,null,null,null,"レフリー"]
[null,{"$f":"★個人成績表★!$A$1","v":"第31回　京阪神和奈滋対抗戦　　　(奈良；玉出エース)"},null,null,null,null,null,null,null,null,{"$f":"★個人成績表★!$A$1","v":"第31回　京阪神和奈滋対抗戦　　　(奈良；玉出エース)"},null,null,null,null,null,null,null,null,{"$f":"★個人成績表★!$A$1","v":"第31回　京阪神和奈滋対抗戦　　　(奈良；玉出エース)"},null,null,null,null,null,null,null,null,{"$f":"★個人成績表★!$A$1","v":"第31回　京阪神和奈滋対抗戦　　　(奈良；玉出エース)"},null,null,null,null,null,null,null,null,{"$f":"★個人成績表★!$A$1","v":"第31回　京阪神和奈滋対抗戦　　　(奈良；玉出エース)"},null,null,null,null,null,null,null,null,{"$f":"★個人成績表★!$A$1","v":"第31回　京阪神和奈滋対抗戦　　　(奈良；玉出エース)"},null,null,null,null,null,null,null,null,{"$f":"★個人成績表★!$A$1","v":"第31回　京阪神和奈滋対抗戦　　　(奈良；玉出エース)"},null,null,null,null,null,null,null," "]
[]
[null,"G-No",{"$f":"BE73+1","v":50},null,null,"T-No",null,null,null,null,"G-No",{"$f":"C83+1","v":51},null,null,"T-No",null,null,null,null,"G-No",{"$f":"L83+1","v":52},null,null,"T-No",null,null,null,null,"G-No",{"$f":"U83+1","v":53},null,null,"T-No",null,null,null,null,"G-No",{"$f":"AD83+1","v":54},null,null,"T-No",null,null,null,null,"G-No",{"$f":"AM83+1","v":55},null,null,"T-No",null,null,null,null,"G-No",{"$f":"AV83+1","v":56},null,null,"T-No"]
[]
[null,{"$f":"VLOOKUP(C83,結果入力表!$B$2:$J$212,2,FALSE)","v":"ORC"},null,null,"所属",{"$f":"VLOOKUP(C83,結果入力表!$B$2:$J$212,9,FALSE)","v":"SBC"},null,null,null,null,{"$f":"VLOOKUP(L83,結果入力表!$B$2:$J$212,2,FALSE)","v":"ORC"},null,null,"所属",{"$f":"VLOOKUP(L83,結果入力表!$B$2:$J$212,9,FALSE)","v":"SBC"},null,null,null,null,{"$f":"VLOOKUP(U83,結果入力表!$B$2:$J$212,2,FALSE)","v":"ORC"},null,null,"所属",{"$f":"VLOOKUP(U83,結果入力表!$B$2:$J$212,9,FALSE)","v":"SBC"},null,null,null,null,{"$f":"VLOOKUP(AD83,結果入力表!$B$2:$J$212,2,FALSE)","v":"ORC"},null,null,"所属",{"$f":"VLOOKUP(AD83,結果入力表!$B$2:$J$212,9,FALSE)","v":"SBC"},null,null,null,null,{"$f":"VLOOKUP(AM83,結果入力表!$B$2:$J$212,2,FALSE)","v":"ORC"},null,null,"所属",{"$f":"VLOOKUP(AM83,結果入力表!$B$2:$J$212,9,FALSE)","v":"SBC"},null,null,null,null,{"$f":"VLOOKUP(AV83,結果入力表!$B$2:$J$212,2,FALSE)","v":"ORC"},null,null,"所属",{"$f":"VLOOKUP(AV83,結果入力表!$B$2:$J$212,9,FALSE)","v":"SBC"},null,null,null,null,{"$f":"VLOOKUP(BE83,結果入力表!$B$2:$J$212,2,FALSE)","v":"ORC"},null,null,"所属",{"$f":"VLOOKUP(BE83,結果入力表!$B$2:$J$212,9,FALSE)","v":"SBC"}]
[null,{"$f":"VLOOKUP(C83,結果入力表!$B$2:$J$212,3,FALSE)","v":"松居　勝巳"},null,null,"氏名",{"$f":"VLOOKUP(C83,結果入力表!$B$2:$J$212,8,FALSE)","v":"林　秀忠"},null,null,null,null,{"$f":"VLOOKUP(L83,結果入力表!$B$2:$J$212,3,FALSE)","v":"藤明　宏樹"},null,null,"氏名",{"$f":"VLOOKUP(L83,結果入力表!$B$2:$J$212,8,FALSE)","v":"大橋　義治"},null,null,null,null,{"$f":"VLOOKUP(U83,結果入力表!$B$2:$J$212,3,FALSE)","v":"吉岡　保俊"},null,null,"氏名",{"$f":"VLOOKUP(U83,結果入力表!$B$2:$J$212,8,FALSE)","v":"山中　康寛"},null,null,null,null,{"$f":"VLOOKUP(AD83,結果入力表!$B$2:$J$212,3,FALSE)","v":"村上　泰辰"},null,null,"氏名",{"$f":"VLOOKUP(AD83,結果入力表!$B$2:$J$212,8,FALSE)","v":"西峰　久祐"},null,null,null,null,{"$f":"VLOOKUP(AM83,結果入力表!$B$2:$J$212,3,FALSE)","v":"小原　嘉丈"},null,null,"氏名",{"$f":"VLOOKUP(AM83,結果入力表!$B$2:$J$212,8,FALSE)","v":"大橋　正寛"},null,null,null,null,{"$f":"VLOOKUP(AV83,結果入力表!$B$2:$J$212,3,FALSE)","v":"乾　伸綱"},null,null,"氏名",{"$f":"VLOOKUP(AV83,結果入力表!$B$2:$J$212,8,FALSE)","v":"秋田　倫央"},null,null,null,null,{"$f":"VLOOKUP(BE83,結果入力表!$B$2:$J$212,3,FALSE)","v":"山崎真紀子"},null,null,"氏名",{"$f":"VLOOKUP(BE83,結果入力表!$B$2:$J$212,8,FALSE)","v":"大橋　洋子"}]
[null,null,null,null,"得点",null,null,null,null,null,null,null,null,"得点",null,null,null,null,null,null,null,null,"得点",null,null,null,null,null,null,null,null,"得点",null,null,null,null,null,null,null,null,"得点",null,null,null,null,null,null,null,null,"得点",null,null,null,null,null,null,null,null,"得点"]
[null,null,null,null,"HR",null,null,null,null,null,null,null,null,"HR",null,null,null,null,null,null,null,null,"HR",null,null,null,null,null,null,null,null,"HR",null,null,null,null,null,null,null,null,"HR",null,null,null,null,null,null,null,null,"HR",null,null,null,null,null,null,null,null,"HR"]
[]
[null,null,null,null,null,"レフリー",null,null,null,null,null,null,null,null,"レフリー",null,null,null,null,null,null,null,null,"レフリー",null,null,null,null,null,null,null,null,"レフリー",null,null,null,null,null,null,null,null,"レフリー",null,null,null,null,null,null,null,null,"レフリー",null,null,null,null,null,null,null,null,"レフリー"]
[null,{"$f":"★個人成績表★!$A$1","v":"第31回　京阪神和奈滋対抗戦　　　(奈良；玉出エース)"},null,null,null,null,null,null,null,null,{"$f":"★個人成績表★!$A$1","v":"第31回　京阪神和奈滋対抗戦　　　(奈良；玉出エース)"},null,null,null,null,null,null,null,null,{"$f":"★個人成績表★!$A$1","v":"第31回　京阪神和奈滋対抗戦　　　(奈良；玉出エース)"},null,null,null,null,null,null,null,null,{"$f":"★個人成績表★!$A$1","v":"第31回　京阪神和奈滋対抗戦　　　(奈良；玉出エース)"},null,null,null,null,null,null,null,null,{"$f":"★個人成績表★!$A$1","v":"第31回　京阪神和奈滋対抗戦　　　(奈良；玉出エース)"},null,null,null,null,null,null,null,null,{"$f":"★個人成績表★!$A$1","v":"第31回　京阪神和奈滋対抗戦　　　(奈良；玉出エース)"},null,null,null,null,null,null,null,null,{"$f":"★個人成績表★!$A$1","v":"第31回　京阪神和奈滋対抗戦　　　(奈良；玉出エース)"},null,null,null,null,null,null,null," "]
[]
[null,"G-No",{"$f":"BE83+1","v":57},null,null,"T-No",null,null,null,null,"G-No",{"$f":"C93+1","v":58},null,null,"T-No",null,null,null,null,"G-No",{"$f":"L93+1","v":59},null,null,"T-No",null,null,null,null,"G-No",{"$f":"U93+1","v":60},null,null,"T-No",null,null,null,null,"G-No",{"$f":"AD93+1","v":61},null,null,"T-No",null,null,null,null,"G-No",{"$f":"AM93+1","v":62},null,null,"T-No",null,null,null,null,"G-No",{"$f":"AV93+1","v":63},null,null,"T-No"]
[]
[null,{"$f":"VLOOKUP(C93,結果入力表!$B$2:$J$212,2,FALSE)","v":"KRC"},null,null,"所属",{"$f":"VLOOKUP(C93,結果入力表!$B$2:$J$212,9,FALSE)","v":"NRC"},null,null,null,null,{"$f":"VLOOKUP(L93,結果入力表!$B$2:$J$212,2,FALSE)","v":"KRC"},null,null,"所属",{"$f":"VLOOKUP(L93,結果入力表!$B$2:$J$212,9,FALSE)","v":"NRC"},null,null,null,null,{"$f":"VLOOKUP(U93,結果入力表!$B$2:$J$212,2,FALSE)","v":"KRC"},null,null,"所属",{"$f":"VLOOKUP(U93,結果入力表!$B$2:$J$212,9,FALSE)","v":"NRC"},null,null,null,null,{"$f":"VLOOKUP(AD93,結果入力表!$B$2:$J$212,2,FALSE)","v":"KRC"},null,null,"所属",{"$f":"VLOOKUP(AD93,結果入力表!$B$2:$J$212,9,FALSE)","v":"NRC"},null,null,null,null,{"$f":"VLOOKUP(AM93,結果入力表!$B$2:$J$212,2,FALSE)","v":"KRC"},null,null,"所属",{"$f":"VLOOKUP(AM93,結果入力表!$B$2:$J$212,9,FALSE)","v":"NRC"},null,null,null,null,{"$f":"VLOOKUP(AV93,結果入力表!$B$2:$J$212,2,FALSE)","v":"KRC"},null,null,"所属",{"$f":"VLOOKUP(AV93,結果入力表!$B$2:$J$212,9,FALSE)","v":"NRC"},null,null,null,null,{"$f":"VLOOKUP(BE93,結果入力表!$B$2:$J$212,2,FALSE)","v":"KRC"},null,null,"所属",{"$f":"VLOOKUP(BE93,結果入力表!$B$2:$J$212,9,FALSE)","v":"NRC"}]
[null,{"$f":"VLOOKUP(C93,結果入力表!$B$2:$J$212,3,FALSE)","v":"松好　太一"},null,null,"氏名",{"$f":"VLOOKUP(C93,結果入力表!$B$2:$J$212,8,FALSE)","v":"吉向　翔平"},null,null,null,null,{"$f":"VLOOKUP(L93,結果入力表!$B$2:$J$212,3,FALSE)","v":"清水　義晴"},null,null,"氏名",{"$f":"VLOOKUP(L93,結果入力表!$B$2:$J$212,8,FALSE)","v":"岩本　剛"},null,null,null,null,{"$f":"VLOOKUP(U93,結果入力表!$B$2:$J$212,3,FALSE)","v":"鈴木　康文"},null,null,"氏名",{"$f":"VLOOKUP(U93,結果入力表!$B$2:$J$212,8,FALSE)","v":"白戸　玲人"},null,null,null,null,{"$f":"VLOOKUP(AD93,結果入力表!$B$2:$J$212,3,FALSE)","v":"早川　徹"},null,null,"氏名",{"$f":"VLOOKUP(AD93,結果入力表!$B$2:$J$212,8,FALSE)","v":"植田　慎也"},null,null,null,null,{"$f":"VLOOKUP(AM93,結果入力表!$B$2:$J$212,3,FALSE)","v":"井関　一成"},null,null,"氏名",{"$f":"VLOOKUP(AM93,結果入力表!$B$2:$J$212,8,FALSE)","v":"近藤　拓馬"},null,null,null,null,{"$f":"VLOOKUP(AV93,結果入力表!$B$2:$J$212,3,FALSE)","v":"今村　哲也"},null,null,"氏名",{"$f":"VLOOKUP(AV93,結果入力表!$B$2:$J$212,8,FALSE)","v":"長谷川　進"},null,null,null,null,{"$f":"VLOOKUP(BE93,結果入力表!$B$2:$J$212,3,FALSE)","v":"森田由佳里"},null,null,"氏名",{"$f":"VLOOKUP(BE93,結果入力表!$B$2:$J$212,8,FALSE)","v":"白戸　恭子"}]
[null,null,null,null,"得点",null,null,null,null,null,null,null,null,"得点",null,null,null,null,null,null,null,null,"得点",null,null,null,null,null,null,null,null,"得点",null,null,null,null,null,null,null,null,"得点",null,null,null,null,null,null,null,null,"得点",null,null,null,null,null,null,null,null,"得点"]
[null,null,null,null,"HR",null,null,null,null,null,null,null,null,"HR",null,null,null,null,null,null,null,null,"HR",null,null,null,null,null,null,null,null,"HR",null,null,null,null,null,null,null,null,"HR",null,null,null,null,null,null,null,null,"HR",null,null,null,null,null,null,null,null,"HR"]
[]
[null,null,null,null,null,"レフリー",null,null,null,null,null,null,null,null,"レフリー",null,null,null,null,null,null,null,null,"レフリー",null,null,null,null,null,null,null,null,"レフリー",null,null,null,null,null,null,null,null,"レフリー",null,null,null,null,null,null,null,null,"レフリー",null,null,null,null,null,null,null,null,"レフリー"]
[null,{"$f":"★個人成績表★!$A$1","v":"第31回　京阪神和奈滋対抗戦　　　(奈良；玉出エース)"},null,null,null,null,null,null,null,null,{"$f":"★個人成績表★!$A$1","v":"第31回　京阪神和奈滋対抗戦　　　(奈良；玉出エース)"},null,null,null,null,null,null,null,null,{"$f":"★個人成績表★!$A$1","v":"第31回　京阪神和奈滋対抗戦　　　(奈良；玉出エース)"},null,null,null,null,null,null,null,null,{"$f":"★個人成績表★!$A$1","v":"第31回　京阪神和奈滋対抗戦　　　(奈良；玉出エース)"},null,null,null,null,null,null,null,null,{"$f":"★個人成績表★!$A$1","v":"第31回　京阪神和奈滋対抗戦　　　(奈良；玉出エース)"},null,null,null,null,null,null,null,null,{"$f":"★個人成績表★!$A$1","v":"第31回　京阪神和奈滋対抗戦　　　(奈良；玉出エース)"},null,null,null,null,null,null,null,null,{"$f":"★個人成績表★!$A$1","v":"第31回　京阪神和奈滋対抗戦　　　(奈良；玉出エース)"},null,null,null,null,null,null,null," "]
[]
[null,"G-No",{"$f":"BE93+1","v":64},null,null,"T-No",null,null,null,null,"G-No",{"$f":"C103+1","v":65},null,null,"T-No",null,null,null,null,"G-No",{"$f":"L103+1","v":66},null,null,"T-No",null,null,null,null,"G-No",{"$f":"U103+1","v":67},null,null,"T-No",null,null,null,null,"G-No",{"$f":"AD103+1","v":68},null,null,"T-No",null,null,null,null,"G-No",{"$f":"AM103+1","v":69},null,null,"T-No",null,null,null,null,"G-No",{"$f":"AV103+1","v":70},null,null,"T-No"]
[]
[null,{"$f":"VLOOKUP(C103,結果入力表!$B$2:$J$212,2,FALSE)","v":"ORC"},null,null,"所属",{"$f":"VLOOKUP(C103,結果入力表!$B$2:$J$212,9,FALSE)","v":"WRC"},null,null,null,null,{"$f":"VLOOKUP(L103,結果入力表!$B$2:$J$212,2,FALSE)","v":"ORC"},null,null,"所属",{"$f":"VLOOKUP(L103,結果入力表!$B$2:$J$212,9,FALSE)","v":"WRC"},null,null,null,null,{"$f":"VLOOKUP(U103,結果入力表!$B$2:$J$212,2,FALSE)","v":"ORC"},null,null,"所属",{"$f":"VLOOKUP(U103,結果入力表!$B$2:$J$212,9,FALSE)","v":"WRC"},null,null,null,null,{"$f":"VLOOKUP(AD103,結果入力表!$B$2:$J$212,2,FALSE)","v":"ORC"},null,null,"所属",{"$f":"VLOOKUP(AD103,結果入力表!$B$2:$J$212,9,FALSE)","v":"WRC"},null,null,null,null,{"$f":"VLOOKUP(AM103,結果入力表!$B$2:$J$212,2,FALSE)","v":"ORC"},null,null,"所属",{"$f":"VLOOKUP(AM103,結果入力表!$B$2:$J$212,9,FALSE)","v":"WRC"},null,null,null,null,{"$f":"VLOOKUP(AV103,結果入力表!$B$2:$J$212,2,FALSE)","v":"ORC"},null,null,"所属",{"$f":"VLOOKUP(AV103,結果入力表!$B$2:$J$212,9,FALSE)","v":"WRC"},null,null,null,null,{"$f":"VLOOKUP(BE103,結果入力表!$B$2:$J$212,2,FALSE)","v":"ORC"},null,null,"所属",{"$f":"VLOOKUP(BE103,結果入力表!$B$2:$J$212,9,FALSE)","v":"WRC"}]
[null,{"$f":"VLOOKUP(C103,結果入力表!$B$2:$J$212,3,FALSE)","v":"松居　勝巳"},null,null,"氏名",{"$f":"VLOOKUP(C103,結果入力表!$B$2:$J$212,8,FALSE)","v":"末岡　修"},null,null,null,null,{"$f":"VLOOKUP(L103,結果入力表!$B$2:$J$212,3,FALSE)","v":"藤明　宏樹"},null,null,"氏名",{"$f":"VLOOKUP(L103,結果入力表!$B$2:$J$212,8,FALSE)","v":"和田宗一郎"},null,null,null,null,{"$f":"VLOOKUP(U103,結果入力表!$B$2:$J$212,3,FALSE)","v":"吉岡　保俊"},null,null,"氏名",{"$f":"VLOOKUP(U103,結果入力表!$B$2:$J$212,8,FALSE)","v":"杉本　博章"},null,null,null,null,{"$f":"VLOOKUP(AD103,結果入力表!$B$2:$J$212,3,FALSE)","v":"村上　泰辰"},null,null,"氏名",{"$f":"VLOOKUP(AD103,結果入力表!$B$2:$J$212,8,FALSE)","v":"中本　雅大"},null,null,null,null,{"$f":"VLOOKUP(AM103,結果入力表!$B$2:$J$212,3,FALSE)","v":"小原　嘉丈"},null,null,"氏名",{"$f":"VLOOKUP(AM103,結果入力表!$B$2:$J$212,8,FALSE)","v":"山中　康介"},null,null,null,null,{"$f":"VLOOKUP(AV103,結果入力表!$B$2:$J$212,3,FALSE)","v":"乾　伸綱"},null,null,"氏名",{"$f":"VLOOKUP(AV103,結果入力表!$B$2:$J$212,8,FALSE)","v":"芝先　泰生"},null,null,null,null,{"$f":"VLOOKUP(BE103,結果入力表!$B$2:$J$212,3,FALSE)","v":"山崎真紀子"},null,null,"氏名",{"$f":"VLOOKUP(BE103,結果入力表!$B$2:$J$212,8,FALSE)","v":"松房ゆかり"}]
[null,null,null,null,"得点",null,null,null,null,null,null,null,null,"得点",null,null,null,null,null,null,null,null,"得点",null,null,null,null,null,null,null,null,"得点",null,null,null,null,null,null,null,null,"得点",null,null,null,null,null,null,null,null,"得点",null,null,null,null,null,null,null,null,"得点"]
[null,null,null,null,"HR",null,null,null,null,null,null,null,null,"HR",null,null,null,null,null,null,null,null,"HR",null,null,null,null,null,null,null,null,"HR",null,null,null,null,null,null,null,null,"HR",null,null,null,null,null,null,null,null,"HR",null,null,null,null,null,null,null,null,"HR"]
[]
[null,null,null,null,null,"レフリー",null,null,null,null,null,null,null,null,"レフリー",null,null,null,null,null,null,null,null,"レフリー",null,null,null,null,null,null,null,null,"レフリー",null,null,null,null,null,null,null,null,"レフリー",null,null,null,null,null,null,null,null,"レフリー",null,null,null,null,null,null,null,null,"レフリー"]
[null,{"$f":"★個人成績表★!$A$1","v":"第31回　京阪神和奈滋対抗戦　　　(奈良；玉出エース)"},null,null,null,null,null,null,null,null,{"$f":"★個人成績表★!$A$1","v":"第31回　京阪神和奈滋対抗戦　　　(奈良；玉出エース)"},null,null,null,null,null,null,null,null,{"$f":"★個人成績表★!$A$1","v":"第31回　京阪神和奈滋対抗戦　　　(奈良；玉出エース)"},null,null,null,null,null,null,null,null,{"$f":"★個人成績表★!$A$1","v":"第31回　京阪神和奈滋対抗戦　　　(奈良；玉出エース)"},null,null,null,null,null,null,null,null,{"$f":"★個人成績表★!$A$1","v":"第31回　京阪神和奈滋対抗戦　　　(奈良；玉出エース)"},null,null,null,null,null,null,null,null,{"$f":"★個人成績表★!$A$1","v":"第31回　京阪神和奈滋対抗戦　　　(奈良；玉出エース)"},null,null,null,null,null,null,null,null,{"$f":"★個人成績表★!$A$1","v":"第31回　京阪神和奈滋対抗戦　　　(奈良；玉出エース)"},null,null,null,null,null,null,null," "]
[]
[null,"G-No",{"$f":"BE103+1","v":71},null,null,"T-No",null,null,null,null,"G-No",{"$f":"C113+1","v":72},null,null,"T-No",null,null,null,null,"G-No",{"$f":"L113+1","v":73},null,null,"T-No",null,null,null,null,"G-No",{"$f":"U113+1","v":74},null,null,"T-No",null,null,null,null,"G-No",{"$f":"AD113+1","v":75},null,null,"T-No",null,null,null,null,"G-No",{"$f":"AM113+1","v":76},null,null,"T-No",null,null,null,null,"G-No",{"$f":"AV113+1","v":77},null,null,"T-No"]
[]
[null,{"$f":"VLOOKUP(C113,結果入力表!$B$2:$J$212,2,FALSE)","v":"NRC"},null,null,"所属",{"$f":"VLOOKUP(C113,結果入力表!$B$2:$J$212,9,FALSE)","v":"HRC"},null,null,null,null,{"$f":"VLOOKUP(L113,結果入力表!$B$2:$J$212,2,FALSE)","v":"NRC"},null,null,"所属",{"$f":"VLOOKUP(L113,結果入力表!$B$2:$J$212,9,FALSE)","v":"HRC"},null,null,null,null,{"$f":"VLOOKUP(U113,結果入力表!$B$2:$J$212,2,FALSE)","v":"NRC"},null,null,"所属",{"$f":"VLOOKUP(U113,結果入力表!$B$2:$J$212,9,FALSE)","v":"HRC"},null,null,null,null,{"$f":"VLOOKUP(AD113,結果入力表!$B$2:$J$212,2,FALSE)","v":"NRC"},null,null,"所属",{"$f":"VLOOKUP(AD113,結果入力表!$B$2:$J$212,9,FALSE)","v":"HRC"},null,null,null,null,{"$f":"VLOOKUP(AM113,結果入力表!$B$2:$J$212,2,FALSE)","v":"NRC"},null,null,"所属",{"$f":"VLOOKUP(AM113,結果入力表!$B$2:$J$212,9,FALSE)","v":"HRC"},null,null,null,null,{"$f":"VLOOKUP(AV113,結果入力表!$B$2:$J$212,2,FALSE)","v":"NRC"},null,null,"所属",{"$f":"VLOOKUP(AV113,結果入力表!$B$2:$J$212,9,FALSE)","v":"HRC"},null,null,null,null,{"$f":"VLOOKUP(BE113,結果入力表!$B$2:$J$212,2,FALSE)","v":"NRC"},null,null,"所属",{"$f":"VLOOKUP(BE113,結果入力表!$B$2:$J$212,9,FALSE)","v":"HRC"}]
[null,{"$f":"VLOOKUP(C113,結果入力表!$B$2:$J$212,3,FALSE)","v":"吉向　翔平"},null,null,"氏名",{"$f":"VLOOKUP(C113,結果入力表!$B$2:$J$212,8,FALSE)","v":"鐵山　泰三"},null,null,null,null,{"$f":"VLOOKUP(L113,結果入力表!$B$2:$J$212,3,FALSE)","v":"岩本　剛"},null,null,"氏名",{"$f":"VLOOKUP(L113,結果入力表!$B$2:$J$212,8,FALSE)","v":"堂園　雅也"},null,null,null,null,{"$f":"VLOOKUP(U113,結果入力表!$B$2:$J$212,3,FALSE)","v":"白戸　玲人"},null,null,"氏名",{"$f":"VLOOKUP(U113,結果入力表!$B$2:$J$212,8,FALSE)","v":"宮本　一"},null,null,null,null,{"$f":"VLOOKUP(AD113,結果入力表!$B$2:$J$212,3,FALSE)","v":"植田　慎也"},null,null,"氏名",{"$f":"VLOOKUP(AD113,結果入力表!$B$2:$J$212,8,FALSE)","v":"伊藤　登"},null,null,null,null,{"$f":"VLOOKUP(AM113,結果入力表!$B$2:$J$212,3,FALSE)","v":"近藤　拓馬"},null,null,"氏名",{"$f":"VLOOKUP(AM113,結果入力表!$B$2:$J$212,8,FALSE)","v":"宮井健太郎"},null,null,null,null,{"$f":"VLOOKUP(AV113,結果入力表!$B$2:$J$212,3,FALSE)","v":"長谷川　進"},null,null,"氏名",{"$f":"VLOOKUP(AV113,結果入力表!$B$2:$J$212,8,FALSE)","v":"白澤雄一郎"},null,null,null,null,{"$f":"VLOOKUP(BE113,結果入力表!$B$2:$J$212,3,FALSE)","v":"白戸　恭子"},null,null,"氏名",{"$f":"VLOOKUP(BE113,結果入力表!$B$2:$J$212,8,FALSE)","v":"河地　恵里"}]
[null,null,null,null,"得点",null,null,null,null,null,null,null,null,"得点",null,null,null,null,null,null,null,null,"得点",null,null,null,null,null,null,null,null,"得点",null,null,null,null,null,null,null,null,"得点",null,null,null,null,null,null,null,null,"得点",null,null,null,null,null,null,null,null,"得点"]
[null,null,null,null,"HR",null,null,null,null,null,null,null,null,"HR",null,null,null,null,null,null,null,null,"HR",null,null,null,null,null,null,null,null,"HR",null,null,null,null,null,null,null,null,"HR",null,null,null,null,null,null,null,null,"HR",null,null,null,null,null,null,null,null,"HR"]
[]
[null,null,null,null,null,"レフリー",null,null,null,null,null,null,null,null,"レフリー",null,null,null,null,null,null,null,null,"レフリー",null,null,null,null,null,null,null,null,"レフリー",null,null,null,null,null,null,null,null,"レフリー",null,null,null,null,null,null,null,null,"レフリー",null,null,null,null,null,null,null,null,"レフリー"]
[null,{"$f":"★個人成績表★!$A$1","v":"第31回　京阪神和奈滋対抗戦　　　(奈良；玉出エース)"},null,null,null,null,null,null,null,null,{"$f":"★個人成績表★!$A$1","v":"第31回　京阪神和奈滋対抗戦　　　(奈良；玉出エース)"},null,null,null,null,null,null,null,null,{"$f":"★個人成績表★!$A$1","v":"第31回　京阪神和奈滋対抗戦　　　(奈良；玉出エース)"},null,null,null,null,null,null,null,null,{"$f":"★個人成績表★!$A$1","v":"第31回　京阪神和奈滋対抗戦　　　(奈良；玉出エース)"},null,null,null,null,null,null,null,null,{"$f":"★個人成績表★!$A$1","v":"第31回　京阪神和奈滋対抗戦　　　(奈良；玉出エース)"},null,null,null,null,null,null,null,null,{"$f":"★個人成績表★!$A$1","v":"第31回　京阪神和奈滋対抗戦　　　(奈良；玉出エース)"},null,null,null,null,null,null,null,null,{"$f":"★個人成績表★!$A$1","v":"第31回　京阪神和奈滋対抗戦　　　(奈良；玉出エース)"},null,null,null,null,null,null,null," "]
[]
[null,"G-No",{"$f":"BE113+1","v":78},null,null,"T-No",null,null,null,null,"G-No",{"$f":"C123+1","v":79},null,null,"T-No",null,null,null,null,"G-No",{"$f":"L123+1","v":80},null,null,"T-No",null,null,null,null,"G-No",{"$f":"U123+1","v":81},null,null,"T-No",null,null,null,null,"G-No",{"$f":"AD123+1","v":82},null,null,"T-No",null,null,null,null,"G-No",{"$f":"AM123+1","v":83},null,null,"T-No",null,null,null,null,"G-No",{"$f":"AV123+1","v":84},null,null,"T-No"]
[]
[null,{"$f":"VLOOKUP(C123,結果入力表!$B$2:$J$212,2,FALSE)","v":"KRC"},null,null,"所属",{"$f":"VLOOKUP(C123,結果入力表!$B$2:$J$212,9,FALSE)","v":"SBC"},null,null,null,null,{"$f":"VLOOKUP(L123,結果入力表!$B$2:$J$212,2,FALSE)","v":"KRC"},null,null,"所属",{"$f":"VLOOKUP(L123,結果入力表!$B$2:$J$212,9,FALSE)","v":"SBC"},null,null,null,null,{"$f":"VLOOKUP(U123,結果入力表!$B$2:$J$212,2,FALSE)","v":"KRC"},null,null,"所属",{"$f":"VLOOKUP(U123,結果入力表!$B$2:$J$212,9,FALSE)","v":"SBC"},null,null,null,null,{"$f":"VLOOKUP(AD123,結果入力表!$B$2:$J$212,2,FALSE)","v":"KRC"},null,null,"所属",{"$f":"VLOOKUP(AD123,結果入力表!$B$2:$J$212,9,FALSE)","v":"SBC"},null,null,null,null,{"$f":"VLOOKUP(AM123,結果入力表!$B$2:$J$212,2,FALSE)","v":"KRC"},null,null,"所属",{"$f":"VLOOKUP(AM123,結果入力表!$B$2:$J$212,9,FALSE)","v":"SBC"},null,null,null,null,{"$f":"VLOOKUP(AV123,結果入力表!$B$2:$J$212,2,FALSE)","v":"KRC"},null,null,"所属",{"$f":"VLOOKUP(AV123,結果入力表!$B$2:$J$212,9,FALSE)","v":"SBC"},null,null,null,null,{"$f":"VLOOKUP(BE123,結果入力表!$B$2:$J$212,2,FALSE)","v":"KRC"},null,null,"所属",{"$f":"VLOOKUP(BE123,結果入力表!$B$2:$J$212,9,FALSE)","v":"SBC"}]
[null,{"$f":"VLOOKUP(C123,結果入力表!$B$2:$J$212,3,FALSE)","v":"松好　太一"},null,null,"氏名",{"$f":"VLOOKUP(C123,結果入力表!$B$2:$J$212,8,FALSE)","v":"林　秀忠"},null,null,null,null,{"$f":"VLOOKUP(L123,結果入力表!$B$2:$J$212,3,FALSE)","v":"清水　義晴"},null,null,"氏名",{"$f":"VLOOKUP(L123,結果入力表!$B$2:$J$212,8,FALSE)","v":"大橋　義治"},null,null,null,null,{"$f":"VLOOKUP(U123,結果入力表!$B$2:$J$212,3,FALSE)","v":"鈴木　康文"},null,null,"氏名",{"$f":"VLOOKUP(U123,結果入力表!$B$2:$J$212,8,FALSE)","v":"山中　康寛"},null,null,null,null,{"$f":"VLOOKUP(AD123,結果入力表!$B$2:$J$212,3,FALSE)","v":"早川　徹"},null,null,"氏名",{"$f":"VLOOKUP(AD123,結果入力表!$B$2:$J$212,8,FALSE)","v":"西峰　久祐"},null,null,null,null,{"$f":"VLOOKUP(AM123,結果入力表!$B$2:$J$212,3,FALSE)","v":"井関　一成"},null,null,"氏名",{"$f":"VLOOKUP(AM123,結果入力表!$B$2:$J$212,8,FALSE)","v":"大橋　正寛"},null,null,null,null,{"$f":"VLOOKUP(AV123,結果入力表!$B$2:$J$212,3,FALSE)","v":"今村　哲也"},null,null,"氏名",{"$f":"VLOOKUP(AV123,結果入力表!$B$2:$J$212,8,FALSE)","v":"秋田　倫央"},null,null,null,null,{"$f":"VLOOKUP(BE123,結果入力表!$B$2:$J$212,3,FALSE)","v":"森田由佳里"},null,null,"氏名",{"$f":"VLOOKUP(BE123,結果入力表!$B$2:$J$212,8,FALSE)","v":"大橋　洋子"}]
[null,null,null,null,"得点",null,null,null,null,null,null,null,null,"得点",null,null,null,null,null,null,null,null,"得点",null,null,null,null,null,null,null,null,"得点",null,null,null,null,null,null,null,null,"得点",null,null,null,null,null,null,null,null,"得点",null,null,null,null,null,null,null,null,"得点"]
[null,null,null,null,"HR",null,null,null,null,null,null,null,null,"HR",null,null,null,null,null,null,null,null,"HR",null,null,null,null,null,null,null,null,"HR",null,null,null,null,null,null,null,null,"HR",null,null,null,null,null,null,null,null,"HR",null,null,null,null,null,null,null,null,"HR"]
[]
[null,null,null,null,null,"レフリー",null,null,null,null,null,null,null,null,"レフリー",null,null,null,null,null,null,null,null,"レフリー",null,null,null,null,null,null,null,null,"レフリー",null,null,null,null,null,null,null,null,"レフリー",null,null,null,null,null,null,null,null,"レフリー",null,null,null,null,null,null,null,null,"レフリー"]
[null,{"$f":"★個人成績表★!$A$1","v":"第31回　京阪神和奈滋対抗戦　　　(奈良；玉出エース)"},null,null,null,null,null,null,null,null,{"$f":"★個人成績表★!$A$1","v":"第31回　京阪神和奈滋対抗戦　　　(奈良；玉出エース)"},null,null,null,null,null,null,null,null,{"$f":"★個人成績表★!$A$1","v":"第31回　京阪神和奈滋対抗戦　　　(奈良；玉出エース)"},null,null,null,null,null,null,null,null,{"$f":"★個人成績表★!$A$1","v":"第31回　京阪神和奈滋対抗戦　　　(奈良；玉出エース)"},null,null,null,null,null,null,null,null,{"$f":"★個人成績表★!$A$1","v":"第31回　京阪神和奈滋対抗戦　　　(奈良；玉出エース)"},null,null,null,null,null,null,null,null,{"$f":"★個人成績表★!$A$1","v":"第31回　京阪神和奈滋対抗戦　　　(奈良；玉出エース)"},null,null,null,null,null,null,null,null,{"$f":"★個人成績表★!$A$1","v":"第31回　京阪神和奈滋対抗戦　　　(奈良；玉出エース)"},null,null,null,null,null,null,null," "]
[]
[null,"G-No",{"$f":"BE123+1","v":85},null,null,"T-No",null,null,null,null,"G-No",{"$f":"C133+1","v":86},null,null,"T-No",null,null,null,null,"G-No",{"$f":"L133+1","v":87},null,null,"T-No",null,null,null,null,"G-No",{"$f":"U133+1","v":88},null,null,"T-No",null,null,null,null,"G-No",{"$f":"AD133+1","v":89},null,null,"T-No",null,null,null,null,"G-No",{"$f":"AM133+1","v":90},null,null,"T-No",null,null,null,null,"G-No",{"$f":"AV133+1","v":91},null,null,"T-No"]
[]
[null,{"$f":"VLOOKUP(C133,結果入力表!$B$2:$J$212,2,FALSE)","v":"NRC"},null,null,"所属",{"$f":"VLOOKUP(C133,結果入力表!$B$2:$J$212,9,FALSE)","v":"ORC"},null,null,null,null,{"$f":"VLOOKUP(L133,結果入力表!$B$2:$J$212,2,FALSE)","v":"NRC"},null,null,"所属",{"$f":"VLOOKUP(L133,結果入力表!$B$2:$J$212,9,FALSE)","v":"ORC"},null,null,null,null,{"$f":"VLOOKUP(U133,結果入力表!$B$2:$J$212,2,FALSE)","v":"NRC"},null,null,"所属",{"$f":"VLOOKUP(U133,結果入力表!$B$2:$J$212,9,FALSE)","v":"ORC"},null,null,null,null,{"$f":"VLOOKUP(AD133,結果入力表!$B$2:$J$212,2,FALSE)","v":"NRC"},null,null,"所属",{"$f":"VLOOKUP(AD133,結果入力表!$B$2:$J$212,9,FALSE)","v":"ORC"},null,null,null,null,{"$f":"VLOOKUP(AM133,結果入力表!$B$2:$J$212,2,FALSE)","v":"NRC"},null,null,"所属",{"$f":"VLOOKUP(AM133,結果入力表!$B$2:$J$212,9,FALSE)","v":"ORC"},null,null,null,null,{"$f":"VLOOKUP(AV133,結果入力表!$B$2:$J$212,2,FALSE)","v":"NRC"},null,null,"所属",{"$f":"VLOOKUP(AV133,結果入力表!$B$2:$J$212,9,FALSE)","v":"ORC"},null,null,null,null,{"$f":"VLOOKUP(BE133,結果入力表!$B$2:$J$212,2,FALSE)","v":"NRC"},null,null,"所属",{"$f":"VLOOKUP(BE133,結果入力表!$B$2:$J$212,9,FALSE)","v":"ORC"}]
[null,{"$f":"VLOOKUP(C133,結果入力表!$B$2:$J$212,3,FALSE)","v":"吉向　翔平"},null,null,"氏名",{"$f":"VLOOKUP(C133,結果入力表!$B$2:$J$212,8,FALSE)","v":"松居　勝巳"},null,null,null,null,{"$f":"VLOOKUP(L133,結果入力表!$B$2:$J$212,3,FALSE)","v":"岩本　剛"},null,null,"氏名",{"$f":"VLOOKUP(L133,結果入力表!$B$2:$J$212,8,FALSE)","v":"藤明　宏樹"},null,null,null,null,{"$f":"VLOOKUP(U133,結果入力表!$B$2:$J$212,3,FALSE)","v":"白戸　玲人"},null,null,"氏名",{"$f":"VLOOKUP(U133,結果入力表!$B$2:$J$212,8,FALSE)","v":"吉岡　保俊"},null,null,null,null,{"$f":"VLOOKUP(AD133,結果入力表!$B$2:$J$212,3,FALSE)","v":"植田　慎也"},null,null,"氏名",{"$f":"VLOOKUP(AD133,結果入力表!$B$2:$J$212,8,FALSE)","v":"村上　泰辰"},null,null,null,null,{"$f":"VLOOKUP(AM133,結果入力表!$B$2:$J$212,3,FALSE)","v":"近藤　拓馬"},null,null,"氏名",{"$f":"VLOOKUP(AM133,結果入力表!$B$2:$J$212,8,FALSE)","v":"小原　嘉丈"},null,null,null,null,{"$f":"VLOOKUP(AV133,結果入力表!$B$2:$J$212,3,FALSE)","v":"長谷川　進"},null,null,"氏名",{"$f":"VLOOKUP(AV133,結果入力表!$B$2:$J$212,8,FALSE)","v":"乾　伸綱"},null,null,null,null,{"$f":"VLOOKUP(BE133,結果入力表!$B$2:$J$212,3,FALSE)","v":"白戸　恭子"},null,null,"氏名",{"$f":"VLOOKUP(BE133,結果入力表!$B$2:$J$212,8,FALSE)","v":"山崎真紀子"}]
[null,null,null,null,"得点",null,null,null,null,null,null,null,null,"得点",null,null,null,null,null,null,null,null,"得点",null,null,null,null,null,null,null,null,"得点",null,null,null,null,null,null,null,null,"得点",null,null,null,null,null,null,null,null,"得点",null,null,null,null,null,null,null,null,"得点"]
[null,null,null,null,"HR",null,null,null,null,null,null,null,null,"HR",null,null,null,null,null,null,null,null,"HR",null,null,null,null,null,null,null,null,"HR",null,null,null,null,null,null,null,null,"HR",null,null,null,null,null,null,null,null,"HR",null,null,null,null,null,null,null,null,"HR"]
[]
[null,null,null,null,null,"レフリー",null,null,null,null,null,null,null,null,"レフリー",null,null,null,null,null,null,null,null,"レフリー",null,null,null,null,null,null,null,null,"レフリー",null,null,null,null,null,null,null,null,"レフリー",null,null,null,null,null,null,null,null,"レフリー",null,null,null,null,null,null,null,null,"レフリー"]
[null,{"$f":"★個人成績表★!$A$1","v":"第31回　京阪神和奈滋対抗戦　　　(奈良；玉出エース)"},null,null,null,null,null,null,null,null,{"$f":"★個人成績表★!$A$1","v":"第31回　京阪神和奈滋対抗戦　　　(奈良；玉出エース)"},null,null,null,null,null,null,null,null,{"$f":"★個人成績表★!$A$1","v":"第31回　京阪神和奈滋対抗戦　　　(奈良；玉出エース)"},null,null,null,null,null,null,null,null,{"$f":"★個人成績表★!$A$1","v":"第31回　京阪神和奈滋対抗戦　　　(奈良；玉出エース)"},null,null,null,null,null,null,null,null,{"$f":"★個人成績表★!$A$1","v":"第31回　京阪神和奈滋対抗戦　　　(奈良；玉出エース)"},null,null,null,null,null,null,null,null,{"$f":"★個人成績表★!$A$1","v":"第31回　京阪神和奈滋対抗戦　　　(奈良；玉出エース)"},null,null,null,null,null,null,null,null,{"$f":"★個人成績表★!$A$1","v":"第31回　京阪神和奈滋対抗戦　　　(奈良；玉出エース)"},null,null,null,null,null,null,null," "]
[]
[null,"G-No",{"$f":"BE133+1","v":92},null,null,"T-No",null,null,null,null,"G-No",{"$f":"C143+1","v":93},null,null,"T-No",null,null,null,null,"G-No",{"$f":"L143+1","v":94},null,null,"T-No",null,null,null,null,"G-No",{"$f":"U143+1","v":95},null,null,"T-No",null,null,null,null,"G-No",{"$f":"AD143+1","v":96},null,null,"T-No",null,null,null,null,"G-No",{"$f":"AM143+1","v":97},null,null,"T-No",null,null,null,null,"G-No",{"$f":"AV143+1","v":98},null,null,"T-No"]
[]
[null,{"$f":"VLOOKUP(C143,結果入力表!$B$2:$J$212,2,FALSE)","v":"SBC"},null,null,"所属",{"$f":"VLOOKUP(C143,結果入力表!$B$2:$J$212,9,FALSE)","v":"WRC"},null,null,null,null,{"$f":"VLOOKUP(L143,結果入力表!$B$2:$J$212,2,FALSE)","v":"SBC"},null,null,"所属",{"$f":"VLOOKUP(L143,結果入力表!$B$2:$J$212,9,FALSE)","v":"WRC"},null,null,null,null,{"$f":"VLOOKUP(U143,結果入力表!$B$2:$J$212,2,FALSE)","v":"SBC"},null,null,"所属",{"$f":"VLOOKUP(U143,結果入力表!$B$2:$J$212,9,FALSE)","v":"WRC"},null,null,null,null,{"$f":"VLOOKUP(AD143,結果入力表!$B$2:$J$212,2,FALSE)","v":"SBC"},null,null,"所属",{"$f":"VLOOKUP(AD143,結果入力表!$B$2:$J$212,9,FALSE)","v":"WRC"},null,null,null,null,{"$f":"VLOOKUP(AM143,結果入力表!$B$2:$J$212,2,FALSE)","v":"SBC"},null,null,"所属",{"$f":"VLOOKUP(AM143,結果入力表!$B$2:$J$212,9,FALSE)","v":"WRC"},null,null,null,null,{"$f":"VLOOKUP(AV143,結果入力表!$B$2:$J$212,2,FALSE)","v":"SBC"},null,null,"所属",{"$f":"VLOOKUP(AV143,結果入力表!$B$2:$J$212,9,FALSE)","v":"WRC"},null,null,null,null,{"$f":"VLOOKUP(BE143,結果入力表!$B$2:$J$212,2,FALSE)","v":"SBC"},null,null,"所属",{"$f":"VLOOKUP(BE143,結果入力表!$B$2:$J$212,9,FALSE)","v":"WRC"}]
[null,{"$f":"VLOOKUP(C143,結果入力表!$B$2:$J$212,3,FALSE)","v":"林　秀忠"},null,null,"氏名",{"$f":"VLOOKUP(C143,結果入力表!$B$2:$J$212,8,FALSE)","v":"末岡　修"},null,null,null,null,{"$f":"VLOOKUP(L143,結果入力表!$B$2:$J$212,3,FALSE)","v":"大橋　義治"},null,null,"氏名",{"$f":"VLOOKUP(L143,結果入力表!$B$2:$J$212,8,FALSE)","v":"和田宗一郎"},null,null,null,null,{"$f":"VLOOKUP(U143,結果入力表!$B$2:$J$212,3,FALSE)","v":"山中　康寛"},null,null,"氏名",{"$f":"VLOOKUP(U143,結果入力表!$B$2:$J$212,8,FALSE)","v":"杉本　博章"},null,null,null,null,{"$f":"VLOOKUP(AD143,結果入力表!$B$2:$J$212,3,FALSE)","v":"西峰　久祐"},null,null,"氏名",{"$f":"VLOOKUP(AD143,結果入力表!$B$2:$J$212,8,FALSE)","v":"中本　雅大"},null,null,null,null,{"$f":"VLOOKUP(AM143,結果入力表!$B$2:$J$212,3,FALSE)","v":"大橋　正寛"},null,null,"氏名",{"$f":"VLOOKUP(AM143,結果入力表!$B$2:$J$212,8,FALSE)","v":"山中　康介"},null,null,null,null,{"$f":"VLOOKUP(AV143,結果入力表!$B$2:$J$212,3,FALSE)","v":"秋田　倫央"},null,null,"氏名",{"$f":"VLOOKUP(AV143,結果入力表!$B$2:$J$212,8,FALSE)","v":"芝先　泰生"},null,null,null,null,{"$f":"VLOOKUP(BE143,結果入力表!$B$2:$J$212,3,FALSE)","v":"大橋　洋子"},null,null,"氏名",{"$f":"VLOOKUP(BE143,結果入力表!$B$2:$J$212,8,FALSE)","v":"松房ゆかり"}]
[null,null,null,null,"得点",null,null,null,null,null,null,null,null,"得点",null,null,null,null,null,null,null,null,"得点",null,null,null,null,null,null,null,null,"得点",null,null,null,null,null,null,null,null,"得点",null,null,null,null,null,null,null,null,"得点",null,null,null,null,null,null,null,null,"得点"]
[null,null,null,null,"HR",null,null,null,null,null,null,null,null,"HR",null,null,null,null,null,null,null,null,"HR",null,null,null,null,null,null,null,null,"HR",null,null,null,null,null,null,null,null,"HR",null,null,null,null,null,null,null,null,"HR",null,null,null,null,null,null,null,null,"HR"]
[]
[null,null,null,null,null,"レフリー",null,null,null,null,null,null,null,null,"レフリー",null,null,null,null,null,null,null,null,"レフリー",null,null,null,null,null,null,null,null,"レフリー",null,null,null,null,null,null,null,null,"レフリー",null,null,null,null,null,null,null,null,"レフリー",null,null,null,null,null,null,null,null,"レフリー"]
[null,{"$f":"★個人成績表★!$A$1","v":"第31回　京阪神和奈滋対抗戦　　　(奈良；玉出エース)"},null,null,null,null,null,null,null,null,{"$f":"★個人成績表★!$A$1","v":"第31回　京阪神和奈滋対抗戦　　　(奈良；玉出エース)"},null,null,null,null,null,null,null,null,{"$f":"★個人成績表★!$A$1","v":"第31回　京阪神和奈滋対抗戦　　　(奈良；玉出エース)"},null,null,null,null,null,null,null,null,{"$f":"★個人成績表★!$A$1","v":"第31回　京阪神和奈滋対抗戦　　　(奈良；玉出エース)"},null,null,null,null,null,null,null,null,{"$f":"★個人成績表★!$A$1","v":"第31回　京阪神和奈滋対抗戦　　　(奈良；玉出エース)"},null,null,null,null,null,null,null,null,{"$f":"★個人成績表★!$A$1","v":"第31回　京阪神和奈滋対抗戦　　　(奈良；玉出エース)"},null,null,null,null,null,null,null,null,{"$f":"★個人成績表★!$A$1","v":"第31回　京阪神和奈滋対抗戦　　　(奈良；玉出エース)"},null,null,null,null,null,null,null," "]
[]
[null,"G-No",{"$f":"BE143+1","v":99},null,null,"T-No",null,null,null,null,"G-No",{"$f":"C153+1","v":100},null,null,"T-No",null,null,null,null,"G-No",{"$f":"L153+1","v":101},null,null,"T-No",null,null,null,null,"G-No",{"$f":"U153+1","v":102},null,null,"T-No",null,null,null,null,"G-No",{"$f":"AD153+1","v":103},null,null,"T-No",null,null,null,null,"G-No",{"$f":"AM153+1","v":104},null,null,"T-No",null,null,null,null,"G-No",{"$f":"AV153+1","v":105},null,null,"T-No"]
[]
[null,{"$f":"VLOOKUP(C153,結果入力表!$B$2:$J$212,2,FALSE)","v":"KRC"},null,null,"所属",{"$f":"VLOOKUP(C153,結果入力表!$B$2:$J$212,9,FALSE)","v":"HRC"},null,null,null,null,{"$f":"VLOOKUP(L153,結果入力表!$B$2:$J$212,2,FALSE)","v":"KRC"},null,null,"所属",{"$f":"VLOOKUP(L153,結果入力表!$B$2:$J$212,9,FALSE)","v":"HRC"},null,null,null,null,{"$f":"VLOOKUP(U153,結果入力表!$B$2:$J$212,2,FALSE)","v":"KRC"},null,null,"所属",{"$f":"VLOOKUP(U153,結果入力表!$B$2:$J$212,9,FALSE)","v":"HRC"},null,null,null,null,{"$f":"VLOOKUP(AD153,結果入力表!$B$2:$J$212,2,FALSE)","v":"KRC"},null,null,"所属",{"$f":"VLOOKUP(AD153,結果入力表!$B$2:$J$212,9,FALSE)","v":"HRC"},null,null,null,null,{"$f":"VLOOKUP(AM153,結果入力表!$B$2:$J$212,2,FALSE)","v":"KRC"},null,null,"所属",{"$f":"VLOOKUP(AM153,結果入力表!$B$2:$J$212,9,FALSE)","v":"HRC"},null,null,null,null,{"$f":"VLOOKUP(AV153,結果入力表!$B$2:$J$212,2,FALSE)","v":"KRC"},null,null,"所属",{"$f":"VLOOKUP(AV153,結果入力表!$B$2:$J$212,9,FALSE)","v":"HRC"},null,null,null,null,{"$f":"VLOOKUP(BE153,結果入力表!$B$2:$J$212,2,FALSE)","v":"KRC"},null,null,"所属",{"$f":"VLOOKUP(BE153,結果入力表!$B$2:$J$212,9,FALSE)","v":"HRC"}]
[null,{"$f":"VLOOKUP(C153,結果入力表!$B$2:$J$212,3,FALSE)","v":"松好　太一"},null,null,"氏名",{"$f":"VLOOKUP(C153,結果入力表!$B$2:$J$212,8,FALSE)","v":"鐵山　泰三"},null,null,null,null,{"$f":"VLOOKUP(L153,結果入力表!$B$2:$J$212,3,FALSE)","v":"清水　義晴"},null,null,"氏名",{"$f":"VLOOKUP(L153,結果入力表!$B$2:$J$212,8,FALSE)","v":"堂園　雅也"},null,null,null,null,{"$f":"VLOOKUP(U153,結果入力表!$B$2:$J$212,3,FALSE)","v":"鈴木　康文"},null,null,"氏名",{"$f":"VLOOKUP(U153,結果入力表!$B$2:$J$212,8,FALSE)","v":"宮本　一"},null,null,null,null,{"$f":"VLOOKUP(AD153,結果入力表!$B$2:$J$212,3,FALSE)","v":"早川　徹"},null,null,"氏名",{"$f":"VLOOKUP(AD153,結果入力表!$B$2:$J$212,8,FALSE)","v":"伊藤　登"},null,null,null,null,{"$f":"VLOOKUP(AM153,結果入力表!$B$2:$J$212,3,FALSE)","v":"井関　一成"},null,null,"氏名",{"$f":"VLOOKUP(AM153,結果入力表!$B$2:$J$212,8,FALSE)","v":"宮井健太郎"},null,null,null,null,{"$f":"VLOOKUP(AV153,結果入力表!$B$2:$J$212,3,FALSE)","v":"今村　哲也"},null,null,"氏名",{"$f":"VLOOKUP(AV153,結果入力表!$B$2:$J$212,8,FALSE)","v":"白澤雄一郎"},null,null,null,null,{"$f":"VLOOKUP(BE153,結果入力表!$B$2:$J$212,3,FALSE)","v":"森田由佳里"},null,null,"氏名",{"$f":"VLOOKUP(BE153,結果入力表!$B$2:$J$212,8,FALSE)","v":"河地　恵里"}]
[null,null,null,null,"得点",null,null,null,null,null,null,null,null,"得点",null,null,null,null,null,null,null,null,"得点",null,null,null,null,null,null,null,null,"得点",null,null,null,null,null,null,null,null,"得点",null,null,null,null,null,null,null,null,"得点",null,null,null,null,null,null,null,null,"得点"]
[null,null,null,null,"HR",null,null,null,null,null,null,null,null,"HR",null,null,null,null,null,null,null,null,"HR",null,null,null,null,null,null,null,null,"HR",null,null,null,null,null,null,null,null,"HR",null,null,null,null,null,null,null,null,"HR",null,null,null,null,null,null,null,null,"HR"]
[]
[null,null,null,null,null,"レフリー",null,null,null,null,null,null,null,null,"レフリー",null,null,null,null,null,null,null,null,"レフリー",null,null,null,null,null,null,null,null,"レフリー",null,null,null,null,null,null,null,null,"レフリー",null,null,null,null,null,null,null,null,"レフリー",null,null,null,null,null,null,null,null,"レフリー"]
[null,{"$f":"★個人成績表★!$A$1","v":"第31回　京阪神和奈滋対抗戦　　　(奈良；玉出エース)"},null,null,null,null,null,null,null,null,{"$f":"★個人成績表★!$A$1","v":"第31回　京阪神和奈滋対抗戦　　　(奈良；玉出エース)"},null,null,null,null,null,null,null,null,{"$f":"★個人成績表★!$A$1","v":"第31回　京阪神和奈滋対抗戦　　　(奈良；玉出エース)"},null,null,null,null,null,null,null,null,{"$f":"★個人成績表★!$A$1","v":"第31回　京阪神和奈滋対抗戦　　　(奈良；玉出エース)"},null,null,null,null,null,null,null,null,{"$f":"★個人成績表★!$A$1","v":"第31回　京阪神和奈滋対抗戦　　　(奈良；玉出エース)"},null,null,null,null,null,null,null,null,{"$f":"★個人成績表★!$A$1","v":"第31回　京阪神和奈滋対抗戦　　　(奈良；玉出エース)"},null,null,null,null,null,null,null,null,{"$f":"★個人成績表★!$A$1","v":"第31回　京阪神和奈滋対抗戦　　　(奈良；玉出エース)"},null,null,null,null,null,null,null," "]
[]
[null,"G-No",{"$f":"BE153+1","v":106},null,null,"T-No",null,null,null,null,"G-No",{"$f":"C163+1","v":107},null,null,"T-No",null,null,null,null,"G-No",{"$f":"L163+1","v":108},null,null,"T-No",null,null,null,null,"G-No",{"$f":"U163+1","v":109},null,null,"T-No",null,null,null,null,"G-No",{"$f":"AD163+1","v":110},null,null,"T-No",null,null,null,null,"G-No",{"$f":"AM163+1","v":111},null,null,"T-No",null,null,null,null,"G-No",{"$f":"AV163+1","v":112},null,null,"T-No"]
[]
[null,{"$f":"VLOOKUP(C163,結果入力表!$B$2:$J$212,2,FALSE)","v":"SBC"},null,null,"所属",{"$f":"VLOOKUP(C163,結果入力表!$B$2:$J$212,9,FALSE)","v":"NRC"},null,null,null,null,{"$f":"VLOOKUP(L163,結果入力表!$B$2:$J$212,2,FALSE)","v":"SBC"},null,null,"所属",{"$f":"VLOOKUP(L163,結果入力表!$B$2:$J$212,9,FALSE)","v":"NRC"},null,null,null,null,{"$f":"VLOOKUP(U163,結果入力表!$B$2:$J$212,2,FALSE)","v":"SBC"},null,null,"所属",{"$f":"VLOOKUP(U163,結果入力表!$B$2:$J$212,9,FALSE)","v":"NRC"},null,null,null,null,{"$f":"VLOOKUP(AD163,結果入力表!$B$2:$J$212,2,FALSE)","v":"SBC"},null,null,"所属",{"$f":"VLOOKUP(AD163,結果入力表!$B$2:$J$212,9,FALSE)","v":"NRC"},null,null,null,null,{"$f":"VLOOKUP(AM163,結果入力表!$B$2:$J$212,2,FALSE)","v":"SBC"},null,null,"所属",{"$f":"VLOOKUP(AM163,結果入力表!$B$2:$J$212,9,FALSE)","v":"NRC"},null,null,null,null,{"$f":"VLOOKUP(AV163,結果入力表!$B$2:$J$212,2,FALSE)","v":"SBC"},null,null,"所属",{"$f":"VLOOKUP(AV163,結果入力表!$B$2:$J$212,9,FALSE)","v":"NRC"},null,null,null,null,{"$f":"VLOOKUP(BE163,結果入力表!$B$2:$J$212,2,FALSE)","v":"SBC"},null,null,"所属",{"$f":"VLOOKUP(BE163,結果入力表!$B$2:$J$212,9,FALSE)","v":"NRC"}]
[null,{"$f":"VLOOKUP(C163,結果入力表!$B$2:$J$212,3,FALSE)","v":"山中　康寛"},null,null,"氏名",{"$f":"VLOOKUP(C163,結果入力表!$B$2:$J$212,8,FALSE)","v":"植田　慎也"},null,null,null,null,{"$f":"VLOOKUP(L163,結果入力表!$B$2:$J$212,3,FALSE)","v":"西峰　久祐"},null,null,"氏名",{"$f":"VLOOKUP(L163,結果入力表!$B$2:$J$212,8,FALSE)","v":"近藤　拓馬"},null,null,null,null,{"$f":"VLOOKUP(U163,結果入力表!$B$2:$J$212,3,FALSE)","v":"大橋　正寛"},null,null,"氏名",{"$f":"VLOOKUP(U163,結果入力表!$B$2:$J$212,8,FALSE)","v":"長谷川　進"},null,null,null,null,{"$f":"VLOOKUP(AD163,結果入力表!$B$2:$J$212,3,FALSE)","v":"秋田　倫央"},null,null,"氏名",{"$f":"VLOOKUP(AD163,結果入力表!$B$2:$J$212,8,FALSE)","v":"白戸　恭子"},null,null,null,null,{"$f":"VLOOKUP(AM163,結果入力表!$B$2:$J$212,3,FALSE)","v":"大橋　洋子"},null,null,"氏名",{"$f":"VLOOKUP(AM163,結果入力表!$B$2:$J$212,8,FALSE)","v":"吉向　翔平"},null,null,null,null,{"$f":"VLOOKUP(AV163,結果入力表!$B$2:$J$212,3,FALSE)","v":"林　秀忠"},null,null,"氏名",{"$f":"VLOOKUP(AV163,結果入力表!$B$2:$J$212,8,FALSE)","v":"岩本　剛"},null,null,null,null,{"$f":"VLOOKUP(BE163,結果入力表!$B$2:$J$212,3,FALSE)","v":"大橋　義治"},null,null,"氏名",{"$f":"VLOOKUP(BE163,結果入力表!$B$2:$J$212,8,FALSE)","v":"白戸　玲人"}]
[null,null,null,null,"得点",null,null,null,null,null,null,null,null,"得点",null,null,null,null,null,null,null,null,"得点",null,null,null,null,null,null,null,null,"得点",null,null,null,null,null,null,null,null,"得点",null,null,null,null,null,null,null,null,"得点",null,null,null,null,null,null,null,null,"得点"]
[null,null,null,null,"HR",null,null,null,null,null,null,null,null,"HR",null,null,null,null,null,null,null,null,"HR",null,null,null,null,null,null,null,null,"HR",null,null,null,null,null,null,null,null,"HR",null,null,null,null,null,null,null,null,"HR",null,null,null,null,null,null,null,null,"HR"]
[]
[null,null,null,null,null,"レフリー",null,null,null,null,null,null,null,null,"レフリー",null,null,null,null,null,null,null,null,"レフリー",null,null,null,null,null,null,null,null,"レフリー",null,null,null,null,null,null,null,null,"レフリー",null,null,null,null,null,null,null,null,"レフリー",null,null,null,null,null,null,null,null,"レフリー"]
[null,{"$f":"★個人成績表★!$A$1","v":"第31回　京阪神和奈滋対抗戦　　　(奈良；玉出エース)"},null,null,null,null,null,null,null,null,{"$f":"★個人成績表★!$A$1","v":"第31回　京阪神和奈滋対抗戦　　　(奈良；玉出エース)"},null,null,null,null,null,null,null,null,{"$f":"★個人成績表★!$A$1","v":"第31回　京阪神和奈滋対抗戦　　　(奈良；玉出エース)"},null,null,null,null,null,null,null,null,{"$f":"★個人成績表★!$A$1","v":"第31回　京阪神和奈滋対抗戦　　　(奈良；玉出エース)"},null,null,null,null,null,null,null,null,{"$f":"★個人成績表★!$A$1","v":"第31回　京阪神和奈滋対抗戦　　　(奈良；玉出エース)"},null,null,null,null,null,null,null,null,{"$f":"★個人成績表★!$A$1","v":"第31回　京阪神和奈滋対抗戦　　　(奈良；玉出エース)"},null,null,null,null,null,null,null,null,{"$f":"★個人成績表★!$A$1","v":"第31回　京阪神和奈滋対抗戦　　　(奈良；玉出エース)"},null,null,null,null,null,null,null," "]
[]
[null,"G-No",{"$f":"BE163+1","v":113},null,null,"T-No",null,null,null,null,"G-No",{"$f":"C173+1","v":114},null,null,"T-No",null,null,null,null,"G-No",{"$f":"L173+1","v":115},null,null,"T-No",null,null,null,null,"G-No",{"$f":"U173+1","v":116},null,null,"T-No",null,null,null,null,"G-No",{"$f":"AD173+1","v":117},null,null,"T-No",null,null,null,null,"G-No",{"$f":"AM173+1","v":118},null,null,"T-No",null,null,null,null,"G-No",{"$f":"AV173+1","v":119},null,null,"T-No"]
[]
[null,{"$f":"VLOOKUP(C173,結果入力表!$B$2:$J$212,2,FALSE)","v":"HRC"},null,null,"所属",{"$f":"VLOOKUP(C173,結果入力表!$B$2:$J$212,9,FALSE)","v":"ORC"},null,null,null,null,{"$f":"VLOOKUP(L173,結果入力表!$B$2:$J$212,2,FALSE)","v":"HRC"},null,null,"所属",{"$f":"VLOOKUP(L173,結果入力表!$B$2:$J$212,9,FALSE)","v":"ORC"},null,null,null,null,{"$f":"VLOOKUP(U173,結果入力表!$B$2:$J$212,2,FALSE)","v":"HRC"},null,null,"所属",{"$f":"VLOOKUP(U173,結果入力表!$B$2:$J$212,9,FALSE)","v":"ORC"},null,null,null,null,{"$f":"VLOOKUP(AD173,結果入力表!$B$2:$J$212,2,FALSE)","v":"HRC"},null,null,"所属",{"$f":"VLOOKUP(AD173,結果入力表!$B$2:$J$212,9,FALSE)","v":"ORC"},null,null,null,null,{"$f":"VLOOKUP(AM173,結果入力表!$B$2:$J$212,2,FALSE)","v":"HRC"},null,null,"所属",{"$f":"VLOOKUP(AM173,結果入力表!$B$2:$J$212,9,FALSE)","v":"ORC"},null,null,null,null,{"$f":"VLOOKUP(AV173,結果入力表!$B$2:$J$212,2,FALSE)","v":"HRC"},null,null,"所属",{"$f":"VLOOKUP(AV173,結果入力表!$B$2:$J$212,9,FALSE)","v":"ORC"},null,null,null,null,{"$f":"VLOOKUP(BE173,結果入力表!$B$2:$J$212,2,FALSE)","v":"HRC"},null,null,"所属",{"$f":"VLOOKUP(BE173,結果入力表!$B$2:$J$212,9,FALSE)","v":"ORC"}]
[null,{"$f":"VLOOKUP(C173,結果入力表!$B$2:$J$212,3,FALSE)","v":"堂園　雅也"},null,null,"氏名",{"$f":"VLOOKUP(C173,結果入力表!$B$2:$J$212,8,FALSE)","v":"小原　嘉丈"},null,null,null,null,{"$f":"VLOOKUP(L173,結果入力表!$B$2:$J$212,3,FALSE)","v":"宮本　一"},null,null,"氏名",{"$f":"VLOOKUP(L173,結果入力表!$B$2:$J$212,8,FALSE)","v":"乾　伸綱"},null,null,null,null,{"$f":"VLOOKUP(U173,結果入力表!$B$2:$J$212,3,FALSE)","v":"伊藤　登"},null,null,"氏名",{"$f":"VLOOKUP(U173,結果入力表!$B$2:$J$212,8,FALSE)","v":"山崎真紀子"},null,null,null,null,{"$f":"VLOOKUP(AD173,結果入力表!$B$2:$J$212,3,FALSE)","v":"宮井健太郎"},null,null,"氏名",{"$f":"VLOOKUP(AD173,結果入力表!$B$2:$J$212,8,FALSE)","v":"松居　勝巳"},null,null,null,null,{"$f":"VLOOKUP(AM173,結果入力表!$B$2:$J$212,3,FALSE)","v":"白澤雄一郎"},null,null,"氏名",{"$f":"VLOOKUP(AM173,結果入力表!$B$2:$J$212,8,FALSE)","v":"藤明　宏樹"},null,null,null,null,{"$f":"VLOOKUP(AV173,結果入力表!$B$2:$J$212,3,FALSE)","v":"河地　恵里"},null,null,"氏名",{"$f":"VLOOKUP(AV173,結果入力表!$B$2:$J$212,8,FALSE)","v":"吉岡　保俊"},null,null,null,null,{"$f":"VLOOKUP(BE173,結果入力表!$B$2:$J$212,3,FALSE)","v":"鐵山　泰三"},null,null,"氏名",{"$f":"VLOOKUP(BE173,結果入力表!$B$2:$J$212,8,FALSE)","v":"村上　泰辰"}]
[null,null,null,null,"得点",null,null,null,null,null,null,null,null,"得点",null,null,null,null,null,null,null,null,"得点",null,null,null,null,null,null,null,null,"得点",null,null,null,null,null,null,null,null,"得点",null,null,null,null,null,null,null,null,"得点",null,null,null,null,null,null,null,null,"得点"]
[null,null,null,null,"HR",null,null,null,null,null,null,null,null,"HR",null,null,null,null,null,null,null,null,"HR",null,null,null,null,null,null,null,null,"HR",null,null,null,null,null,null,null,null,"HR",null,null,null,null,null,null,null,null,"HR",null,null,null,null,null,null,null,null,"HR"]
[]
[null,null,null,null,null,"レフリー",null,null,null,null,null,null,null,null,"レフリー",null,null,null,null,null,null,null,null,"レフリー",null,null,null,null,null,null,null,null,"レフリー",null,null,null,null,null,null,null,null,"レフリー",null,null,null,null,null,null,null,null,"レフリー",null,null,null,null,null,null,null,null,"レフリー"]
[null,{"$f":"★個人成績表★!$A$1","v":"第31回　京阪神和奈滋対抗戦　　　(奈良；玉出エース)"},null,null,null,null,null,null,null,null,{"$f":"★個人成績表★!$A$1","v":"第31回　京阪神和奈滋対抗戦　　　(奈良；玉出エース)"},null,null,null,null,null,null,null,null,{"$f":"★個人成績表★!$A$1","v":"第31回　京阪神和奈滋対抗戦　　　(奈良；玉出エース)"},null,null,null,null,null,null,null,null,{"$f":"★個人成績表★!$A$1","v":"第31回　京阪神和奈滋対抗戦　　　(奈良；玉出エース)"},null,null,null,null,null,null,null,null,{"$f":"★個人成績表★!$A$1","v":"第31回　京阪神和奈滋対抗戦　　　(奈良；玉出エース)"},null,null,null,null,null,null,null,null,{"$f":"★個人成績表★!$A$1","v":"第31回　京阪神和奈滋対抗戦　　　(奈良；玉出エース)"},null,null,null,null,null,null,null,null,{"$f":"★個人成績表★!$A$1","v":"第31回　京阪神和奈滋対抗戦　　　(奈良；玉出エース)"},null,null,null,null,null,null,null," "]
[]
[null,"G-No",{"$f":"BE173+1","v":120},null,null,"T-No",null,null,null,null,"G-No",{"$f":"C183+1","v":121},null,null,"T-No",null,null,null,null,"G-No",{"$f":"L183+1","v":122},null,null,"T-No",null,null,null,null,"G-No",{"$f":"U183+1","v":123},null,null,"T-No",null,null,null,null,"G-No",{"$f":"AD183+1","v":124},null,null,"T-No",null,null,null,null,"G-No",{"$f":"AM183+1","v":125},null,null,"T-No",null,null,null,null,"G-No",{"$f":"AV183+1","v":126},null,null,"T-No"]
[]
[null,{"$f":"VLOOKUP(C183,結果入力表!$B$2:$J$212,2,FALSE)","v":"KRC"},null,null,"所属",{"$f":"VLOOKUP(C183,結果入力表!$B$2:$J$212,9,FALSE)","v":"WRC"},null,null,null,null,{"$f":"VLOOKUP(L183,結果入力表!$B$2:$J$212,2,FALSE)","v":"KRC"},null,null,"所属",{"$f":"VLOOKUP(L183,結果入力表!$B$2:$J$212,9,FALSE)","v":"WRC"},null,null,null,null,{"$f":"VLOOKUP(U183,結果入力表!$B$2:$J$212,2,FALSE)","v":"KRC"},null,null,"所属",{"$f":"VLOOKUP(U183,結果入力表!$B$2:$J$212,9,FALSE)","v":"WRC"},null,null,null,null,{"$f":"VLOOKUP(AD183,結果入力表!$B$2:$J$212,2,FALSE)","v":"KRC"},null,null,"所属",{"$f":"VLOOKUP(AD183,結果入力表!$B$2:$J$212,9,FALSE)","v":"WRC"},null,null,null,null,{"$f":"VLOOKUP(AM183,結果入力表!$B$2:$J$212,2,FALSE)","v":"KRC"},null,null,"所属",{"$f":"VLOOKUP(AM183,結果入力表!$B$2:$J$212,9,FALSE)","v":"WRC"},null,null,null,null,{"$f":"VLOOKUP(AV183,結果入力表!$B$2:$J$212,2,FALSE)","v":"KRC"},null,null,"所属",{"$f":"VLOOKUP(AV183,結果入力表!$B$2:$J$212,9,FALSE)","v":"WRC"},null,null,null,null,{"$f":"VLOOKUP(BE183,結果入力表!$B$2:$J$212,2,FALSE)","v":"KRC"},null,null,"所属",{"$f":"VLOOKUP(BE183,結果入力表!$B$2:$J$212,9,FALSE)","v":"WRC"}]
[null,{"$f":"VLOOKUP(C183,結果入力表!$B$2:$J$212,3,FALSE)","v":"松好　太一"},null,null,"氏名",{"$f":"VLOOKUP(C183,結果入力表!$B$2:$J$212,8,FALSE)","v":"芝先　泰生"},null,null,null,null,{"$f":"VLOOKUP(L183,結果入力表!$B$2:$J$212,3,FALSE)","v":"清水　義晴"},null,null,"氏名",{"$f":"VLOOKUP(L183,結果入力表!$B$2:$J$212,8,FALSE)","v":"松房ゆかり"},null,null,null,null,{"$f":"VLOOKUP(U183,結果入力表!$B$2:$J$212,3,FALSE)","v":"鈴木　康文"},null,null,"氏名",{"$f":"VLOOKUP(U183,結果入力表!$B$2:$J$212,8,FALSE)","v":"末岡　修"},null,null,null,null,{"$f":"VLOOKUP(AD183,結果入力表!$B$2:$J$212,3,FALSE)","v":"早川　徹"},null,null,"氏名",{"$f":"VLOOKUP(AD183,結果入力表!$B$2:$J$212,8,FALSE)","v":"和田宗一郎"},null,null,null,null,{"$f":"VLOOKUP(AM183,結果入力表!$B$2:$J$212,3,FALSE)","v":"井関　一成"},null,null,"氏名",{"$f":"VLOOKUP(AM183,結果入力表!$B$2:$J$212,8,FALSE)","v":"杉本　博章"},null,null,null,null,{"$f":"VLOOKUP(AV183,結果入力表!$B$2:$J$212,3,FALSE)","v":"今村　哲也"},null,null,"氏名",{"$f":"VLOOKUP(AV183,結果入力表!$B$2:$J$212,8,FALSE)","v":"中本　雅大"},null,null,null,null,{"$f":"VLOOKUP(BE183,結果入力表!$B$2:$J$212,3,FALSE)","v":"森田由佳里"},null,null,"氏名",{"$f":"VLOOKUP(BE183,結果入力表!$B$2:$J$212,8,FALSE)","v":"山中　康介"}]
[null,null,null,null,"得点",null,null,null,null,null,null,null,null,"得点",null,null,null,null,null,null,null,null,"得点",null,null,null,null,null,null,null,null,"得点",null,null,null,null,null,null,null,null,"得点",null,null,null,null,null,null,null,null,"得点",null,null,null,null,null,null,null,null,"得点"]
[null,null,null,null,"HR",null,null,null,null,null,null,null,null,"HR",null,null,null,null,null,null,null,null,"HR",null,null,null,null,null,null,null,null,"HR",null,null,null,null,null,null,null,null,"HR",null,null,null,null,null,null,null,null,"HR",null,null,null,null,null,null,null,null,"HR"]
[]
[null,null,null,null,null,"レフリー",null,null,null,null,null,null,null,null,"レフリー",null,null,null,null,null,null,null,null,"レフリー",null,null,null,null,null,null,null,null,"レフリー",null,null,null,null,null,null,null,null,"レフリー",null,null,null,null,null,null,null,null,"レフリー",null,null,null,null,null,null,null,null,"レフリー"]
[null,{"$f":"★個人成績表★!$A$1","v":"第31回　京阪神和奈滋対抗戦　　　(奈良；玉出エース)"},null,null,null,null,null,null,null,null,{"$f":"★個人成績表★!$A$1","v":"第31回　京阪神和奈滋対抗戦　　　(奈良；玉出エース)"},null,null,null,null,null,null,null,null,{"$f":"★個人成績表★!$A$1","v":"第31回　京阪神和奈滋対抗戦　　　(奈良；玉出エース)"},null,null,null,null,null,null,null,null,{"$f":"★個人成績表★!$A$1","v":"第31回　京阪神和奈滋対抗戦　　　(奈良；玉出エース)"},null,null,null,null,null,null,null,null,{"$f":"★個人成績表★!$A$1","v":"第31回　京阪神和奈滋対抗戦　　　(奈良；玉出エース)"},null,null,null,null,null,null,null,null,{"$f":"★個人成績表★!$A$1","v":"第31回　京阪神和奈滋対抗戦　　　(奈良；玉出エース)"},null,null,null,null,null,null,null,null,{"$f":"★個人成績表★!$A$1","v":"第31回　京阪神和奈滋対抗戦　　　(奈良；玉出エース)"},null,null,null,null,null,null,null," "]
[]
[null,"G-No",{"$f":"BE183+1","v":127},null,null,"T-No",null,null,null,null,"G-No",{"$f":"C193+1","v":128},null,null,"T-No",null,null,null,null,"G-No",{"$f":"L193+1","v":129},null,null,"T-No",null,null,null,null,"G-No",{"$f":"U193+1","v":130},null,null,"T-No",null,null,null,null,"G-No",{"$f":"AD193+1","v":131},null,null,"T-No",null,null,null,null,"G-No",{"$f":"AM193+1","v":132},null,null,"T-No",null,null,null,null,"G-No",{"$f":"AV193+1","v":133},null,null,"T-No"]
[]
[null,{"$f":"VLOOKUP(C193,結果入力表!$B$2:$J$212,2,FALSE)","v":"HRC"},null,null,"所属",{"$f":"VLOOKUP(C193,結果入力表!$B$2:$J$212,9,FALSE)","v":"SBC"},null,null,null,null,{"$f":"VLOOKUP(L193,結果入力表!$B$2:$J$212,2,FALSE)","v":"HRC"},null,null,"所属",{"$f":"VLOOKUP(L193,結果入力表!$B$2:$J$212,9,FALSE)","v":"SBC"},null,null,null,null,{"$f":"VLOOKUP(U193,結果入力表!$B$2:$J$212,2,FALSE)","v":"HRC"},null,null,"所属",{"$f":"VLOOKUP(U193,結果入力表!$B$2:$J$212,9,FALSE)","v":"SBC"},null,null,null,null,{"$f":"VLOOKUP(AD193,結果入力表!$B$2:$J$212,2,FALSE)","v":"HRC"},null,null,"所属",{"$f":"VLOOKUP(AD193,結果入力表!$B$2:$J$212,9,FALSE)","v":"SBC"},null,null,null,null,{"$f":"VLOOKUP(AM193,結果入力表!$B$2:$J$212,2,FALSE)","v":"HRC"},null,null,"所属",{"$f":"VLOOKUP(AM193,結果入力表!$B$2:$J$212,9,FALSE)","v":"SBC"},null,null,null,null,{"$f":"VLOOKUP(AV193,結果入力表!$B$2:$J$212,2,FALSE)","v":"HRC"},null,null,"所属",{"$f":"VLOOKUP(AV193,結果入力表!$B$2:$J$212,9,FALSE)","v":"SBC"},null,null,null,null,{"$f":"VLOOKUP(BE193,結果入力表!$B$2:$J$212,2,FALSE)","v":"HRC"},null,null,"所属",{"$f":"VLOOKUP(BE193,結果入力表!$B$2:$J$212,9,FALSE)","v":"SBC"}]
[null,{"$f":"VLOOKUP(C193,結果入力表!$B$2:$J$212,3,FALSE)","v":"堂園　雅也"},null,null,"氏名",{"$f":"VLOOKUP(C193,結果入力表!$B$2:$J$212,8,FALSE)","v":"山中　康寛"},null,null,null,null,{"$f":"VLOOKUP(L193,結果入力表!$B$2:$J$212,3,FALSE)","v":"宮本　一"},null,null,"氏名",{"$f":"VLOOKUP(L193,結果入力表!$B$2:$J$212,8,FALSE)","v":"西峰　久祐"},null,null,null,null,{"$f":"VLOOKUP(U193,結果入力表!$B$2:$J$212,3,FALSE)","v":"伊藤　登"},null,null,"氏名",{"$f":"VLOOKUP(U193,結果入力表!$B$2:$J$212,8,FALSE)","v":"大橋　正寛"},null,null,null,null,{"$f":"VLOOKUP(AD193,結果入力表!$B$2:$J$212,3,FALSE)","v":"宮井健太郎"},null,null,"氏名",{"$f":"VLOOKUP(AD193,結果入力表!$B$2:$J$212,8,FALSE)","v":"秋田　倫央"},null,null,null,null,{"$f":"VLOOKUP(AM193,結果入力表!$B$2:$J$212,3,FALSE)","v":"白澤雄一郎"},null,null,"氏名",{"$f":"VLOOKUP(AM193,結果入力表!$B$2:$J$212,8,FALSE)","v":"大橋　洋子"},null,null,null,null,{"$f":"VLOOKUP(AV193,結果入力表!$B$2:$J$212,3,FALSE)","v":"河地　恵里"},null,null,"氏名",{"$f":"VLOOKUP(AV193,結果入力表!$B$2:$J$212,8,FALSE)","v":"林　秀忠"},null,null,null,null,{"$f":"VLOOKUP(BE193,結果入力表!$B$2:$J$212,3,FALSE)","v":"鐵山　泰三"},null,null,"氏名",{"$f":"VLOOKUP(BE193,結果入力表!$B$2:$J$212,8,FALSE)","v":"大橋　義治"}]
[null,null,null,null,"得点",null,null,null,null,null,null,null,null,"得点",null,null,null,null,null,null,null,null,"得点",null,null,null,null,null,null,null,null,"得点",null,null,null,null,null,null,null,null,"得点",null,null,null,null,null,null,null,null,"得点",null,null,null,null,null,null,null,null,"得点"]
[null,null,null,null,"HR",null,null,null,null,null,null,null,null,"HR",null,null,null,null,null,null,null,null,"HR",null,null,null,null,null,null,null,null,"HR",null,null,null,null,null,null,null,null,"HR",null,null,null,null,null,null,null,null,"HR",null,null,null,null,null,null,null,null,"HR"]
[]
[null,null,null,null,null,"レフリー",null,null,null,null,null,null,null,null,"レフリー",null,null,null,null,null,null,null,null,"レフリー",null,null,null,null,null,null,null,null,"レフリー",null,null,null,null,null,null,null,null,"レフリー",null,null,null,null,null,null,null,null,"レフリー",null,null,null,null,null,null,null,null,"レフリー"]
[null,{"$f":"★個人成績表★!$A$1","v":"第31回　京阪神和奈滋対抗戦　　　(奈良；玉出エース)"},null,null,null,null,null,null,null,null,{"$f":"★個人成績表★!$A$1","v":"第31回　京阪神和奈滋対抗戦　　　(奈良；玉出エース)"},null,null,null,null,null,null,null,null,{"$f":"★個人成績表★!$A$1","v":"第31回　京阪神和奈滋対抗戦　　　(奈良；玉出エース)"},null,null,null,null,null,null,null,null,{"$f":"★個人成績表★!$A$1","v":"第31回　京阪神和奈滋対抗戦　　　(奈良；玉出エース)"},null,null,null,null,null,null,null,null,{"$f":"★個人成績表★!$A$1","v":"第31回　京阪神和奈滋対抗戦　　　(奈良；玉出エース)"},null,null,null,null,null,null,null,null,{"$f":"★個人成績表★!$A$1","v":"第31回　京阪神和奈滋対抗戦　　　(奈良；玉出エース)"},null,null,null,null,null,null,null,null,{"$f":"★個人成績表★!$A$1","v":"第31回　京阪神和奈滋対抗戦　　　(奈良；玉出エース)"},null,null,null,null,null,null,null," "]
[]
[null,"G-No",{"$f":"BE193+1","v":134},null,null,"T-No",null,null,null,null,"G-No",{"$f":"C203+1","v":135},null,null,"T-No",null,null,null,null,"G-No",{"$f":"L203+1","v":136},null,null,"T-No",null,null,null,null,"G-No",{"$f":"U203+1","v":137},null,null,"T-No",null,null,null,null,"G-No",{"$f":"AD203+1","v":138},null,null,"T-No",null,null,null,null,"G-No",{"$f":"AM203+1","v":139},null,null,"T-No",null,null,null,null,"G-No",{"$f":"AV203+1","v":140},null,null,"T-No"]
[]
[null,{"$f":"VLOOKUP(C203,結果入力表!$B$2:$J$212,2,FALSE)","v":"WRC"},null,null,"所属",{"$f":"VLOOKUP(C203,結果入力表!$B$2:$J$212,9,FALSE)","v":"NRC"},null,null,null,null,{"$f":"VLOOKUP(L203,結果入力表!$B$2:$J$212,2,FALSE)","v":"WRC"},null,null,"所属",{"$f":"VLOOKUP(L203,結果入力表!$B$2:$J$212,9,FALSE)","v":"NRC"},null,null,null,null,{"$f":"VLOOKUP(U203,結果入力表!$B$2:$J$212,2,FALSE)","v":"WRC"},null,null,"所属",{"$f":"VLOOKUP(U203,結果入力表!$B$2:$J$212,9,FALSE)","v":"NRC"},null,null,null,null,{"$f":"VLOOKUP(AD203,結果入力表!$B$2:$J$212,2,FALSE)","v":"WRC"},null,null,"所属",{"$f":"VLOOKUP(AD203,結果入力表!$B$2:$J$212,9,FALSE)","v":"NRC"},null,null,null,null,{"$f":"VLOOKUP(AM203,結果入力表!$B$2:$J$212,2,FALSE)","v":"WRC"},null,null,"所属",{"$f":"VLOOKUP(AM203,結果入力表!$B$2:$J$212,9,FALSE)","v":"NRC"},null,null,null,null,{"$f":"VLOOKUP(AV203,結果入力表!$B$2:$J$212,2,FALSE)","v":"WRC"},null,null,"所属",{"$f":"VLOOKUP(AV203,結果入力表!$B$2:$J$212,9,FALSE)","v":"NRC"},null,null,null,null,{"$f":"VLOOKUP(BE203,結果入力表!$B$2:$J$212,2,FALSE)","v":"WRC"},null,null,"所属",{"$f":"VLOOKUP(BE203,結果入力表!$B$2:$J$212,9,FALSE)","v":"NRC"}]
[null,{"$f":"VLOOKUP(C203,結果入力表!$B$2:$J$212,3,FALSE)","v":"芝先　泰生"},null,null,"氏名",{"$f":"VLOOKUP(C203,結果入力表!$B$2:$J$212,8,FALSE)","v":"植田　慎也"},null,null,null,null,{"$f":"VLOOKUP(L203,結果入力表!$B$2:$J$212,3,FALSE)","v":"松房ゆかり"},null,null,"氏名",{"$f":"VLOOKUP(L203,結果入力表!$B$2:$J$212,8,FALSE)","v":"近藤　拓馬"},null,null,null,null,{"$f":"VLOOKUP(U203,結果入力表!$B$2:$J$212,3,FALSE)","v":"末岡　修"},null,null,"氏名",{"$f":"VLOOKUP(U203,結果入力表!$B$2:$J$212,8,FALSE)","v":"長谷川　進"},null,null,null,null,{"$f":"VLOOKUP(AD203,結果入力表!$B$2:$J$212,3,FALSE)","v":"和田宗一郎"},null,null,"氏名",{"$f":"VLOOKUP(AD203,結果入力表!$B$2:$J$212,8,FALSE)","v":"白戸　恭子"},null,null,null,null,{"$f":"VLOOKUP(AM203,結果入力表!$B$2:$J$212,3,FALSE)","v":"杉本　博章"},null,null,"氏名",{"$f":"VLOOKUP(AM203,結果入力表!$B$2:$J$212,8,FALSE)","v":"吉向　翔平"},null,null,null,null,{"$f":"VLOOKUP(AV203,結果入力表!$B$2:$J$212,3,FALSE)","v":"中本　雅大"},null,null,"氏名",{"$f":"VLOOKUP(AV203,結果入力表!$B$2:$J$212,8,FALSE)","v":"岩本　剛"},null,null,null,null,{"$f":"VLOOKUP(BE203,結果入力表!$B$2:$J$212,3,FALSE)","v":"山中　康介"},null,null,"氏名",{"$f":"VLOOKUP(BE203,結果入力表!$B$2:$J$212,8,FALSE)","v":"白戸　玲人"}]
[null,null,null,null,"得点",null,null,null,null,null,null,null,null,"得点",null,null,null,null,null,null,null,null,"得点",null,null,null,null,null,null,null,null,"得点",null,null,null,null,null,null,null,null,"得点",null,null,null,null,null,null,null,null,"得点",null,null,null,null,null,null,null,null,"得点"]
[null,null,null,null,"HR",null,null,null,null,null,null,null,null,"HR",null,null,null,null,null,null,null,null,"HR",null,null,null,null,null,null,null,null,"HR",null,null,null,null,null,null,null,null,"HR",null,null,null,null,null,null,null,null,"HR",null,null,null,null,null,null,null,null,"HR"]
[]
[null,null,null,null,null,"レフリー",null,null,null,null,null,null,null,null,"レフリー",null,null,null,null,null,null,null,null,"レフリー",null,null,null,null,null,null,null,null,"レフリー",null,null,null,null,null,null,null,null,"レフリー",null,null,null,null,null,null,null,null,"レフリー",null,null,null,null,null,null,null,null,"レフリー"]
[null,{"$f":"★個人成績表★!$A$1","v":"第31回　京阪神和奈滋対抗戦　　　(奈良；玉出エース)"},null,null,null,null,null,null,null,null,{"$f":"★個人成績表★!$A$1","v":"第31回　京阪神和奈滋対抗戦　　　(奈良；玉出エース)"},null,null,null,null,null,null,null,null,{"$f":"★個人成績表★!$A$1","v":"第31回　京阪神和奈滋対抗戦　　　(奈良；玉出エース)"},null,null,null,null,null,null,null,null,{"$f":"★個人成績表★!$A$1","v":"第31回　京阪神和奈滋対抗戦　　　(奈良；玉出エース)"},null,null,null,null,null,null,null,null,{"$f":"★個人成績表★!$A$1","v":"第31回　京阪神和奈滋対抗戦　　　(奈良；玉出エース)"},null,null,null,null,null,null,null,null,{"$f":"★個人成績表★!$A$1","v":"第31回　京阪神和奈滋対抗戦　　　(奈良；玉出エース)"},null,null,null,null,null,null,null,null,{"$f":"★個人成績表★!$A$1","v":"第31回　京阪神和奈滋対抗戦　　　(奈良；玉出エース)"},null,null,null,null,null,null,null," "]
[]
[null,"G-No",{"$f":"BE203+1","v":141},null,null,"T-No",null,null,null,null,"G-No",{"$f":"C213+1","v":142},null,null,"T-No",null,null,null,null,"G-No",{"$f":"L213+1","v":143},null,null,"T-No",null,null,null,null,"G-No",{"$f":"U213+1","v":144},null,null,"T-No",null,null,null,null,"G-No",{"$f":"AD213+1","v":145},null,null,"T-No",null,null,null,null,"G-No",{"$f":"AM213+1","v":146},null,null,"T-No",null,null,null,null,"G-No",{"$f":"AV213+1","v":147},null,null,"T-No"]
[]
[null,{"$f":"VLOOKUP(C213,結果入力表!$B$2:$J$212,2,FALSE)","v":"KRC"},null,null,"所属",{"$f":"VLOOKUP(C213,結果入力表!$B$2:$J$212,9,FALSE)","v":"ORC"},null,null,null,null,{"$f":"VLOOKUP(L213,結果入力表!$B$2:$J$212,2,FALSE)","v":"KRC"},null,null,"所属",{"$f":"VLOOKUP(L213,結果入力表!$B$2:$J$212,9,FALSE)","v":"ORC"},null,null,null,null,{"$f":"VLOOKUP(U213,結果入力表!$B$2:$J$212,2,FALSE)","v":"KRC"},null,null,"所属",{"$f":"VLOOKUP(U213,結果入力表!$B$2:$J$212,9,FALSE)","v":"ORC"},null,null,null,null,{"$f":"VLOOKUP(AD213,結果入力表!$B$2:$J$212,2,FALSE)","v":"KRC"},null,null,"所属",{"$f":"VLOOKUP(AD213,結果入力表!$B$2:$J$212,9,FALSE)","v":"ORC"},null,null,null,null,{"$f":"VLOOKUP(AM213,結果入力表!$B$2:$J$212,2,FALSE)","v":"KRC"},null,null,"所属",{"$f":"VLOOKUP(AM213,結果入力表!$B$2:$J$212,9,FALSE)","v":"ORC"},null,null,null,null,{"$f":"VLOOKUP(AV213,結果入力表!$B$2:$J$212,2,FALSE)","v":"KRC"},null,null,"所属",{"$f":"VLOOKUP(AV213,結果入力表!$B$2:$J$212,9,FALSE)","v":"ORC"},null,null,null,null,{"$f":"VLOOKUP(BE213,結果入力表!$B$2:$J$212,2,FALSE)","v":"KRC"},null,null,"所属",{"$f":"VLOOKUP(BE213,結果入力表!$B$2:$J$212,9,FALSE)","v":"ORC"}]
[null,{"$f":"VLOOKUP(C213,結果入力表!$B$2:$J$212,3,FALSE)","v":"松好　太一"},null,null,"氏名",{"$f":"VLOOKUP(C213,結果入力表!$B$2:$J$212,8,FALSE)","v":"小原　嘉丈"},null,null,null,null,{"$f":"VLOOKUP(L213,結果入力表!$B$2:$J$212,3,FALSE)","v":"清水　義晴"},null,null,"氏名",{"$f":"VLOOKUP(L213,結果入力表!$B$2:$J$212,8,FALSE)","v":"乾　伸綱"},null,null,null,null,{"$f":"VLOOKUP(U213,結果入力表!$B$2:$J$212,3,FALSE)","v":"鈴木　康文"},null,null,"氏名",{"$f":"VLOOKUP(U213,結果入力表!$B$2:$J$212,8,FALSE)","v":"山崎真紀子"},null,null,null,null,{"$f":"VLOOKUP(AD213,結果入力表!$B$2:$J$212,3,FALSE)","v":"早川　徹"},null,null,"氏名",{"$f":"VLOOKUP(AD213,結果入力表!$B$2:$J$212,8,FALSE)","v":"松居　勝巳"},null,null,null,null,{"$f":"VLOOKUP(AM213,結果入力表!$B$2:$J$212,3,FALSE)","v":"井関　一成"},null,null,"氏名",{"$f":"VLOOKUP(AM213,結果入力表!$B$2:$J$212,8,FALSE)","v":"藤明　宏樹"},null,null,null,null,{"$f":"VLOOKUP(AV213,結果入力表!$B$2:$J$212,3,FALSE)","v":"今村　哲也"},null,null,"氏名",{"$f":"VLOOKUP(AV213,結果入力表!$B$2:$J$212,8,FALSE)","v":"吉岡　保俊"},null,null,null,null,{"$f":"VLOOKUP(BE213,結果入力表!$B$2:$J$212,3,FALSE)","v":"森田由佳里"},null,null,"氏名",{"$f":"VLOOKUP(BE213,結果入力表!$B$2:$J$212,8,FALSE)","v":"村上　泰辰"}]
[null,null,null,null,"得点",null,null,null,null,null,null,null,null,"得点",null,null,null,null,null,null,null,null,"得点",null,null,null,null,null,null,null,null,"得点",null,null,null,null,null,null,null,null,"得点",null,null,null,null,null,null,null,null,"得点",null,null,null,null,null,null,null,null,"得点"]
[null,null,null,null,"HR",null,null,null,null,null,null,null,null,"HR",null,null,null,null,null,null,null,null,"HR",null,null,null,null,null,null,null,null,"HR",null,null,null,null,null,null,null,null,"HR",null,null,null,null,null,null,null,null,"HR",null,null,null,null,null,null,null,null,"HR"]
[]
[null,null,null,null,null,"レフリー",null,null,null,null,null,null,null,null,"レフリー",null,null,null,null,null,null,null,null,"レフリー",null,null,null,null,null,null,null,null,"レフリー",null,null,null,null,null,null,null,null,"レフリー",null,null,null,null,null,null,null,null,"レフリー",null,null,null,null,null,null,null,null,"レフリー"]
[null,{"$f":"★個人成績表★!$A$1","v":"第31回　京阪神和奈滋対抗戦　　　(奈良；玉出エース)"},null,null,null,null,null,null,null,null,{"$f":"★個人成績表★!$A$1","v":"第31回　京阪神和奈滋対抗戦　　　(奈良；玉出エース)"},null,null,null,null,null,null,null,null,{"$f":"★個人成績表★!$A$1","v":"第31回　京阪神和奈滋対抗戦　　　(奈良；玉出エース)"},null,null,null,null,null,null,null,null,{"$f":"★個人成績表★!$A$1","v":"第31回　京阪神和奈滋対抗戦　　　(奈良；玉出エース)"},null,null,null,null,null,null,null,null,{"$f":"★個人成績表★!$A$1","v":"第31回　京阪神和奈滋対抗戦　　　(奈良；玉出エース)"},null,null,null,null,null,null,null,null,{"$f":"★個人成績表★!$A$1","v":"第31回　京阪神和奈滋対抗戦　　　(奈良；玉出エース)"},null,null,null,null,null,null,null,null,{"$f":"★個人成績表★!$A$1","v":"第31回　京阪神和奈滋対抗戦　　　(奈良；玉出エース)"},null,null,null,null,null,null,null," "]
[]
[null,"G-No",{"$f":"BE213+1","v":148},null,null,"T-No",null,null,null,null,"G-No",{"$f":"C223+1","v":149},null,null,"T-No",null,null,null,null,"G-No",{"$f":"L223+1","v":150},null,null,"T-No",null,null,null,null,"G-No",{"$f":"U223+1","v":151},null,null,"T-No",null,null,null,null,"G-No",{"$f":"AD223+1","v":152},null,null,"T-No",null,null,null,null,"G-No",{"$f":"AM223+1","v":153},null,null,"T-No",null,null,null,null,"G-No",{"$f":"AV223+1","v":154},null,null,"T-No"]
[]
[null,{"$f":"VLOOKUP(C223,結果入力表!$B$2:$J$212,2,FALSE)","v":"WRC"},null,null,"所属",{"$f":"VLOOKUP(C223,結果入力表!$B$2:$J$212,9,FALSE)","v":"HRC"},null,null,null,null,{"$f":"VLOOKUP(L223,結果入力表!$B$2:$J$212,2,FALSE)","v":"WRC"},null,null,"所属",{"$f":"VLOOKUP(L223,結果入力表!$B$2:$J$212,9,FALSE)","v":"HRC"},null,null,null,null,{"$f":"VLOOKUP(U223,結果入力表!$B$2:$J$212,2,FALSE)","v":"WRC"},null,null,"所属",{"$f":"VLOOKUP(U223,結果入力表!$B$2:$J$212,9,FALSE)","v":"HRC"},null,null,null,null,{"$f":"VLOOKUP(AD223,結果入力表!$B$2:$J$212,2,FALSE)","v":"WRC"},null,null,"所属",{"$f":"VLOOKUP(AD223,結果入力表!$B$2:$J$212,9,FALSE)","v":"HRC"},null,null,null,null,{"$f":"VLOOKUP(AM223,結果入力表!$B$2:$J$212,2,FALSE)","v":"WRC"},null,null,"所属",{"$f":"VLOOKUP(AM223,結果入力表!$B$2:$J$212,9,FALSE)","v":"HRC"},null,null,null,null,{"$f":"VLOOKUP(AV223,結果入力表!$B$2:$J$212,2,FALSE)","v":"WRC"},null,null,"所属",{"$f":"VLOOKUP(AV223,結果入力表!$B$2:$J$212,9,FALSE)","v":"HRC"},null,null,null,null,{"$f":"VLOOKUP(BE223,結果入力表!$B$2:$J$212,2,FALSE)","v":"WRC"},null,null,"所属",{"$f":"VLOOKUP(BE223,結果入力表!$B$2:$J$212,9,FALSE)","v":"HRC"}]
[null,{"$f":"VLOOKUP(C223,結果入力表!$B$2:$J$212,3,FALSE)","v":"芝先　泰生"},null,null,"氏名",{"$f":"VLOOKUP(C223,結果入力表!$B$2:$J$212,8,FALSE)","v":"堂園　雅也"},null,null,null,null,{"$f":"VLOOKUP(L223,結果入力表!$B$2:$J$212,3,FALSE)","v":"松房ゆかり"},null,null,"氏名",{"$f":"VLOOKUP(L223,結果入力表!$B$2:$J$212,8,FALSE)","v":"宮本　一"},null,null,null,null,{"$f":"VLOOKUP(U223,結果入力表!$B$2:$J$212,3,FALSE)","v":"末岡　修"},null,null,"氏名",{"$f":"VLOOKUP(U223,結果入力表!$B$2:$J$212,8,FALSE)","v":"伊藤　登"},null,null,null,null,{"$f":"VLOOKUP(AD223,結果入力表!$B$2:$J$212,3,FALSE)","v":"和田宗一郎"},null,null,"氏名",{"$f":"VLOOKUP(AD223,結果入力表!$B$2:$J$212,8,FALSE)","v":"宮井健太郎"},null,null,null,null,{"$f":"VLOOKUP(AM223,結果入力表!$B$2:$J$212,3,FALSE)","v":"杉本　博章"},null,null,"氏名",{"$f":"VLOOKUP(AM223,結果入力表!$B$2:$J$212,8,FALSE)","v":"白澤雄一郎"},null,null,null,null,{"$f":"VLOOKUP(AV223,結果入力表!$B$2:$J$212,3,FALSE)","v":"中本　雅大"},null,null,"氏名",{"$f":"VLOOKUP(AV223,結果入力表!$B$2:$J$212,8,FALSE)","v":"河地　恵里"},null,null,null,null,{"$f":"VLOOKUP(BE223,結果入力表!$B$2:$J$212,3,FALSE)","v":"山中　康介"},null,null,"氏名",{"$f":"VLOOKUP(BE223,結果入力表!$B$2:$J$212,8,FALSE)","v":"鐵山　泰三"}]
[null,null,null,null,"得点",null,null,null,null,null,null,null,null,"得点",null,null,null,null,null,null,null,null,"得点",null,null,null,null,null,null,null,null,"得点",null,null,null,null,null,null,null,null,"得点",null,null,null,null,null,null,null,null,"得点",null,null,null,null,null,null,null,null,"得点"]
[null,null,null,null,"HR",null,null,null,null,null,null,null,null,"HR",null,null,null,null,null,null,null,null,"HR",null,null,null,null,null,null,null,null,"HR",null,null,null,null,null,null,null,null,"HR",null,null,null,null,null,null,null,null,"HR",null,null,null,null,null,null,null,null,"HR"]
[]
[null,null,null,null,null,"レフリー",null,null,null,null,null,null,null,null,"レフリー",null,null,null,null,null,null,null,null,"レフリー",null,null,null,null,null,null,null,null,"レフリー",null,null,null,null,null,null,null,null,"レフリー",null,null,null,null,null,null,null,null,"レフリー",null,null,null,null,null,null,null,null,"レフリー"]
[null,{"$f":"★個人成績表★!$A$1","v":"第31回　京阪神和奈滋対抗戦　　　(奈良；玉出エース)"},null,null,null,null,null,null,null,null,{"$f":"★個人成績表★!$A$1","v":"第31回　京阪神和奈滋対抗戦　　　(奈良；玉出エース)"},null,null,null,null,null,null,null,null,{"$f":"★個人成績表★!$A$1","v":"第31回　京阪神和奈滋対抗戦　　　(奈良；玉出エース)"},null,null,null,null,null,null,null,null,{"$f":"★個人成績表★!$A$1","v":"第31回　京阪神和奈滋対抗戦　　　(奈良；玉出エース)"},null,null,null,null,null,null,null,null,{"$f":"★個人成績表★!$A$1","v":"第31回　京阪神和奈滋対抗戦　　　(奈良；玉出エース)"},null,null,null,null,null,null,null,null,{"$f":"★個人成績表★!$A$1","v":"第31回　京阪神和奈滋対抗戦　　　(奈良；玉出エース)"},null,null,null,null,null,null,null,null,{"$f":"★個人成績表★!$A$1","v":"第31回　京阪神和奈滋対抗戦　　　(奈良；玉出エース)"},null,null,null,null,null,null,null," "]
[]
[null,"G-No",{"$f":"BE223+1","v":155},null,null,"T-No",null,null,null,null,"G-No",{"$f":"C233+1","v":156},null,null,"T-No",null,null,null,null,"G-No",{"$f":"L233+1","v":157},null,null,"T-No",null,null,null,null,"G-No",{"$f":"U233+1","v":158},null,null,"T-No",null,null,null,null,"G-No",{"$f":"AD233+1","v":159},null,null,"T-No",null,null,null,null,"G-No",{"$f":"AM233+1","v":160},null,null,"T-No",null,null,null,null,"G-No",{"$f":"AV233+1","v":161},null,null,"T-No"]
[]
[null,{"$f":"VLOOKUP(C233,結果入力表!$B$2:$J$212,2,FALSE)","v":"ORC"},null,null,"所属",{"$f":"VLOOKUP(C233,結果入力表!$B$2:$J$212,9,FALSE)","v":"SBC"},null,null,null,null,{"$f":"VLOOKUP(L233,結果入力表!$B$2:$J$212,2,FALSE)","v":"ORC"},null,null,"所属",{"$f":"VLOOKUP(L233,結果入力表!$B$2:$J$212,9,FALSE)","v":"SBC"},null,null,null,null,{"$f":"VLOOKUP(U233,結果入力表!$B$2:$J$212,2,FALSE)","v":"ORC"},null,null,"所属",{"$f":"VLOOKUP(U233,結果入力表!$B$2:$J$212,9,FALSE)","v":"SBC"},null,null,null,null,{"$f":"VLOOKUP(AD233,結果入力表!$B$2:$J$212,2,FALSE)","v":"ORC"},null,null,"所属",{"$f":"VLOOKUP(AD233,結果入力表!$B$2:$J$212,9,FALSE)","v":"SBC"},null,null,null,null,{"$f":"VLOOKUP(AM233,結果入力表!$B$2:$J$212,2,FALSE)","v":"ORC"},null,null,"所属",{"$f":"VLOOKUP(AM233,結果入力表!$B$2:$J$212,9,FALSE)","v":"SBC"},null,null,null,null,{"$f":"VLOOKUP(AV233,結果入力表!$B$2:$J$212,2,FALSE)","v":"ORC"},null,null,"所属",{"$f":"VLOOKUP(AV233,結果入力表!$B$2:$J$212,9,FALSE)","v":"SBC"},null,null,null,null,{"$f":"VLOOKUP(BE233,結果入力表!$B$2:$J$212,2,FALSE)","v":"ORC"},null,null,"所属",{"$f":"VLOOKUP(BE233,結果入力表!$B$2:$J$212,9,FALSE)","v":"SBC"}]
[null,{"$f":"VLOOKUP(C233,結果入力表!$B$2:$J$212,3,FALSE)","v":"小原　嘉丈"},null,null,"氏名",{"$f":"VLOOKUP(C233,結果入力表!$B$2:$J$212,8,FALSE)","v":"山中　康寛"},null,null,null,null,{"$f":"VLOOKUP(L233,結果入力表!$B$2:$J$212,3,FALSE)","v":"乾　伸綱"},null,null,"氏名",{"$f":"VLOOKUP(L233,結果入力表!$B$2:$J$212,8,FALSE)","v":"西峰　久祐"},null,null,null,null,{"$f":"VLOOKUP(U233,結果入力表!$B$2:$J$212,3,FALSE)","v":"山崎真紀子"},null,null,"氏名",{"$f":"VLOOKUP(U233,結果入力表!$B$2:$J$212,8,FALSE)","v":"大橋　正寛"},null,null,null,null,{"$f":"VLOOKUP(AD233,結果入力表!$B$2:$J$212,3,FALSE)","v":"松居　勝巳"},null,null,"氏名",{"$f":"VLOOKUP(AD233,結果入力表!$B$2:$J$212,8,FALSE)","v":"秋田　倫央"},null,null,null,null,{"$f":"VLOOKUP(AM233,結果入力表!$B$2:$J$212,3,FALSE)","v":"藤明　宏樹"},null,null,"氏名",{"$f":"VLOOKUP(AM233,結果入力表!$B$2:$J$212,8,FALSE)","v":"大橋　洋子"},null,null,null,null,{"$f":"VLOOKUP(AV233,結果入力表!$B$2:$J$212,3,FALSE)","v":"吉岡　保俊"},null,null,"氏名",{"$f":"VLOOKUP(AV233,結果入力表!$B$2:$J$212,8,FALSE)","v":"林　秀忠"},null,null,null,null,{"$f":"VLOOKUP(BE233,結果入力表!$B$2:$J$212,3,FALSE)","v":"村上　泰辰"},null,null,"氏名",{"$f":"VLOOKUP(BE233,結果入力表!$B$2:$J$212,8,FALSE)","v":"大橋　義治"}]
[null,null,null,null,"得点",null,null,null,null,null,null,null,null,"得点",null,null,null,null,null,null,null,null,"得点",null,null,null,null,null,null,null,null,"得点",null,null,null,null,null,null,null,null,"得点",null,null,null,null,null,null,null,null,"得点",null,null,null,null,null,null,null,null,"得点"]
[null,null,null,null,"HR",null,null,null,null,null,null,null,null,"HR",null,null,null,null,null,null,null,null,"HR",null,null,null,null,null,null,null,null,"HR",null,null,null,null,null,null,null,null,"HR",null,null,null,null,null,null,null,null,"HR",null,null,null,null,null,null,null,null,"HR"]
[]
[null,null,null,null,null,"レフリー",null,null,null,null,null,null,null,null,"レフリー",null,null,null,null,null,null,null,null,"レフリー",null,null,null,null,null,null,null,null,"レフリー",null,null,null,null,null,null,null,null,"レフリー",null,null,null,null,null,null,null,null,"レフリー",null,null,null,null,null,null,null,null,"レフリー"]
[null,{"$f":"★個人成績表★!$A$1","v":"第31回　京阪神和奈滋対抗戦　　　(奈良；玉出エース)"},null,null,null,null,null,null,null,null,{"$f":"★個人成績表★!$A$1","v":"第31回　京阪神和奈滋対抗戦　　　(奈良；玉出エース)"},null,null,null,null,null,null,null,null,{"$f":"★個人成績表★!$A$1","v":"第31回　京阪神和奈滋対抗戦　　　(奈良；玉出エース)"},null,null,null,null,null,null,null,null,{"$f":"★個人成績表★!$A$1","v":"第31回　京阪神和奈滋対抗戦　　　(奈良；玉出エース)"},null,null,null,null,null,null,null,null,{"$f":"★個人成績表★!$A$1","v":"第31回　京阪神和奈滋対抗戦　　　(奈良；玉出エース)"},null,null,null,null,null,null,null,null,{"$f":"★個人成績表★!$A$1","v":"第31回　京阪神和奈滋対抗戦　　　(奈良；玉出エース)"},null,null,null,null,null,null,null,null,{"$f":"★個人成績表★!$A$1","v":"第31回　京阪神和奈滋対抗戦　　　(奈良；玉出エース)"},null,null,null,null,null,null,null," "]
[]
[null,"G-No",{"$f":"BE233+1","v":162},null,null,"T-No",null,null,null,null,"G-No",{"$f":"C243+1","v":163},null,null,"T-No",null,null,null,null,"G-No",{"$f":"L243+1","v":164},null,null,"T-No",null,null,null,null,"G-No",{"$f":"U243+1","v":165},null,null,"T-No",null,null,null,null,"G-No",{"$f":"AD243+1","v":166},null,null,"T-No",null,null,null,null,"G-No",{"$f":"AM243+1","v":167},null,null,"T-No",null,null,null,null,"G-No",{"$f":"AV243+1","v":168},null,null,"T-No"]
[]
[null,{"$f":"VLOOKUP(C243,結果入力表!$B$2:$J$212,2,FALSE)","v":"KRC"},null,null,"所属",{"$f":"VLOOKUP(C243,結果入力表!$B$2:$J$212,9,FALSE)","v":"NRC"},null,null,null,null,{"$f":"VLOOKUP(L243,結果入力表!$B$2:$J$212,2,FALSE)","v":"KRC"},null,null,"所属",{"$f":"VLOOKUP(L243,結果入力表!$B$2:$J$212,9,FALSE)","v":"NRC"},null,null,null,null,{"$f":"VLOOKUP(U243,結果入力表!$B$2:$J$212,2,FALSE)","v":"KRC"},null,null,"所属",{"$f":"VLOOKUP(U243,結果入力表!$B$2:$J$212,9,FALSE)","v":"NRC"},null,null,null,null,{"$f":"VLOOKUP(AD243,結果入力表!$B$2:$J$212,2,FALSE)","v":"KRC"},null,null,"所属",{"$f":"VLOOKUP(AD243,結果入力表!$B$2:$J$212,9,FALSE)","v":"NRC"},null,null,null,null,{"$f":"VLOOKUP(AM243,結果入力表!$B$2:$J$212,2,FALSE)","v":"KRC"},null,null,"所属",{"$f":"VLOOKUP(AM243,結果入力表!$B$2:$J$212,9,FALSE)","v":"NRC"},null,null,null,null,{"$f":"VLOOKUP(AV243,結果入力表!$B$2:$J$212,2,FALSE)","v":"KRC"},null,null,"所属",{"$f":"VLOOKUP(AV243,結果入力表!$B$2:$J$212,9,FALSE)","v":"NRC"},null,null,null,null,{"$f":"VLOOKUP(BE243,結果入力表!$B$2:$J$212,2,FALSE)","v":"KRC"},null,null,"所属",{"$f":"VLOOKUP(BE243,結果入力表!$B$2:$J$212,9,FALSE)","v":"NRC"}]
[null,{"$f":"VLOOKUP(C243,結果入力表!$B$2:$J$212,3,FALSE)","v":"松好　太一"},null,null,"氏名",{"$f":"VLOOKUP(C243,結果入力表!$B$2:$J$212,8,FALSE)","v":"植田　慎也"},null,null,null,null,{"$f":"VLOOKUP(L243,結果入力表!$B$2:$J$212,3,FALSE)","v":"清水　義晴"},null,null,"氏名",{"$f":"VLOOKUP(L243,結果入力表!$B$2:$J$212,8,FALSE)","v":"近藤　拓馬"},null,null,null,null,{"$f":"VLOOKUP(U243,結果入力表!$B$2:$J$212,3,FALSE)","v":"鈴木　康文"},null,null,"氏名",{"$f":"VLOOKUP(U243,結果入力表!$B$2:$J$212,8,FALSE)","v":"長谷川　進"},null,null,null,null,{"$f":"VLOOKUP(AD243,結果入力表!$B$2:$J$212,3,FALSE)","v":"早川　徹"},null,null,"氏名",{"$f":"VLOOKUP(AD243,結果入力表!$B$2:$J$212,8,FALSE)","v":"白戸　恭子"},null,null,null,null,{"$f":"VLOOKUP(AM243,結果入力表!$B$2:$J$212,3,FALSE)","v":"井関　一成"},null,null,"氏名",{"$f":"VLOOKUP(AM243,結果入力表!$B$2:$J$212,8,FALSE)","v":"吉向　翔平"},null,null,null,null,{"$f":"VLOOKUP(AV243,結果入力表!$B$2:$J$212,3,FALSE)","v":"今村　哲也"},null,null,"氏名",{"$f":"VLOOKUP(AV243,結果入力表!$B$2:$J$212,8,FALSE)","v":"岩本　剛"},null,null,null,null,{"$f":"VLOOKUP(BE243,結果入力表!$B$2:$J$212,3,FALSE)","v":"森田由佳里"},null,null,"氏名",{"$f":"VLOOKUP(BE243,結果入力表!$B$2:$J$212,8,FALSE)","v":"白戸　玲人"}]
[null,null,null,null,"得点",null,null,null,null,null,null,null,null,"得点",null,null,null,null,null,null,null,null,"得点",null,null,null,null,null,null,null,null,"得点",null,null,null,null,null,null,null,null,"得点",null,null,null,null,null,null,null,null,"得点",null,null,null,null,null,null,null,null,"得点"]
[null,null,null,null,"HR",null,null,null,null,null,null,null,null,"HR",null,null,null,null,null,null,null,null,"HR",null,null,null,null,null,null,null,null,"HR",null,null,null,null,null,null,null,null,"HR",null,null,null,null,null,null,null,null,"HR",null,null,null,null,null,null,null,null,"HR"]
[]
[null,null,null,null,null,"レフリー",null,null,null,null,null,null,null,null,"レフリー",null,null,null,null,null,null,null,null,"レフリー",null,null,null,null,null,null,null,null,"レフリー",null,null,null,null,null,null,null,null,"レフリー",null,null,null,null,null,null,null,null,"レフリー",null,null,null,null,null,null,null,null,"レフリー"]
[null,{"$f":"★個人成績表★!$A$1","v":"第31回　京阪神和奈滋対抗戦　　　(奈良；玉出エース)"},null,null,null,null,null,null,null,null,{"$f":"★個人成績表★!$A$1","v":"第31回　京阪神和奈滋対抗戦　　　(奈良；玉出エース)"},null,null,null,null,null,null,null,null,{"$f":"★個人成績表★!$A$1","v":"第31回　京阪神和奈滋対抗戦　　　(奈良；玉出エース)"},null,null,null,null,null,null,null,null,{"$f":"★個人成績表★!$A$1","v":"第31回　京阪神和奈滋対抗戦　　　(奈良；玉出エース)"},null,null,null,null,null,null,null,null,{"$f":"★個人成績表★!$A$1","v":"第31回　京阪神和奈滋対抗戦　　　(奈良；玉出エース)"},null,null,null,null,null,null,null,null,{"$f":"★個人成績表★!$A$1","v":"第31回　京阪神和奈滋対抗戦　　　(奈良；玉出エース)"},null,null,null,null,null,null,null,null,{"$f":"★個人成績表★!$A$1","v":"第31回　京阪神和奈滋対抗戦　　　(奈良；玉出エース)"},null,null,null,null,null,null,null," "]
[]
[null,"G-No",{"$f":"BE243+1","v":169},null,null,"T-No",null,null,null,null,"G-No",{"$f":"C253+1","v":170},null,null,"T-No",null,null,null,null,"G-No",{"$f":"L253+1","v":171},null,null,"T-No",null,null,null,null,"G-No",{"$f":"U253+1","v":172},null,null,"T-No",null,null,null,null,"G-No",{"$f":"AD253+1","v":173},null,null,"T-No",null,null,null,null,"G-No",{"$f":"AM253+1","v":174},null,null,"T-No",null,null,null,null,"G-No",{"$f":"AV253+1","v":175},null,null,"T-No"]
[]
[null,{"$f":"VLOOKUP(C253,結果入力表!$B$2:$J$212,2,FALSE)","v":"ORC"},null,null,"所属",{"$f":"VLOOKUP(C253,結果入力表!$B$2:$J$212,9,FALSE)","v":"WRC"},null,null,null,null,{"$f":"VLOOKUP(L253,結果入力表!$B$2:$J$212,2,FALSE)","v":"ORC"},null,null,"所属",{"$f":"VLOOKUP(L253,結果入力表!$B$2:$J$212,9,FALSE)","v":"WRC"},null,null,null,null,{"$f":"VLOOKUP(U253,結果入力表!$B$2:$J$212,2,FALSE)","v":"ORC"},null,null,"所属",{"$f":"VLOOKUP(U253,結果入力表!$B$2:$J$212,9,FALSE)","v":"WRC"},null,null,null,null,{"$f":"VLOOKUP(AD253,結果入力表!$B$2:$J$212,2,FALSE)","v":"ORC"},null,null,"所属",{"$f":"VLOOKUP(AD253,結果入力表!$B$2:$J$212,9,FALSE)","v":"WRC"},null,null,null,null,{"$f":"VLOOKUP(AM253,結果入力表!$B$2:$J$212,2,FALSE)","v":"ORC"},null,null,"所属",{"$f":"VLOOKUP(AM253,結果入力表!$B$2:$J$212,9,FALSE)","v":"WRC"},null,null,null,null,{"$f":"VLOOKUP(AV253,結果入力表!$B$2:$J$212,2,FALSE)","v":"ORC"},null,null,"所属",{"$f":"VLOOKUP(AV253,結果入力表!$B$2:$J$212,9,FALSE)","v":"WRC"},null,null,null,null,{"$f":"VLOOKUP(BE253,結果入力表!$B$2:$J$212,2,FALSE)","v":"ORC"},null,null,"所属",{"$f":"VLOOKUP(BE253,結果入力表!$B$2:$J$212,9,FALSE)","v":"WRC"}]
[null,{"$f":"VLOOKUP(C253,結果入力表!$B$2:$J$212,3,FALSE)","v":"小原　嘉丈"},null,null,"氏名",{"$f":"VLOOKUP(C253,結果入力表!$B$2:$J$212,8,FALSE)","v":"芝先　泰生"},null,null,null,null,{"$f":"VLOOKUP(L253,結果入力表!$B$2:$J$212,3,FALSE)","v":"乾　伸綱"},null,null,"氏名",{"$f":"VLOOKUP(L253,結果入力表!$B$2:$J$212,8,FALSE)","v":"松房ゆかり"},null,null,null,null,{"$f":"VLOOKUP(U253,結果入力表!$B$2:$J$212,3,FALSE)","v":"山崎真紀子"},null,null,"氏名",{"$f":"VLOOKUP(U253,結果入力表!$B$2:$J$212,8,FALSE)","v":"末岡　修"},null,null,null,null,{"$f":"VLOOKUP(AD253,結果入力表!$B$2:$J$212,3,FALSE)","v":"松居　勝巳"},null,null,"氏名",{"$f":"VLOOKUP(AD253,結果入力表!$B$2:$J$212,8,FALSE)","v":"和田宗一郎"},null,null,null,null,{"$f":"VLOOKUP(AM253,結果入力表!$B$2:$J$212,3,FALSE)","v":"藤明　宏樹"},null,null,"氏名",{"$f":"VLOOKUP(AM253,結果入力表!$B$2:$J$212,8,FALSE)","v":"杉本　博章"},null,null,null,null,{"$f":"VLOOKUP(AV253,結果入力表!$B$2:$J$212,3,FALSE)","v":"吉岡　保俊"},null,null,"氏名",{"$f":"VLOOKUP(AV253,結果入力表!$B$2:$J$212,8,FALSE)","v":"中本　雅大"},null,null,null,null,{"$f":"VLOOKUP(BE253,結果入力表!$B$2:$J$212,3,FALSE)","v":"村上　泰辰"},null,null,"氏名",{"$f":"VLOOKUP(BE253,結果入力表!$B$2:$J$212,8,FALSE)","v":"山中　康介"}]
[null,null,null,null,"得点",null,null,null,null,null,null,null,null,"得点",null,null,null,null,null,null,null,null,"得点",null,null,null,null,null,null,null,null,"得点",null,null,null,null,null,null,null,null,"得点",null,null,null,null,null,null,null,null,"得点",null,null,null,null,null,null,null,null,"得点"]
[null,null,null,null,"HR",null,null,null,null,null,null,null,null,"HR",null,null,null,null,null,null,null,null,"HR",null,null,null,null,null,null,null,null,"HR",null,null,null,null,null,null,null,null,"HR",null,null,null,null,null,null,null,null,"HR",null,null,null,null,null,null,null,null,"HR"]
[]
[null,null,null,null,null,"レフリー",null,null,null,null,null,null,null,null,"レフリー",null,null,null,null,null,null,null,null,"レフリー",null,null,null,null,null,null,null,null,"レフリー",null,null,null,null,null,null,null,null,"レフリー",null,null,null,null,null,null,null,null,"レフリー",null,null,null,null,null,null,null,null,"レフリー"]
[null,{"$f":"★個人成績表★!$A$1","v":"第31回　京阪神和奈滋対抗戦　　　(奈良；玉出エース)"},null,null,null,null,null,null,null,null,{"$f":"★個人成績表★!$A$1","v":"第31回　京阪神和奈滋対抗戦　　　(奈良；玉出エース)"},null,null,null,null,null,null,null,null,{"$f":"★個人成績表★!$A$1","v":"第31回　京阪神和奈滋対抗戦　　　(奈良；玉出エース)"},null,null,null,null,null,null,null,null,{"$f":"★個人成績表★!$A$1","v":"第31回　京阪神和奈滋対抗戦　　　(奈良；玉出エース)"},null,null,null,null,null,null,null,null,{"$f":"★個人成績表★!$A$1","v":"第31回　京阪神和奈滋対抗戦　　　(奈良；玉出エース)"},null,null,null,null,null,null,null,null,{"$f":"★個人成績表★!$A$1","v":"第31回　京阪神和奈滋対抗戦　　　(奈良；玉出エース)"},null,null,null,null,null,null,null,null,{"$f":"★個人成績表★!$A$1","v":"第31回　京阪神和奈滋対抗戦　　　(奈良；玉出エース)"},null,null,null,null,null,null,null," "]
[]
[null,"G-No",{"$f":"BE253+1","v":176},null,null,"T-No",null,null,null,null,"G-No",{"$f":"C263+1","v":177},null,null,"T-No",null,null,null,null,"G-No",{"$f":"L263+1","v":178},null,null,"T-No",null,null,null,null,"G-No",{"$f":"U263+1","v":179},null,null,"T-No",null,null,null,null,"G-No",{"$f":"AD263+1","v":180},null,null,"T-No",null,null,null,null,"G-No",{"$f":"AM263+1","v":181},null,null,"T-No",null,null,null,null,"G-No",{"$f":"AV263+1","v":182},null,null,"T-No"]
[]
[null,{"$f":"VLOOKUP(C263,結果入力表!$B$2:$J$212,2,FALSE)","v":"NRC"},null,null,"所属",{"$f":"VLOOKUP(C263,結果入力表!$B$2:$J$212,9,FALSE)","v":"HRC"},null,null,null,null,{"$f":"VLOOKUP(L263,結果入力表!$B$2:$J$212,2,FALSE)","v":"NRC"},null,null,"所属",{"$f":"VLOOKUP(L263,結果入力表!$B$2:$J$212,9,FALSE)","v":"HRC"},null,null,null,null,{"$f":"VLOOKUP(U263,結果入力表!$B$2:$J$212,2,FALSE)","v":"NRC"},null,null,"所属",{"$f":"VLOOKUP(U263,結果入力表!$B$2:$J$212,9,FALSE)","v":"HRC"},null,null,null,null,{"$f":"VLOOKUP(AD263,結果入力表!$B$2:$J$212,2,FALSE)","v":"NRC"},null,null,"所属",{"$f":"VLOOKUP(AD263,結果入力表!$B$2:$J$212,9,FALSE)","v":"HRC"},null,null,null,null,{"$f":"VLOOKUP(AM263,結果入力表!$B$2:$J$212,2,FALSE)","v":"NRC"},null,null,"所属",{"$f":"VLOOKUP(AM263,結果入力表!$B$2:$J$212,9,FALSE)","v":"HRC"},null,null,null,null,{"$f":"VLOOKUP(AV263,結果入力表!$B$2:$J$212,2,FALSE)","v":"NRC"},null,null,"所属",{"$f":"VLOOKUP(AV263,結果入力表!$B$2:$J$212,9,FALSE)","v":"HRC"},null,null,null,null,{"$f":"VLOOKUP(BE263,結果入力表!$B$2:$J$212,2,FALSE)","v":"NRC"},null,null,"所属",{"$f":"VLOOKUP(BE263,結果入力表!$B$2:$J$212,9,FALSE)","v":"HRC"}]
[null,{"$f":"VLOOKUP(C263,結果入力表!$B$2:$J$212,3,FALSE)","v":"植田　慎也"},null,null,"氏名",{"$f":"VLOOKUP(C263,結果入力表!$B$2:$J$212,8,FALSE)","v":"堂園　雅也"},null,null,null,null,{"$f":"VLOOKUP(L263,結果入力表!$B$2:$J$212,3,FALSE)","v":"近藤　拓馬"},null,null,"氏名",{"$f":"VLOOKUP(L263,結果入力表!$B$2:$J$212,8,FALSE)","v":"宮本　一"},null,null,null,null,{"$f":"VLOOKUP(U263,結果入力表!$B$2:$J$212,3,FALSE)","v":"長谷川　進"},null,null,"氏名",{"$f":"VLOOKUP(U263,結果入力表!$B$2:$J$212,8,FALSE)","v":"伊藤　登"},null,null,null,null,{"$f":"VLOOKUP(AD263,結果入力表!$B$2:$J$212,3,FALSE)","v":"白戸　恭子"},null,null,"氏名",{"$f":"VLOOKUP(AD263,結果入力表!$B$2:$J$212,8,FALSE)","v":"宮井健太郎"},null,null,null,null,{"$f":"VLOOKUP(AM263,結果入力表!$B$2:$J$212,3,FALSE)","v":"吉向　翔平"},null,null,"氏名",{"$f":"VLOOKUP(AM263,結果入力表!$B$2:$J$212,8,FALSE)","v":"白澤雄一郎"},null,null,null,null,{"$f":"VLOOKUP(AV263,結果入力表!$B$2:$J$212,3,FALSE)","v":"岩本　剛"},null,null,"氏名",{"$f":"VLOOKUP(AV263,結果入力表!$B$2:$J$212,8,FALSE)","v":"河地　恵里"},null,null,null,null,{"$f":"VLOOKUP(BE263,結果入力表!$B$2:$J$212,3,FALSE)","v":"白戸　玲人"},null,null,"氏名",{"$f":"VLOOKUP(BE263,結果入力表!$B$2:$J$212,8,FALSE)","v":"鐵山　泰三"}]
[null,null,null,null,"得点",null,null,null,null,null,null,null,null,"得点",null,null,null,null,null,null,null,null,"得点",null,null,null,null,null,null,null,null,"得点",null,null,null,null,null,null,null,null,"得点",null,null,null,null,null,null,null,null,"得点",null,null,null,null,null,null,null,null,"得点"]
[null,null,null,null,"HR",null,null,null,null,null,null,null,null,"HR",null,null,null,null,null,null,null,null,"HR",null,null,null,null,null,null,null,null,"HR",null,null,null,null,null,null,null,null,"HR",null,null,null,null,null,null,null,null,"HR",null,null,null,null,null,null,null,null,"HR"]
[]
[null,null,null,null,null,"レフリー",null,null,null,null,null,null,null,null,"レフリー",null,null,null,null,null,null,null,null,"レフリー",null,null,null,null,null,null,null,null,"レフリー",null,null,null,null,null,null,null,null,"レフリー",null,null,null,null,null,null,null,null,"レフリー",null,null,null,null,null,null,null,null,"レフリー"]
[null,{"$f":"★個人成績表★!$A$1","v":"第31回　京阪神和奈滋対抗戦　　　(奈良；玉出エース)"},null,null,null,null,null,null,null,null,{"$f":"★個人成績表★!$A$1","v":"第31回　京阪神和奈滋対抗戦　　　(奈良；玉出エース)"},null,null,null,null,null,null,null,null,{"$f":"★個人成績表★!$A$1","v":"第31回　京阪神和奈滋対抗戦　　　(奈良；玉出エース)"},null,null,null,null,null,null,null,null,{"$f":"★個人成績表★!$A$1","v":"第31回　京阪神和奈滋対抗戦　　　(奈良；玉出エース)"},null,null,null,null,null,null,null,null,{"$f":"★個人成績表★!$A$1","v":"第31回　京阪神和奈滋対抗戦　　　(奈良；玉出エース)"},null,null,null,null,null,null,null,null,{"$f":"★個人成績表★!$A$1","v":"第31回　京阪神和奈滋対抗戦　　　(奈良；玉出エース)"},null,null,null,null,null,null,null,null,{"$f":"★個人成績表★!$A$1","v":"第31回　京阪神和奈滋対抗戦　　　(奈良；玉出エース)"},null,null,null,null,null,null,null," "]
[]
[null,"G-No",{"$f":"BE263+1","v":183},null,null,"T-No",null,null,null,null,"G-No",{"$f":"C273+1","v":184},null,null,"T-No",null,null,null,null,"G-No",{"$f":"L273+1","v":185},null,null,"T-No",null,null,null,null,"G-No",{"$f":"U273+1","v":186},null,null,"T-No",null,null,null,null,"G-No",{"$f":"AD273+1","v":187},null,null,"T-No",null,null,null,null,"G-No",{"$f":"AM273+1","v":188},null,null,"T-No",null,null,null,null,"G-No",{"$f":"AV273+1","v":189},null,null,"T-No"]
[]
[null,{"$f":"VLOOKUP(C273,結果入力表!$B$2:$J$212,2,FALSE)","v":"KRC"},null,null,"所属",{"$f":"VLOOKUP(C273,結果入力表!$B$2:$J$212,9,FALSE)","v":"SBC"},null,null,null,null,{"$f":"VLOOKUP(L273,結果入力表!$B$2:$J$212,2,FALSE)","v":"KRC"},null,null,"所属",{"$f":"VLOOKUP(L273,結果入力表!$B$2:$J$212,9,FALSE)","v":"SBC"},null,null,null,null,{"$f":"VLOOKUP(U273,結果入力表!$B$2:$J$212,2,FALSE)","v":"KRC"},null,null,"所属",{"$f":"VLOOKUP(U273,結果入力表!$B$2:$J$212,9,FALSE)","v":"SBC"},null,null,null,null,{"$f":"VLOOKUP(AD273,結果入力表!$B$2:$J$212,2,FALSE)","v":"KRC"},null,null,"所属",{"$f":"VLOOKUP(AD273,結果入力表!$B$2:$J$212,9,FALSE)","v":"SBC"},null,null,null,null,{"$f":"VLOOKUP(AM273,結果入力表!$B$2:$J$212,2,FALSE)","v":"KRC"},null,null,"所属",{"$f":"VLOOKUP(AM273,結果入力表!$B$2:$J$212,9,FALSE)","v":"SBC"},null,null,null,null,{"$f":"VLOOKUP(AV273,結果入力表!$B$2:$J$212,2,FALSE)","v":"KRC"},null,null,"所属",{"$f":"VLOOKUP(AV273,結果入力表!$B$2:$J$212,9,FALSE)","v":"SBC"},null,null,null,null,{"$f":"VLOOKUP(BE273,結果入力表!$B$2:$J$212,2,FALSE)","v":"KRC"},null,null,"所属",{"$f":"VLOOKUP(BE273,結果入力表!$B$2:$J$212,9,FALSE)","v":"SBC"}]
[null,{"$f":"VLOOKUP(C273,結果入力表!$B$2:$J$212,3,FALSE)","v":"松好　太一"},null,null,"氏名",{"$f":"VLOOKUP(C273,結果入力表!$B$2:$J$212,8,FALSE)","v":"山中　康寛"},null,null,null,null,{"$f":"VLOOKUP(L273,結果入力表!$B$2:$J$212,3,FALSE)","v":"清水　義晴"},null,null,"氏名",{"$f":"VLOOKUP(L273,結果入力表!$B$2:$J$212,8,FALSE)","v":"西峰　久祐"},null,null,null,null,{"$f":"VLOOKUP(U273,結果入力表!$B$2:$J$212,3,FALSE)","v":"鈴木　康文"},null,null,"氏名",{"$f":"VLOOKUP(U273,結果入力表!$B$2:$J$212,8,FALSE)","v":"大橋　正寛"},null,null,null,null,{"$f":"VLOOKUP(AD273,結果入力表!$B$2:$J$212,3,FALSE)","v":"早川　徹"},null,null,"氏名",{"$f":"VLOOKUP(AD273,結果入力表!$B$2:$J$212,8,FALSE)","v":"秋田　倫央"},null,null,null,null,{"$f":"VLOOKUP(AM273,結果入力表!$B$2:$J$212,3,FALSE)","v":"井関　一成"},null,null,"氏名",{"$f":"VLOOKUP(AM273,結果入力表!$B$2:$J$212,8,FALSE)","v":"大橋　洋子"},null,null,null,null,{"$f":"VLOOKUP(AV273,結果入力表!$B$2:$J$212,3,FALSE)","v":"今村　哲也"},null,null,"氏名",{"$f":"VLOOKUP(AV273,結果入力表!$B$2:$J$212,8,FALSE)","v":"林　秀忠"},null,null,null,null,{"$f":"VLOOKUP(BE273,結果入力表!$B$2:$J$212,3,FALSE)","v":"森田由佳里"},null,null,"氏名",{"$f":"VLOOKUP(BE273,結果入力表!$B$2:$J$212,8,FALSE)","v":"大橋　義治"}]
[null,null,null,null,"得点",null,null,null,null,null,null,null,null,"得点",null,null,null,null,null,null,null,null,"得点",null,null,null,null,null,null,null,null,"得点",null,null,null,null,null,null,null,null,"得点",null,null,null,null,null,null,null,null,"得点",null,null,null,null,null,null,null,null,"得点"]
[null,null,null,null,"HR",null,null,null,null,null,null,null,null,"HR",null,null,null,null,null,null,null,null,"HR",null,null,null,null,null,null,null,null,"HR",null,null,null,null,null,null,null,null,"HR",null,null,null,null,null,null,null,null,"HR",null,null,null,null,null,null,null,null,"HR"]
[]
[null,null,null,null,null,"レフリー",null,null,null,null,null,null,null,null,"レフリー",null,null,null,null,null,null,null,null,"レフリー",null,null,null,null,null,null,null,null,"レフリー",null,null,null,null,null,null,null,null,"レフリー",null,null,null,null,null,null,null,null,"レフリー",null,null,null,null,null,null,null,null,"レフリー"]
[null,{"$f":"★個人成績表★!$A$1","v":"第31回　京阪神和奈滋対抗戦　　　(奈良；玉出エース)"},null,null,null,null,null,null,null,null,{"$f":"★個人成績表★!$A$1","v":"第31回　京阪神和奈滋対抗戦　　　(奈良；玉出エース)"},null,null,null,null,null,null,null,null,{"$f":"★個人成績表★!$A$1","v":"第31回　京阪神和奈滋対抗戦　　　(奈良；玉出エース)"},null,null,null,null,null,null,null,null,{"$f":"★個人成績表★!$A$1","v":"第31回　京阪神和奈滋対抗戦　　　(奈良；玉出エース)"},null,null,null,null,null,null,null,null,{"$f":"★個人成績表★!$A$1","v":"第31回　京阪神和奈滋対抗戦　　　(奈良；玉出エース)"},null,null,null,null,null,null,null,null,{"$f":"★個人成績表★!$A$1","v":"第31回　京阪神和奈滋対抗戦　　　(奈良；玉出エース)"},null,null,null,null,null,null,null,null,{"$f":"★個人成績表★!$A$1","v":"第31回　京阪神和奈滋対抗戦　　　(奈良；玉出エース)"},null,null,null,null,null,null,null," "]
[]
[null,"G-No",{"$f":"BE273+1","v":190},null,null,"T-No",null,null,null,null,"G-No",{"$f":"C283+1","v":191},null,null,"T-No",null,null,null,null,"G-No",{"$f":"L283+1","v":192},null,null,"T-No",null,null,null,null,"G-No",{"$f":"U283+1","v":193},null,null,"T-No",null,null,null,null,"G-No",{"$f":"AD283+1","v":194},null,null,"T-No",null,null,null,null,"G-No",{"$f":"AM283+1","v":195},null,null,"T-No",null,null,null,null,"G-No",{"$f":"AV283+1","v":196},null,null,"T-No"]
[]
[null,{"$f":"VLOOKUP(C283,結果入力表!$B$2:$J$212,2,FALSE)","v":"NRC"},null,null,"所属",{"$f":"VLOOKUP(C283,結果入力表!$B$2:$J$212,9,FALSE)","v":"ORC"},null,null,null,null,{"$f":"VLOOKUP(L283,結果入力表!$B$2:$J$212,2,FALSE)","v":"NRC"},null,null,"所属",{"$f":"VLOOKUP(L283,結果入力表!$B$2:$J$212,9,FALSE)","v":"ORC"},null,null,null,null,{"$f":"VLOOKUP(U283,結果入力表!$B$2:$J$212,2,FALSE)","v":"NRC"},null,null,"所属",{"$f":"VLOOKUP(U283,結果入力表!$B$2:$J$212,9,FALSE)","v":"ORC"},null,null,null,null,{"$f":"VLOOKUP(AD283,結果入力表!$B$2:$J$212,2,FALSE)","v":"NRC"},null,null,"所属",{"$f":"VLOOKUP(AD283,結果入力表!$B$2:$J$212,9,FALSE)","v":"ORC"},null,null,null,null,{"$f":"VLOOKUP(AM283,結果入力表!$B$2:$J$212,2,FALSE)","v":"NRC"},null,null,"所属",{"$f":"VLOOKUP(AM283,結果入力表!$B$2:$J$212,9,FALSE)","v":"ORC"},null,null,null,null,{"$f":"VLOOKUP(AV283,結果入力表!$B$2:$J$212,2,FALSE)","v":"NRC"},null,null,"所属",{"$f":"VLOOKUP(AV283,結果入力表!$B$2:$J$212,9,FALSE)","v":"ORC"},null,null,null,null,{"$f":"VLOOKUP(BE283,結果入力表!$B$2:$J$212,2,FALSE)","v":"NRC"},null,null,"所属",{"$f":"VLOOKUP(BE283,結果入力表!$B$2:$J$212,9,FALSE)","v":"ORC"}]
[null,{"$f":"VLOOKUP(C283,結果入力表!$B$2:$J$212,3,FALSE)","v":"植田　慎也"},null,null,"氏名",{"$f":"VLOOKUP(C283,結果入力表!$B$2:$J$212,8,FALSE)","v":"小原　嘉丈"},null,null,null,null,{"$f":"VLOOKUP(L283,結果入力表!$B$2:$J$212,3,FALSE)","v":"近藤　拓馬"},null,null,"氏名",{"$f":"VLOOKUP(L283,結果入力表!$B$2:$J$212,8,FALSE)","v":"乾　伸綱"},null,null,null,null,{"$f":"VLOOKUP(U283,結果入力表!$B$2:$J$212,3,FALSE)","v":"長谷川　進"},null,null,"氏名",{"$f":"VLOOKUP(U283,結果入力表!$B$2:$J$212,8,FALSE)","v":"山崎真紀子"},null,null,null,null,{"$f":"VLOOKUP(AD283,結果入力表!$B$2:$J$212,3,FALSE)","v":"白戸　恭子"},null,null,"氏名",{"$f":"VLOOKUP(AD283,結果入力表!$B$2:$J$212,8,FALSE)","v":"松居　勝巳"},null,null,null,null,{"$f":"VLOOKUP(AM283,結果入力表!$B$2:$J$212,3,FALSE)","v":"吉向　翔平"},null,null,"氏名",{"$f":"VLOOKUP(AM283,結果入力表!$B$2:$J$212,8,FALSE)","v":"藤明　宏樹"},null,null,null,null,{"$f":"VLOOKUP(AV283,結果入力表!$B$2:$J$212,3,FALSE)","v":"岩本　剛"},null,null,"氏名",{"$f":"VLOOKUP(AV283,結果入力表!$B$2:$J$212,8,FALSE)","v":"吉岡　保俊"},null,null,null,null,{"$f":"VLOOKUP(BE283,結果入力表!$B$2:$J$212,3,FALSE)","v":"白戸　玲人"},null,null,"氏名",{"$f":"VLOOKUP(BE283,結果入力表!$B$2:$J$212,8,FALSE)","v":"村上　泰辰"}]
[null,null,null,null,"得点",null,null,null,null,null,null,null,null,"得点",null,null,null,null,null,null,null,null,"得点",null,null,null,null,null,null,null,null,"得点",null,null,null,null,null,null,null,null,"得点",null,null,null,null,null,null,null,null,"得点",null,null,null,null,null,null,null,null,"得点"]
[null,null,null,null,"HR",null,null,null,null,null,null,null,null,"HR",null,null,null,null,null,null,null,null,"HR",null,null,null,null,null,null,null,null,"HR",null,null,null,null,null,null,null,null,"HR",null,null,null,null,null,null,null,null,"HR",null,null,null,null,null,null,null,null,"HR"]
[]
[null,null,null,null,null,"レフリー",null,null,null,null,null,null,null,null,"レフリー",null,null,null,null,null,null,null,null,"レフリー",null,null,null,null,null,null,null,null,"レフリー",null,null,null,null,null,null,null,null,"レフリー",null,null,null,null,null,null,null,null,"レフリー",null,null,null,null,null,null,null,null,"レフリー"]
[null,{"$f":"★個人成績表★!$A$1","v":"第31回　京阪神和奈滋対抗戦　　　(奈良；玉出エース)"},null,null,null,null,null,null,null,null,{"$f":"★個人成績表★!$A$1","v":"第31回　京阪神和奈滋対抗戦　　　(奈良；玉出エース)"},null,null,null,null,null,null,null,null,{"$f":"★個人成績表★!$A$1","v":"第31回　京阪神和奈滋対抗戦　　　(奈良；玉出エース)"},null,null,null,null,null,null,null,null,{"$f":"★個人成績表★!$A$1","v":"第31回　京阪神和奈滋対抗戦　　　(奈良；玉出エース)"},null,null,null,null,null,null,null,null,{"$f":"★個人成績表★!$A$1","v":"第31回　京阪神和奈滋対抗戦　　　(奈良；玉出エース)"},null,null,null,null,null,null,null,null,{"$f":"★個人成績表★!$A$1","v":"第31回　京阪神和奈滋対抗戦　　　(奈良；玉出エース)"},null,null,null,null,null,null,null,null,{"$f":"★個人成績表★!$A$1","v":"第31回　京阪神和奈滋対抗戦　　　(奈良；玉出エース)"},null,null,null,null,null,null,null," "]
[]
[null,"G-No",{"$f":"BE283+1","v":197},null,null,"T-No",null,null,null,null,"G-No",{"$f":"C293+1","v":198},null,null,"T-No",null,null,null,null,"G-No",{"$f":"L293+1","v":199},null,null,"T-No",null,null,null,null,"G-No",{"$f":"U293+1","v":200},null,null,"T-No",null,null,null,null,"G-No",{"$f":"AD293+1","v":201},null,null,"T-No",null,null,null,null,"G-No",{"$f":"AM293+1","v":202},null,null,"T-No",null,null,null,null,"G-No",{"$f":"AV293+1","v":203},null,null,"T-No"]
[]
[null,{"$f":"VLOOKUP(C293,結果入力表!$B$2:$J$212,2,FALSE)","v":"SBC"},null,null,"所属",{"$f":"VLOOKUP(C293,結果入力表!$B$2:$J$212,9,FALSE)","v":"WRC"},null,null,null,null,{"$f":"VLOOKUP(L293,結果入力表!$B$2:$J$212,2,FALSE)","v":"SBC"},null,null,"所属",{"$f":"VLOOKUP(L293,結果入力表!$B$2:$J$212,9,FALSE)","v":"WRC"},null,null,null,null,{"$f":"VLOOKUP(U293,結果入力表!$B$2:$J$212,2,FALSE)","v":"SBC"},null,null,"所属",{"$f":"VLOOKUP(U293,結果入力表!$B$2:$J$212,9,FALSE)","v":"WRC"},null,null,null,null,{"$f":"VLOOKUP(AD293,結果入力表!$B$2:$J$212,2,FALSE)","v":"SBC"},null,null,"所属",{"$f":"VLOOKUP(AD293,結果入力表!$B$2:$J$212,9,FALSE)","v":"WRC"},null,null,null,null,{"$f":"VLOOKUP(AM293,結果入力表!$B$2:$J$212,2,FALSE)","v":"SBC"},null,null,"所属",{"$f":"VLOOKUP(AM293,結果入力表!$B$2:$J$212,9,FALSE)","v":"WRC"},null,null,null,null,{"$f":"VLOOKUP(AV293,結果入力表!$B$2:$J$212,2,FALSE)","v":"SBC"},null,null,"所属",{"$f":"VLOOKUP(AV293,結果入力表!$B$2:$J$212,9,FALSE)","v":"WRC"},null,null,null,null,{"$f":"VLOOKUP(BE293,結果入力表!$B$2:$J$212,2,FALSE)","v":"SBC"},null,null,"所属",{"$f":"VLOOKUP(BE293,結果入力表!$B$2:$J$212,9,FALSE)","v":"WRC"}]
[null,{"$f":"VLOOKUP(C293,結果入力表!$B$2:$J$212,3,FALSE)","v":"山中　康寛"},null,null,"氏名",{"$f":"VLOOKUP(C293,結果入力表!$B$2:$J$212,8,FALSE)","v":"芝先　泰生"},null,null,null,null,{"$f":"VLOOKUP(L293,結果入力表!$B$2:$J$212,3,FALSE)","v":"西峰　久祐"},null,null,"氏名",{"$f":"VLOOKUP(L293,結果入力表!$B$2:$J$212,8,FALSE)","v":"松房ゆかり"},null,null,null,null,{"$f":"VLOOKUP(U293,結果入力表!$B$2:$J$212,3,FALSE)","v":"大橋　正寛"},null,null,"氏名",{"$f":"VLOOKUP(U293,結果入力表!$B$2:$J$212,8,FALSE)","v":"末岡　修"},null,null,null,null,{"$f":"VLOOKUP(AD293,結果入力表!$B$2:$J$212,3,FALSE)","v":"秋田　倫央"},null,null,"氏名",{"$f":"VLOOKUP(AD293,結果入力表!$B$2:$J$212,8,FALSE)","v":"和田宗一郎"},null,null,null,null,{"$f":"VLOOKUP(AM293,結果入力表!$B$2:$J$212,3,FALSE)","v":"大橋　洋子"},null,null,"氏名",{"$f":"VLOOKUP(AM293,結果入力表!$B$2:$J$212,8,FALSE)","v":"杉本　博章"},null,null,null,null,{"$f":"VLOOKUP(AV293,結果入力表!$B$2:$J$212,3,FALSE)","v":"林　秀忠"},null,null,"氏名",{"$f":"VLOOKUP(AV293,結果入力表!$B$2:$J$212,8,FALSE)","v":"中本　雅大"},null,null,null,null,{"$f":"VLOOKUP(BE293,結果入力表!$B$2:$J$212,3,FALSE)","v":"大橋　義治"},null,null,"氏名",{"$f":"VLOOKUP(BE293,結果入力表!$B$2:$J$212,8,FALSE)","v":"山中　康介"}]
[null,null,null,null,"得点",null,null,null,null,null,null,null,null,"得点",null,null,null,null,null,null,null,null,"得点",null,null,null,null,null,null,null,null,"得点",null,null,null,null,null,null,null,null,"得点",null,null,null,null,null,null,null,null,"得点",null,null,null,null,null,null,null,null,"得点"]
[null,null,null,null,"HR",null,null,null,null,null,null,null,null,"HR",null,null,null,null,null,null,null,null,"HR",null,null,null,null,null,null,null,null,"HR",null,null,null,null,null,null,null,null,"HR",null,null,null,null,null,null,null,null,"HR",null,null,null,null,null,null,null,null,"HR"]
[]
[null,null,null,null,null,"レフリー",null,null,null,null,null,null,null,null,"レフリー",null,null,null,null,null,null,null,null,"レフリー",null,null,null,null,null,null,null,null,"レフリー",null,null,null,null,null,null,null,null,"レフリー",null,null,null,null,null,null,null,null,"レフリー",null,null,null,null,null,null,null,null,"レフリー"]
[null,{"$f":"★個人成績表★!$A$1","v":"第31回　京阪神和奈滋対抗戦　　　(奈良；玉出エース)"},null,null,null,null,null,null,null,null,{"$f":"★個人成績表★!$A$1","v":"第31回　京阪神和奈滋対抗戦　　　(奈良；玉出エース)"},null,null,null,null,null,null,null,null,{"$f":"★個人成績表★!$A$1","v":"第31回　京阪神和奈滋対抗戦　　　(奈良；玉出エース)"},null,null,null,null,null,null,null,null,{"$f":"★個人成績表★!$A$1","v":"第31回　京阪神和奈滋対抗戦　　　(奈良；玉出エース)"},null,null,null,null,null,null,null,null,{"$f":"★個人成績表★!$A$1","v":"第31回　京阪神和奈滋対抗戦　　　(奈良；玉出エース)"},null,null,null,null,null,null,null,null,{"$f":"★個人成績表★!$A$1","v":"第31回　京阪神和奈滋対抗戦　　　(奈良；玉出エース)"},null,null,null,null,null,null,null,null,{"$f":"★個人成績表★!$A$1","v":"第31回　京阪神和奈滋対抗戦　　　(奈良；玉出エース)"},null,null,null,null,null,null,null," "]
[]
[null,"G-No",{"$f":"BE293+1","v":204},null,null,"T-No",null,null,null,null,"G-No",{"$f":"C303+1","v":205},null,null,"T-No",null,null,null,null,"G-No",{"$f":"L303+1","v":206},null,null,"T-No",null,null,null,null,"G-No",{"$f":"U303+1","v":207},null,null,"T-No",null,null,null,null,"G-No",{"$f":"AD303+1","v":208},null,null,"T-No",null,null,null,null,"G-No",{"$f":"AM303+1","v":209},null,null,"T-No",null,null,null,null,"G-No",{"$f":"AV303+1","v":210},null,null,"T-No"]
[]
[null,{"$f":"VLOOKUP(C303,結果入力表!$B$2:$J$212,2,FALSE)","v":"KRC"},null,null,"所属",{"$f":"VLOOKUP(C303,結果入力表!$B$2:$J$212,9,FALSE)","v":"HRC"},null,null,null,null,{"$f":"VLOOKUP(L303,結果入力表!$B$2:$J$212,2,FALSE)","v":"KRC"},null,null,"所属",{"$f":"VLOOKUP(L303,結果入力表!$B$2:$J$212,9,FALSE)","v":"HRC"},null,null,null,null,{"$f":"VLOOKUP(U303,結果入力表!$B$2:$J$212,2,FALSE)","v":"KRC"},null,null,"所属",{"$f":"VLOOKUP(U303,結果入力表!$B$2:$J$212,9,FALSE)","v":"HRC"},null,null,null,null,{"$f":"VLOOKUP(AD303,結果入力表!$B$2:$J$212,2,FALSE)","v":"KRC"},null,null,"所属",{"$f":"VLOOKUP(AD303,結果入力表!$B$2:$J$212,9,FALSE)","v":"HRC"},null,null,null,null,{"$f":"VLOOKUP(AM303,結果入力表!$B$2:$J$212,2,FALSE)","v":"KRC"},null,null,"所属",{"$f":"VLOOKUP(AM303,結果入力表!$B$2:$J$212,9,FALSE)","v":"HRC"},null,null,null,null,{"$f":"VLOOKUP(AV303,結果入力表!$B$2:$J$212,2,FALSE)","v":"KRC"},null,null,"所属",{"$f":"VLOOKUP(AV303,結果入力表!$B$2:$J$212,9,FALSE)","v":"HRC"},null,null,null,null,{"$f":"VLOOKUP(BE303,結果入力表!$B$2:$J$212,2,FALSE)","v":"KRC"},null,null,"所属",{"$f":"VLOOKUP(BE303,結果入力表!$B$2:$J$212,9,FALSE)","v":"HRC"}]
[null,{"$f":"VLOOKUP(C303,結果入力表!$B$2:$J$212,3,FALSE)","v":"松好　太一"},null,null,"氏名",{"$f":"VLOOKUP(C303,結果入力表!$B$2:$J$212,8,FALSE)","v":"堂園　雅也"},null,null,null,null,{"$f":"VLOOKUP(L303,結果入力表!$B$2:$J$212,3,FALSE)","v":"清水　義晴"},null,null,"氏名",{"$f":"VLOOKUP(L303,結果入力表!$B$2:$J$212,8,FALSE)","v":"宮本　一"},null,null,null,null,{"$f":"VLOOKUP(U303,結果入力表!$B$2:$J$212,3,FALSE)","v":"鈴木　康文"},null,null,"氏名",{"$f":"VLOOKUP(U303,結果入力表!$B$2:$J$212,8,FALSE)","v":"伊藤　登"},null,null,null,null,{"$f":"VLOOKUP(AD303,結果入力表!$B$2:$J$212,3,FALSE)","v":"早川　徹"},null,null,"氏名",{"$f":"VLOOKUP(AD303,結果入力表!$B$2:$J$212,8,FALSE)","v":"宮井健太郎"},null,null,null,null,{"$f":"VLOOKUP(AM303,結果入力表!$B$2:$J$212,3,FALSE)","v":"井関　一成"},null,null,"氏名",{"$f":"VLOOKUP(AM303,結果入力表!$B$2:$J$212,8,FALSE)","v":"白澤雄一郎"},null,null,null,null,{"$f":"VLOOKUP(AV303,結果入力表!$B$2:$J$212,3,FALSE)","v":"今村　哲也"},null,null,"氏名",{"$f":"VLOOKUP(AV303,結果入力表!$B$2:$J$212,8,FALSE)","v":"河地　恵里"},null,null,null,null,{"$f":"VLOOKUP(BE303,結果入力表!$B$2:$J$212,3,FALSE)","v":"森田由佳里"},null,null,"氏名",{"$f":"VLOOKUP(BE303,結果入力表!$B$2:$J$212,8,FALSE)","v":"鐵山　泰三"}]
[null,null,null,null,"得点",null,null,null,null,null,null,null,null,"得点",null,null,null,null,null,null,null,null,"得点",null,null,null,null,null,null,null,null,"得点",null,null,null,null,null,null,null,null,"得点",null,null,null,null,null,null,null,null,"得点",null,null,null,null,null,null,null,null,"得点"]
[null,null,null,null,"HR",null,null,null,null,null,null,null,null,"HR",null,null,null,null,null,null,null,null,"HR",null,null,null,null,null,null,null,null,"HR",null,null,null,null,null,null,null,null,"HR",null,null,null,null,null,null,null,null,"HR",null,null,null,null,null,null,null,null,"HR"]
[]
[null,null,null,null,null,"レフリー",null,null,null,null,null,null,null,null,"レフリー",null,null,null,null,null,null,null,null,"レフリー",null,null,null,null,null,null,null,null,"レフリー",null,null,null,null,null,null,null,null,"レフリー",null,null,null,null,null,null,null,null,"レフリー",null,null,null,null,null,null,null,null,"レフリー"]

{"sheet":"★個人成績表★","index":2,"n_rows":59,"n_cols":36,"rows_kept":59,"cut":false,"hidden":false,"merged":[[48,0,56,0],[39,0,47,0],[3,0,11,0],[12,0,20,0],[21,0,29,0],[30,0,38,0]]}
[{"$f":"登録!E1&登録!F1&登録!G1&\"　\"&登録!I1&登録!M1&\"　　　\"&\"(\"&登録!I5&\"；\"&登録!E5&\")\"","v":"第31回　京阪神和奈滋対抗戦　　　(奈良；玉出エース)"}]
[]
[null,null,null,"1st　Section",null,null,null,null,"2nd　Section",null,null,null,null,"RESULT",null,null,null,null,null,"R","MAX",null,null,"途中経過"]
[{"$f":"IF(登録!B17=\"\",\"\",登録!B17)","v":"KRC"},"Player＼VS","持点",{"$f":"登録!BI3","v":"WRC"},{"$f":"登録!BJ3","v":"ORC"},{"$f":"登録!BK3","v":"NRC"},{"$f":"登録!BL3","v":"SBC"},{"$f":"登録!BM3","v":"HRC"},{"$f":"D4","v":"WRC"},{"$f":"E4","v":"ORC"},{"$f":"F4","v":"NRC"},{"$f":"G4","v":"SBC"},{"$f":"H4","v":"HRC"},"W","L","TP","(TP)","TP",null,"K","HR",null,"Player","W","L","TP","R_P"]
[null,{"$f":"IF(登録!AG2=0,\"\",登録!AG2)","v":"松好　太一"},{"$f":"登録!F17","v":120},{"$f":"IF(結果入力表!F16=\"\",\"\",結果入力表!F16)","v":"w"},{"$f":"IF(結果入力表!F37=\"\",\"\",結果入力表!F37)","v":105},{"$f":"IF(結果入力表!F58=\"\",\"\",結果入力表!F58)","v":83},{"$f":"IF(結果入力表!F79=\"\",\"\",結果入力表!F79)","v":83},{"$f":"IF(結果入力表!F100=\"\",\"\",結果入力表!F100)","v":"w"},{"$f":"IF(結果入力表!F121=\"\",\"\",結果入力表!F121)","v":97},{"$f":"IF(結果入力表!F142=\"\",\"\",結果入力表!F142)","v":57},{"$f":"IF(結果入力表!F163=\"\",\"\",結果入力表!F163)","v":"w"},{"$f":"IF(結果入力表!F184=\"\",\"\",結果入力表!F184)","v":"w"},{"$f":"IF(結果入力表!F205=\"\",\"\",結果入力表!F205)","v":"w"},{"$f":"IF(COUNTBLANK(D5:M5)=10,\"\",COUNTIF(D5:M5,\"w\"))","v":5},{"$f":"IF(COUNTBLANK(D5:M5)=10,\"\",10-COUNTBLANK(D5:M5)-N5)","v":5},{"$f":"IF(N5=\"\",\"\",N5*C5+SUM(D5:M5))","v":1025},{"$f":"IF(N5=\"\",\"\",IF(C5=登録!$I$8,P5,N5*登録!$I$8+SUM(D5:M5)/★個人成績表★!C5*登録!$I$8))","v":1025},{"$f":"IF(P5=Q5,\"\",\"*\")","v":""},{"$f":"IF(COUNTBLANK(D5:M5)=10,\"\",Q5)","v":1025},{"$f":"IF(COUNTBLANK(D5:M5)=10,\"\",RANK(AA5,$AA5:$AA11))","v":3},{"$f":"IF(★対戦リーグ表★!BS6=0,\"\",★対戦リーグ表★!BS6)","v":""},null,{"$f":"B5","v":"松好　太一"},{"$f":"N5","v":5},{"$f":"O5","v":5},{"$f":"Q5","v":1025},{"$f":"X5*1000000+Z5","v":5001025}]
[null,{"$f":"IF(登録!AG3=0,\"\",登録!AG3)","v":"清水　義晴"},{"$f":"登録!I17","v":120},{"$f":"IF(結果入力表!F17=\"\",\"\",結果入力表!F17)","v":"w"},{"$f":"IF(結果入力表!F38=\"\",\"\",結果入力表!F38)","v":"w"},{"$f":"IF(結果入力表!F59=\"\",\"\",結果入力表!F59)","v":58},{"$f":"IF(結果入力表!F80=\"\",\"\",結果入力表!F80)","v":22},{"$f":"IF(結果入力表!F101=\"\",\"\",結果入力表!F101)","v":"w"},{"$f":"IF(結果入力表!F122=\"\",\"\",結果入力表!F122)","v":5},{"$f":"IF(結果入力表!F143=\"\",\"\",結果入力表!F143)","v":108},{"$f":"IF(結果入力表!F164=\"\",\"\",結果入力表!F164)","v":"w"},{"$f":"IF(結果入力表!F185=\"\",\"\",結果入力表!F185)","v":"w"},{"$f":"IF(結果入力表!F206=\"\",\"\",結果入力表!F206)","v":117},{"$f":"IF(COUNTBLANK(D6:M6)=10,\"\",COUNTIF(D6:M6,\"w\"))","v":5},{"$f":"IF(COUNTBLANK(D6:M6)=10,\"\",10-COUNTBLANK(D6:M6)-N6)","v":5},{"$f":"IF(N6=\"\",\"\",N6*C6+SUM(D6:M6))","v":910},{"$f":"IF(N6=\"\",\"\",IF(C6=登録!$I$8,P6,N6*登録!$I$8+SUM(D6:M6)/★個人成績表★!C6*登録!$I$8))","v":910},{"$f":"IF(P6=Q6,\"\",\"*\")","v":""},{"$f":"IF(COUNTBLANK(D6:M6)=10,\"\",Q6)","v":910},{"$f":"IF(COUNTBLANK(D6:M6)=10,\"\",RANK(AA6,$AA5:$AA11))","v":4},{"$f":"IF(★対戦リーグ表★!BS7=0,\"\",★対戦リーグ表★!BS7)","v":""},null,{"$f":"B6","v":"清水　義晴"},{"$f":"N6","v":5},{"$f":"O6","v":5},{"$f":"Q6","v":910},{"$f":"X6*1000000+Z6","v":5000910}]
[null,{"$f":"IF(登録!AG4=0,\"\",登録!AG4)","v":"鈴木　康文"},{"$f":"登録!L17","v":120},{"$f":"IF(結果入力表!F18=\"\",\"\",結果入力表!F18)","v":"w"},{"$f":"IF(結果入力表!F39=\"\",\"\",結果入力表!F39)","v":"w"},{"$f":"IF(結果入力表!F60=\"\",\"\",結果入力表!F60)","v":"w"},{"$f":"IF(結果入力表!F81=\"\",\"\",結果入力表!F81)","v":"w"},{"$f":"IF(結果入力表!F102=\"\",\"\",結果入力表!F102)","v":2},{"$f":"IF(結果入力表!F123=\"\",\"\",結果入力表!F123)","v":"w"},{"$f":"IF(結果入力表!F144=\"\",\"\",結果入力表!F144)","v":"w"},{"$f":"IF(結果入力表!F165=\"\",\"\",結果入力表!F165)","v":119},{"$f":"IF(結果入力表!F186=\"\",\"\",結果入力表!F186)","v":"w"},{"$f":"IF(結果入力表!F207=\"\",\"\",結果入力表!F207)","v":53},7,3,1014,{"$f":"IF(N7=\"\",\"\",IF(C7=登録!$I$8,P7,N7*登録!$I$8+SUM(D7:M7)/★個人成績表★!C7*登録!$I$8))","v":1014},"",1014,{"$f":"IF(COUNTBLANK(D7:M7)=10,\"\",RANK(AA7,$AA5:$AA11))","v":2},{"$f":"IF(★対戦リーグ表★!BS8=0,\"\",★対戦リーグ表★!BS8)","v":107},null,"鈴木　康文",7,3,1014,7001014]
[null,{"$f":"IF(登録!AG5=0,\"\",登録!AG5)","v":"早川　徹"},{"$f":"登録!O17","v":120},{"$f":"IF(結果入力表!F19=\"\",\"\",結果入力表!F19)","v":"w"},{"$f":"IF(結果入力表!F40=\"\",\"\",結果入力表!F40)","v":"w"},{"$f":"IF(結果入力表!F61=\"\",\"\",結果入力表!F61)","v":"w"},{"$f":"IF(結果入力表!F82=\"\",\"\",結果入力表!F82)","v":"w"},{"$f":"IF(結果入力表!F103=\"\",\"\",結果入力表!F103)","v":"w"},{"$f":"IF(結果入力表!F124=\"\",\"\",結果入力表!F124)","v":"w"},{"$f":"IF(結果入力表!F145=\"\",\"\",結果入力表!F145)","v":38},{"$f":"IF(結果入力表!F166=\"\",\"\",結果入力表!F166)","v":"w"},{"$f":"IF(結果入力表!F187=\"\",\"\",結果入力表!F187)","v":"w"},{"$f":"IF(結果入力表!F208=\"\",\"\",結果入力表!F208)","v":"w"},9,1,1118,{"$f":"IF(N8=\"\",\"\",IF(C8=登録!$I$8,P8,N8*登録!$I$8+SUM(D8:M8)/★個人成績表★!C8*登録!$I$8))","v":1118},"",1118,{"$f":"IF(COUNTBLANK(D8:M8)=10,\"\",RANK(AA8,$AA5:$AA11))","v":1},{"$f":"IF(★対戦リーグ表★!BS9=0,\"\",★対戦リーグ表★!BS9)","v":""},null,"早川　徹",9,1,1118,9001118]
[null,{"$f":"IF(登録!AG6=0,\"\",登録!AG6)","v":"井関　一成"},{"$f":"登録!R17","v":120},{"$f":"IF(結果入力表!F20=\"\",\"\",結果入力表!F20)","v":96},{"$f":"IF(結果入力表!F41=\"\",\"\",結果入力表!F41)","v":"w"},{"$f":"IF(結果入力表!F62=\"\",\"\",結果入力表!F62)","v":102},{"$f":"IF(結果入力表!F83=\"\",\"\",結果入力表!F83)","v":50},{"$f":"IF(結果入力表!F104=\"\",\"\",結果入力表!F104)","v":"w"},{"$f":"IF(結果入力表!F125=\"\",\"\",結果入力表!F125)","v":119},{"$f":"IF(結果入力表!F146=\"\",\"\",結果入力表!F146)","v":63},{"$f":"IF(結果入力表!F167=\"\",\"\",結果入力表!F167)","v":76},{"$f":"IF(結果入力表!F188=\"\",\"\",結果入力表!F188)","v":"w"},{"$f":"IF(結果入力表!F209=\"\",\"\",結果入力表!F209)","v":99},3,7,965,{"$f":"IF(N9=\"\",\"\",IF(C9=登録!$I$8,P9,N9*登録!$I$8+SUM(D9:M9)/★個人成績表★!C9*登録!$I$8))","v":965},"",965,{"$f":"IF(COUNTBLANK(D9:M9)=10,\"\",RANK(AA9,$AA5:$AA11))","v":7},{"$f":"IF(★対戦リーグ表★!BS10=0,\"\",★対戦リーグ表★!BS10)","v":""},null,"井関　一成",3,7,965,3000965]
[null,{"$f":"IF(登録!AG7=0,\"\",登録!AG7)","v":"今村　哲也"},{"$f":"登録!U17","v":120},{"$f":"IF(結果入力表!F21=\"\",\"\",結果入力表!F21)","v":20},{"$f":"IF(結果入力表!F42=\"\",\"\",結果入力表!F42)","v":75},{"$f":"IF(結果入力表!F63=\"\",\"\",結果入力表!F63)","v":4},{"$f":"IF(結果入力表!F84=\"\",\"\",結果入力表!F84)","v":"w"},{"$f":"IF(結果入力表!F105=\"\",\"\",結果入力表!F105)","v":"w"},{"$f":"IF(結果入力表!F126=\"\",\"\",結果入力表!F126)","v":91},{"$f":"IF(結果入力表!F147=\"\",\"\",結果入力表!F147)","v":44},{"$f":"IF(結果入力表!F168=\"\",\"\",結果入力表!F168)","v":"w"},{"$f":"IF(結果入力表!F189=\"\",\"\",結果入力表!F189)","v":"w"},{"$f":"IF(結果入力表!F210=\"\",\"\",結果入力表!F210)","v":87},4,6,801,{"$f":"IF(N10=\"\",\"\",IF(C10=登録!$I$8,P10,N10*登録!$I$8+SUM(D10:M10)/★個人成績表★!C10*登録!$I$8))","v":801},"",801,{"$f":"IF(COUNTBLANK(D10:M10)=10,\"\",RANK(AA10,$AA5:$AA11))","v":5},{"$f":"IF(★対戦リーグ表★!BS11=0,\"\",★対戦リーグ表★!BS11)","v":""},null,"今村　哲也",4,6,801,4000801]
[null,{"$f":"IF(登録!AG8=0,\"\",登録!AG8)","v":"森田由佳里"},{"$f":"登録!X17","v":100},{"$f":"IF(結果入力表!F22=\"\",\"\",結果入力表!F22)","v":2},{"$f":"IF(結果入力表!F43=\"\",\"\",結果入力表!F43)","v":92},{"$f":"IF(結果入力表!F64=\"\",\"\",結果入力表!F64)","v":36},{"$f":"IF(結果入力表!F85=\"\",\"\",結果入力表!F85)","v":"w"},{"$f":"IF(結果入力表!F106=\"\",\"\",結果入力表!F106)","v":"w"},{"$f":"IF(結果入力表!F127=\"\",\"\",結果入力表!F127)","v":"w"},{"$f":"IF(結果入力表!F148=\"\",\"\",結果入力表!F148)","v":35},{"$f":"IF(結果入力表!F169=\"\",\"\",結果入力表!F169)","v":31},{"$f":"IF(結果入力表!F190=\"\",\"\",結果入力表!F190)","v":"w"},{"$f":"IF(結果入力表!F211=\"\",\"\",結果入力表!F211)","v":19},4,6,615,{"$f":"IF(N11=\"\",\"\",IF(C11=登録!$I$8,P11,N11*登録!$I$8+SUM(D11:M11)/★個人成績表★!C11*登録!$I$8))","v":738},"*",738,{"$f":"IF(COUNTBLANK(D11:M11)=10,\"\",RANK(AA11,$AA5:$AA11))","v":6},{"$f":"IF(★対戦リーグ表★!BS12=0,\"\",★対戦リーグ表★!BS12)","v":""},null,"森田由佳里",4,6,738,4000738,null,"MVP"]
[null,"Total",null,null,null,null,null,null,null,null,null,null,null,{"$f":"IF(COUNTBLANK(N5:N11)=7,\"\",SUM(N5:N11))","v":37},{"$f":"IF(COUNTBLANK(O5:O11)=7,\"\",SUM(O5:O11))","v":33},{"$f":"IF(COUNTBLANK(P5:P11)=7,\"\",SUM(P5:P11))","v":6448},{"$f":"IF(COUNTBLANK(Q5:Q11)=7,\"\",SUM(Q5:Q11))","v":6571},"*",{"$f":"IF(COUNTBLANK(S5:S11)=7,\"\",IF(Q12=P12,P12,Q12))","v":6571},null,null,null,null,37,33,6571,37006571,null,1,{"$f":"VLOOKUP($AC12,$AC15:$AI20,2,FALSE)","v":"KRC"},{"$f":"VLOOKUP($AC12,$AC15:$AI20,3,FALSE)","v":"早川　徹"},{"$f":"VLOOKUP($AC12,$AC15:$AI20,4,FALSE)","v":9},{"$f":"VLOOKUP($AC12,$AC15:$AI20,5,FALSE)","v":1},{"$f":"VLOOKUP($AC12,$AC15:$AI20,6,FALSE)","v":1118},{"$f":"VLOOKUP($AC12,$AC15:$AI20,7,FALSE)","v":9001118},{"$f":"AE12&\"(\"&AD12&\")　\"&AF12&\"勝\"&AG12&\"敗\"","v":"早川　徹(KRC)　9勝1敗"}]
[{"$f":"IF(登録!B18=\"\",\"\",登録!B18)","v":"HRC"},{"$f":"B4","v":"Player＼VS"},{"$f":"C4","v":"持点"},{"$f":"登録!BI4","v":"ORC"},{"$f":"登録!BJ4","v":"SBC"},{"$f":"登録!BK4","v":"WRC"},{"$f":"登録!BL4","v":"NRC"},{"$f":"登録!BM4","v":"KRC"},{"$f":"D13","v":"ORC"},{"$f":"E13","v":"SBC"},{"$f":"F13","v":"WRC"},{"$f":"G13","v":"NRC"},{"$f":"H13","v":"KRC"},"W","L","TP","(TP)","TP",null,"R","HR",null,"Player","W","L","TP","R_P",null,"VP"]
[null,{"$f":"IF(登録!AG11=0,\"\",登録!AG11)","v":"鐵山　泰三"},{"$f":"登録!F18","v":120},{"$f":"IF(結果入力表!F9=\"\",\"\",結果入力表!F9)","v":"w"},{"$f":"IF(結果入力表!F23=\"\",\"\",結果入力表!F23)","v":"w"},{"$f":"IF(結果入力表!G44=\"\",\"\",結果入力表!G44)","v":13},{"$f":"IF(結果入力表!G72=\"\",\"\",結果入力表!G72)","v":"w"},{"$f":"IF(結果入力表!G100=\"\",\"\",結果入力表!G100)","v":100},{"$f":"IF(結果入力表!F120=\"\",\"\",結果入力表!F120)","v":75},{"$f":"IF(結果入力表!F134=\"\",\"\",結果入力表!F134)","v":33},{"$f":"IF(結果入力表!G155=\"\",\"\",結果入力表!G155)","v":114},{"$f":"IF(結果入力表!G183=\"\",\"\",結果入力表!G183)","v":"w"},{"$f":"IF(結果入力表!G211=\"\",\"\",結果入力表!G211)","v":"w"},{"$f":"IF(COUNTBLANK(D14:M14)=10,\"\",COUNTIF(D14:M14,\"w\"))","v":5},{"$f":"IF(COUNTBLANK(D14:M14)=10,\"\",10-COUNTBLANK(D14:M14)-N14)","v":5},{"$f":"IF(N14=\"\",\"\",N14*C14+SUM(D14:M14))","v":935},{"$f":"IF(N14=\"\",\"\",IF(C14=登録!$I$8,P14,N14*登録!$I$8+SUM(D14:M14)/★個人成績表★!C14*登録!$I$8))","v":935},{"$f":"IF(P14=Q14,\"\",\"*\")","v":""},{"$f":"IF(COUNTBLANK(D14:M14)=10,\"\",Q14)","v":935},{"$f":"IF(COUNTBLANK(D14:M14)=10,\"\",RANK(AA14,$AA14:$AA20))","v":4},{"$f":"IF(★対戦リーグ表★!BS15=0,\"\",★対戦リーグ表★!BS15)","v":128},null,{"$f":"B14","v":"鐵山　泰三"},{"$f":"N14","v":5},5,{"$f":"Q14","v":935},{"$f":"X14*1000000+Z14","v":5000935},null,"VP_R","Team","Player","W","L","TP","R_P"]
[null,{"$f":"IF(登録!AG12=0,\"\",登録!AG12)","v":"堂園　雅也"},{"$f":"登録!I18","v":120},{"$f":"IF(結果入力表!F10=\"\",\"\",結果入力表!F10)","v":"w"},{"$f":"IF(結果入力表!F24=\"\",\"\",結果入力表!F24)","v":"w"},{"$f":"IF(結果入力表!G45=\"\",\"\",結果入力表!G45)","v":8},{"$f":"IF(結果入力表!G73=\"\",\"\",結果入力表!G73)","v":"w"},{"$f":"IF(結果入力表!G101=\"\",\"\",結果入力表!G101)","v":114},{"$f":"IF(結果入力表!F114=\"\",\"\",結果入力表!F114)","v":114},{"$f":"IF(結果入力表!F128=\"\",\"\",結果入力表!F128)","v":"w"},{"$f":"IF(結果入力表!G149=\"\",\"\",結果入力表!G149)","v":"w"},{"$f":"IF(結果入力表!G177=\"\",\"\",結果入力表!G177)","v":"w"},{"$f":"IF(結果入力表!G205=\"\",\"\",結果入力表!G205)","v":41},{"$f":"IF(COUNTBLANK(D15:M15)=10,\"\",COUNTIF(D15:M15,\"w\"))","v":6},{"$f":"IF(COUNTBLANK(D15:M15)=10,\"\",10-COUNTBLANK(D15:M15)-N15)","v":4},{"$f":"IF(N15=\"\",\"\",N15*C15+SUM(D15:M15))","v":997},{"$f":"IF(N15=\"\",\"\",IF(C15=登録!$I$8,P15,N15*登録!$I$8+SUM(D15:M15)/★個人成績表★!C15*登録!$I$8))","v":997},"",997,{"$f":"IF(COUNTBLANK(D15:M15)=10,\"\",RANK(AA15,$AA14:$AA20))","v":2},{"$f":"IF(★対戦リーグ表★!BS16=0,\"\",★対戦リーグ表★!BS16)","v":104},null,"堂園　雅也",6,4,997,{"$f":"X15*1000000+Z15","v":6000997},null,{"$f":"RANK(AI15,$AI$15:$AI$20)","v":1},{"$f":"A4","v":"KRC"},{"$f":"VLOOKUP(1,$T5:$AA11,4,FALSE)","v":"早川　徹"},{"$f":"VLOOKUP(1,$T5:$AA11,5,FALSE)","v":9},{"$f":"VLOOKUP(1,$T5:$AA11,6,FALSE)","v":1},{"$f":"VLOOKUP(1,$T5:$AA11,7,FALSE)","v":1118},{"$f":"VLOOKUP(1,$T5:$AA11,8,FALSE)","v":9001118},{"$f":"AE15&\"(\"&AD15&\")　\"&AF15&\"勝\"&AG15&\"敗\"","v":"早川　徹(KRC)　9勝1敗"}]
[null,{"$f":"IF(登録!AG13=0,\"\",登録!AG13)","v":"宮本　一"},{"$f":"登録!L18","v":120},{"$f":"IF(結果入力表!F11=\"\",\"\",結果入力表!F11)","v":"w"},{"$f":"IF(結果入力表!F25=\"\",\"\",結果入力表!F25)","v":91},{"$f":"IF(結果入力表!G46=\"\",\"\",結果入力表!G46)","v":115},{"$f":"IF(結果入力表!G74=\"\",\"\",結果入力表!G74)","v":"w"},{"$f":"IF(結果入力表!G102=\"\",\"\",結果入力表!G102)","v":"w"},{"$f":"IF(結果入力表!F115=\"\",\"\",結果入力表!F115)","v":"w"},{"$f":"IF(結果入力表!F129=\"\",\"\",結果入力表!F129)","v":76},{"$f":"IF(結果入力表!G150=\"\",\"\",結果入力表!G150)","v":"w"},{"$f":"IF(結果入力表!G178=\"\",\"\",結果入力表!G178)","v":"w"},{"$f":"IF(結果入力表!G206=\"\",\"\",結果入力表!G206)","v":"w"},7,3,1122,{"$f":"IF(N16=\"\",\"\",IF(C16=登録!$I$8,P16,N16*登録!$I$8+SUM(D16:M16)/★個人成績表★!C16*登録!$I$8))","v":1122},"",1122,{"$f":"IF(COUNTBLANK(D16:M16)=10,\"\",RANK(AA16,$AA14:$AA20))","v":1},{"$f":"IF(★対戦リーグ表★!BS17=0,\"\",★対戦リーグ表★!BS17)","v":"B120"},null,"宮本　一",7,3,1122,7001122,null,3,{"$f":"A13","v":"HRC"},{"$f":"VLOOKUP(1,$T14:$AA20,4,FALSE)","v":"宮本　一"},{"$f":"VLOOKUP(1,$T14:$AA20,5,FALSE)","v":7},{"$f":"VLOOKUP(1,$T14:$AA20,6,FALSE)","v":3},{"$f":"VLOOKUP(1,$T14:$AA20,7,FALSE)","v":1122},{"$f":"VLOOKUP(1,$T14:$AA20,8,FALSE)","v":7001122},"宮本　一(HRC)　7勝3敗"]
[null,{"$f":"IF(登録!AG14=0,\"\",登録!AG14)","v":"伊藤　登"},{"$f":"登録!O18","v":120},{"$f":"IF(結果入力表!F12=\"\",\"\",結果入力表!F12)","v":88},{"$f":"IF(結果入力表!F26=\"\",\"\",結果入力表!F26)","v":"w"},{"$f":"IF(結果入力表!G47=\"\",\"\",結果入力表!G47)","v":6},{"$f":"IF(結果入力表!G75=\"\",\"\",結果入力表!G75)","v":"w"},{"$f":"IF(結果入力表!G103=\"\",\"\",結果入力表!G103)","v":100},{"$f":"IF(結果入力表!F116=\"\",\"\",結果入力表!F116)","v":"w"},{"$f":"IF(結果入力表!F130=\"\",\"\",結果入力表!F130)","v":72},{"$f":"IF(結果入力表!G151=\"\",\"\",結果入力表!G151)","v":42},{"$f":"IF(結果入力表!G179=\"\",\"\",結果入力表!G179)","v":"w"},{"$f":"IF(結果入力表!G207=\"\",\"\",結果入力表!G207)","v":"w"},5,5,908,{"$f":"IF(N17=\"\",\"\",IF(C17=登録!$I$8,P17,N17*登録!$I$8+SUM(D17:M17)/★個人成績表★!C17*登録!$I$8))","v":908},"",908,{"$f":"IF(COUNTBLANK(D17:M17)=10,\"\",RANK(AA17,$AA14:$AA20))","v":5},{"$f":"IF(★対戦リーグ表★!BS18=0,\"\",★対戦リーグ表★!BS18)","v":""},null,"伊藤　登",5,5,908,5000908,null,4,{"$f":"A22","v":"SBC"},{"$f":"VLOOKUP(1,$T23:$AA29,4,FALSE)","v":"林　秀忠"},{"$f":"VLOOKUP(1,$T23:$AA29,5,FALSE)","v":7},{"$f":"VLOOKUP(1,$T23:$AA29,6,FALSE)","v":3},{"$f":"VLOOKUP(1,$T23:$AA29,7,FALSE)","v":1011},{"$f":"VLOOKUP(1,$T23:$AA29,8,FALSE)","v":7001011},"林　秀忠(SBC)　7勝3敗"]
[null,{"$f":"IF(登録!AG15=0,\"\",登録!AG15)","v":"宮井健太郎"},{"$f":"登録!R18","v":120},{"$f":"IF(結果入力表!F13=\"\",\"\",結果入力表!F13)","v":7},{"$f":"IF(結果入力表!F27=\"\",\"\",結果入力表!F27)","v":48},{"$f":"IF(結果入力表!G48=\"\",\"\",結果入力表!G48)","v":26},{"$f":"IF(結果入力表!G76=\"\",\"\",結果入力表!G76)","v":"w"},{"$f":"IF(結果入力表!G104=\"\",\"\",結果入力表!G104)","v":25},{"$f":"IF(結果入力表!F117=\"\",\"\",結果入力表!F117)","v":32},{"$f":"IF(結果入力表!F131=\"\",\"\",結果入力表!F131)","v":107},{"$f":"IF(結果入力表!G152=\"\",\"\",結果入力表!G152)","v":"w"},{"$f":"IF(結果入力表!G180=\"\",\"\",結果入力表!G180)","v":92},{"$f":"IF(結果入力表!G208=\"\",\"\",結果入力表!G208)","v":45},2,8,622,{"$f":"IF(N18=\"\",\"\",IF(C18=登録!$I$8,P18,N18*登録!$I$8+SUM(D18:M18)/★個人成績表★!C18*登録!$I$8))","v":622},"",622,{"$f":"IF(COUNTBLANK(D18:M18)=10,\"\",RANK(AA18,$AA14:$AA20))","v":7},{"$f":"IF(★対戦リーグ表★!BS19=0,\"\",★対戦リーグ表★!BS19)","v":""},null,"宮井健太郎",2,8,622,2000622,null,6,{"$f":"A31","v":"NRC"},{"$f":"VLOOKUP(1,$T32:$AA38,4,FALSE)","v":"白戸　恭子"},{"$f":"VLOOKUP(1,$T32:$AA38,5,FALSE)","v":6},{"$f":"VLOOKUP(1,$T32:$AA38,6,FALSE)","v":4},{"$f":"VLOOKUP(1,$T32:$AA38,7,FALSE)","v":925.2},{"$f":"VLOOKUP(1,$T32:$AA38,8,FALSE)","v":6000925.2000000002},"白戸　恭子(NRC)　6勝4敗"]
[null,{"$f":"IF(登録!AG16=0,\"\",登録!AG16)","v":"白澤雄一郎"},{"$f":"登録!U18","v":120},{"$f":"IF(結果入力表!F14=\"\",\"\",結果入力表!F14)","v":18},{"$f":"IF(結果入力表!F28=\"\",\"\",結果入力表!F28)","v":13},{"$f":"IF(結果入力表!G49=\"\",\"\",結果入力表!G49)","v":"w"},{"$f":"IF(結果入力表!G77=\"\",\"\",結果入力表!G77)","v":"w"},{"$f":"IF(結果入力表!G105=\"\",\"\",結果入力表!G105)","v":20},{"$f":"IF(結果入力表!F118=\"\",\"\",結果入力表!F118)","v":72},{"$f":"IF(結果入力表!F132=\"\",\"\",結果入力表!F132)","v":"w"},{"$f":"IF(結果入力表!G153=\"\",\"\",結果入力表!G153)","v":0},{"$f":"IF(結果入力表!G181=\"\",\"\",結果入力表!G181)","v":"w"},{"$f":"IF(結果入力表!G209=\"\",\"\",結果入力表!G209)","v":"w"},5,5,723,{"$f":"IF(N19=\"\",\"\",IF(C19=登録!$I$8,P19,N19*登録!$I$8+SUM(D19:M19)/★個人成績表★!C19*登録!$I$8))","v":723},"",723,{"$f":"IF(COUNTBLANK(D19:M19)=10,\"\",RANK(AA19,$AA14:$AA20))","v":6},{"$f":"IF(★対戦リーグ表★!BS20=0,\"\",★対戦リーグ表★!BS20)","v":107},null,"白澤雄一郎",5,5,723,5000723,null,2,{"$f":"A40","v":"ORC"},{"$f":"VLOOKUP(1,$T41:$AA47,4,FALSE)","v":"乾　伸綱"},{"$f":"VLOOKUP(1,$T41:$AA47,5,FALSE)","v":8},{"$f":"VLOOKUP(1,$T41:$AA47,6,FALSE)","v":2},{"$f":"VLOOKUP(1,$T41:$AA47,7,FALSE)","v":1160},{"$f":"VLOOKUP(1,$T41:$AA47,8,FALSE)","v":8001160},"乾　伸綱(ORC)　8勝2敗"]
[null,{"$f":"IF(登録!AG17=0,\"\",登録!AG17)","v":"河地　恵里"},{"$f":"登録!X18","v":100},{"$f":"IF(結果入力表!F15=\"\",\"\",結果入力表!F15)","v":26},{"$f":"IF(結果入力表!F29=\"\",\"\",結果入力表!F29)","v":"w"},{"$f":"IF(結果入力表!G50=\"\",\"\",結果入力表!G50)","v":"w"},{"$f":"IF(結果入力表!G78=\"\",\"\",結果入力表!G78)","v":"w"},{"$f":"IF(結果入力表!G106=\"\",\"\",結果入力表!G106)","v":15},{"$f":"IF(結果入力表!F119=\"\",\"\",結果入力表!F119)","v":22},{"$f":"IF(結果入力表!F133=\"\",\"\",結果入力表!F133)","v":30},{"$f":"IF(結果入力表!G154=\"\",\"\",結果入力表!G154)","v":"w"},{"$f":"IF(結果入力表!G182=\"\",\"\",結果入力表!G182)","v":"w"},{"$f":"IF(結果入力表!G210=\"\",\"\",結果入力表!G210)","v":"w"},6,4,693,{"$f":"IF(N20=\"\",\"\",IF(C20=登録!$I$8,P20,N20*登録!$I$8+SUM(D20:M20)/★個人成績表★!C20*登録!$I$8))","v":831.6},"*",831.6,{"$f":"IF(COUNTBLANK(D20:M20)=10,\"\",RANK(AA20,$AA14:$AA20))","v":3},{"$f":"IF(★対戦リーグ表★!BS21=0,\"\",★対戦リーグ表★!BS21)","v":""},null,"河地　恵里",6,4,831.6,6000831.5999999996,null,5,{"$f":"A49","v":"WRC"},{"$f":"VLOOKUP(1,$T50:$AA56,4,FALSE)","v":"山中　康介"},{"$f":"IF(AD20=\"\",\"\",VLOOKUP(1,$T50:$AA56,5,FALSE))","v":7},{"$f":"IF(AD20=\"\",\"\",VLOOKUP(1,$T50:$AA56,6,FALSE))","v":3},{"$f":"IF(AD20=\"\",\"\",VLOOKUP(1,$T50:$AA56,7,FALSE))","v":974},{"$f":"IF(AD20=\"\",\"\",VLOOKUP(1,$T50:$AA56,8,FALSE))","v":7000974},"山中　康介(WRC)　7勝3敗"]
[null,"Total",null,null,null,null,null,null,null,null,null,null,null,{"$f":"IF(COUNTBLANK(N14:N20)=7,\"\",SUM(N14:N20))","v":36},{"$f":"IF(COUNTBLANK(O14:O20)=7,\"\",SUM(O14:O20))","v":34},{"$f":"IF(COUNTBLANK(P14:P20)=7,\"\",SUM(P14:P20))","v":6000},{"$f":"IF(COUNTBLANK(Q14:Q20)=7,\"\",SUM(Q14:Q20))","v":6138.6},"*",{"$f":"IF(COUNTBLANK(S14:S20)=7,\"\",IF(Q21=P21,P21,Q21))","v":6138.6},null,null,null,null,36,34,6138.6,36006138.600000001,null,"HR"]
[{"$f":"IF(登録!B19=\"\",\"\",登録!B19)","v":"SBC"},{"$f":"B4","v":"Player＼VS"},{"$f":"C4","v":"持点"},{"$f":"登録!BI5","v":"NRC"},{"$f":"登録!BJ5","v":"HRC"},{"$f":"登録!BK5","v":"ORC"},{"$f":"登録!BL5","v":"KRC"},{"$f":"登録!BM5","v":"WRC"},{"$f":"D22","v":"NRC"},{"$f":"E22","v":"HRC"},{"$f":"F22","v":"ORC"},{"$f":"G22","v":"KRC"},{"$f":"H22","v":"WRC"},"W","L","TP","(TP)","TP",null,"R","HR",null,"Player","W","L","TP","R_P"]
[null,{"$f":"IF(登録!AG20=0,\"\",登録!AG20)","v":"林　秀忠"},{"$f":"登録!F19","v":120},{"$f":"IF(結果入力表!F2=\"\",\"\",結果入力表!F2)","v":"w"},{"$f":"IF(結果入力表!G23=\"\",\"\",結果入力表!G23)","v":31},{"$f":"IF(結果入力表!G51=\"\",\"\",結果入力表!G51)","v":"w"},{"$f":"IF(結果入力表!G79=\"\",\"\",結果入力表!G79)","v":"w"},{"$f":"IF(結果入力表!F93=\"\",\"\",結果入力表!F93)","v":"w"},{"$f":"IF(結果入力表!F112=\"\",\"\",結果入力表!F112)","v":"w"},{"$f":"IF(結果入力表!G133=\"\",\"\",結果入力表!G133)","v":"w"},{"$f":"IF(結果入力表!G161=\"\",\"\",結果入力表!G161)","v":55},{"$f":"IF(結果入力表!G189=\"\",\"\",結果入力表!G189)","v":85},{"$f":"IF(結果入力表!F203=\"\",\"\",結果入力表!F203)","v":"w"},{"$f":"IF(COUNTBLANK(D23:M23)=10,\"\",COUNTIF(D23:M23,\"w\"))","v":7},{"$f":"IF(COUNTBLANK(D23:M23)=10,\"\",10-COUNTBLANK(D23:M23)-N23)","v":3},{"$f":"IF(N23=\"\",\"\",N23*C23+SUM(D23:M23))","v":1011},{"$f":"IF(N23=\"\",\"\",IF(C23=登録!$I$8,P23,N23*登録!$I$8+SUM(D23:M23)/★個人成績表★!C23*登録!$I$8))","v":1011},{"$f":"IF(P23=Q23,\"\",\"*\")","v":""},{"$f":"IF(COUNTBLANK(D23:M23)=10,\"\",Q23)","v":1011},{"$f":"IF(COUNTBLANK(D23:M23)=10,\"\",RANK(AA23,$AA23:$AA29))","v":1},{"$f":"IF(★対戦リーグ表★!BS24=0,\"\",★対戦リーグ表★!BS24)","v":"A120"},null,{"$f":"B23","v":"林　秀忠"},{"$f":"N23","v":7},3,{"$f":"Q23","v":1011},{"$f":"X23*1000000+Z23","v":7001011}]
[null,{"$f":"IF(登録!AG21=0,\"\",登録!AG21)","v":"大橋　義治"},{"$f":"登録!I19","v":120},{"$f":"IF(結果入力表!F3=\"\",\"\",結果入力表!F3)","v":"w"},{"$f":"IF(結果入力表!G24=\"\",\"\",結果入力表!G24)","v":61},{"$f":"IF(結果入力表!G52=\"\",\"\",結果入力表!G52)","v":"w"},{"$f":"IF(結果入力表!G80=\"\",\"\",結果入力表!G80)","v":"w"},{"$f":"IF(結果入力表!F94=\"\",\"\",結果入力表!F94)","v":"w"},{"$f":"IF(結果入力表!F113=\"\",\"\",結果入力表!F113)","v":101},{"$f":"IF(結果入力表!G134=\"\",\"\",結果入力表!G134)","v":"w"},{"$f":"IF(結果入力表!G162=\"\",\"\",結果入力表!G162)","v":82},{"$f":"IF(結果入力表!G190=\"\",\"\",結果入力表!G190)","v":84},{"$f":"IF(結果入力表!F204=\"\",\"\",結果入力表!F204)","v":"w"},{"$f":"IF(COUNTBLANK(D24:M24)=10,\"\",COUNTIF(D24:M24,\"w\"))","v":6},{"$f":"IF(COUNTBLANK(D24:M24)=10,\"\",10-COUNTBLANK(D24:M24)-N24)","v":4},{"$f":"IF(N24=\"\",\"\",N24*C24+SUM(D24:M24))","v":1048},{"$f":"IF(N24=\"\",\"\",IF(C24=登録!$I$8,P24,N24*登録!$I$8+SUM(D24:M24)/★個人成績表★!C24*登録!$I$8))","v":1048},"",1048,{"$f":"IF(COUNTBLANK(D24:M24)=10,\"\",RANK(AA24,$AA23:$AA29))","v":3},{"$f":"IF(★対戦リーグ表★!BS25=0,\"\",★対戦リーグ表★!BS25)","v":""},null,"大橋　義治",6,4,1048,6001048]
[null,{"$f":"IF(登録!AG22=0,\"\",登録!AG22)","v":"山中　康寛"},{"$f":"登録!L19","v":120},{"$f":"IF(結果入力表!F4=\"\",\"\",結果入力表!F4)","v":0},{"$f":"IF(結果入力表!G25=\"\",\"\",結果入力表!G25)","v":"w"},{"$f":"IF(結果入力表!G53=\"\",\"\",結果入力表!G53)","v":63},{"$f":"IF(結果入力表!G81=\"\",\"\",結果入力表!G81)","v":51},{"$f":"IF(結果入力表!F95=\"\",\"\",結果入力表!F95)","v":"w"},{"$f":"IF(結果入力表!F107=\"\",\"\",結果入力表!F107)","v":"w"},{"$f":"IF(結果入力表!G128=\"\",\"\",結果入力表!G128)","v":0},{"$f":"IF(結果入力表!G156=\"\",\"\",結果入力表!G156)","v":90},{"$f":"IF(結果入力表!G184=\"\",\"\",結果入力表!G184)","v":71},{"$f":"IF(結果入力表!F198=\"\",\"\",結果入力表!F198)","v":"w"},4,6,755,{"$f":"IF(N25=\"\",\"\",IF(C25=登録!$I$8,P25,N25*登録!$I$8+SUM(D25:M25)/★個人成績表★!C25*登録!$I$8))","v":755},"",755,{"$f":"IF(COUNTBLANK(D25:M25)=10,\"\",RANK(AA25,$AA23:$AA29))","v":5},{"$f":"IF(★対戦リーグ表★!BS26=0,\"\",★対戦リーグ表★!BS26)","v":""},null,"山中　康寛",4,6,755,4000755]
[null,{"$f":"IF(登録!AG23=0,\"\",登録!AG23)","v":"西峰　久祐"},{"$f":"登録!O19","v":120},{"$f":"IF(結果入力表!F5=\"\",\"\",結果入力表!F5)","v":"w"},{"$f":"IF(結果入力表!G26=\"\",\"\",結果入力表!G26)","v":61},{"$f":"IF(結果入力表!G54=\"\",\"\",結果入力表!G54)","v":3},{"$f":"IF(結果入力表!G82=\"\",\"\",結果入力表!G82)","v":57},{"$f":"IF(結果入力表!F96=\"\",\"\",結果入力表!F96)","v":28},{"$f":"IF(結果入力表!F108=\"\",\"\",結果入力表!F108)","v":"w"},{"$f":"IF(結果入力表!G129=\"\",\"\",結果入力表!G129)","v":"w"},{"$f":"IF(結果入力表!G157=\"\",\"\",結果入力表!G157)","v":"w"},{"$f":"IF(結果入力表!G185=\"\",\"\",結果入力表!G185)","v":116},{"$f":"IF(結果入力表!F199=\"\",\"\",結果入力表!F199)","v":81},4,6,826,{"$f":"IF(N26=\"\",\"\",IF(C26=登録!$I$8,P26,N26*登録!$I$8+SUM(D26:M26)/★個人成績表★!C26*登録!$I$8))","v":826},"",826,{"$f":"IF(COUNTBLANK(D26:M26)=10,\"\",RANK(AA26,$AA23:$AA29))","v":4},{"$f":"IF(★対戦リーグ表★!BS27=0,\"\",★対戦リーグ表★!BS27)","v":101},null,"西峰　久祐",4,6,826,4000826]
[null,{"$f":"IF(登録!AG24=0,\"\",登録!AG24)","v":"大橋　正寛"},{"$f":"登録!R19","v":120},{"$f":"IF(結果入力表!F6=\"\",\"\",結果入力表!F6)","v":"w"},{"$f":"IF(結果入力表!G27=\"\",\"\",結果入力表!G27)","v":"w"},{"$f":"IF(結果入力表!G55=\"\",\"\",結果入力表!G55)","v":20},{"$f":"IF(結果入力表!G83=\"\",\"\",結果入力表!G83)","v":"w"},{"$f":"IF(結果入力表!F97=\"\",\"\",結果入力表!F97)","v":39},{"$f":"IF(結果入力表!F109=\"\",\"\",結果入力表!F109)","v":"w"},{"$f":"IF(結果入力表!G130=\"\",\"\",結果入力表!G130)","v":"w"},{"$f":"IF(結果入力表!G158=\"\",\"\",結果入力表!G158)","v":"w"},{"$f":"IF(結果入力表!G186=\"\",\"\",結果入力表!G186)","v":44},{"$f":"IF(結果入力表!F200=\"\",\"\",結果入力表!F200)","v":"w"},7,3,943,{"$f":"IF(N27=\"\",\"\",IF(C27=登録!$I$8,P27,N27*登録!$I$8+SUM(D27:M27)/★個人成績表★!C27*登録!$I$8))","v":943},"",943,{"$f":"IF(COUNTBLANK(D27:M27)=10,\"\",RANK(AA27,$AA23:$AA29))","v":2},{"$f":"IF(★対戦リーグ表★!BS28=0,\"\",★対戦リーグ表★!BS28)","v":"A120"},null,"大橋　正寛",7,3,943,7000943]
[null,{"$f":"IF(登録!AG25=0,\"\",登録!AG25)","v":"秋田　倫央"},{"$f":"登録!U19","v":120},{"$f":"IF(結果入力表!F7=\"\",\"\",結果入力表!F7)","v":98},{"$f":"IF(結果入力表!G28=\"\",\"\",結果入力表!G28)","v":"w"},{"$f":"IF(結果入力表!G56=\"\",\"\",結果入力表!G56)","v":28},{"$f":"IF(結果入力表!G84=\"\",\"\",結果入力表!G84)","v":24},{"$f":"IF(結果入力表!F98=\"\",\"\",結果入力表!F98)","v":"w"},{"$f":"IF(結果入力表!F110=\"\",\"\",結果入力表!F110)","v":46},{"$f":"IF(結果入力表!G131=\"\",\"\",結果入力表!G131)","v":"w"},{"$f":"IF(結果入力表!G159=\"\",\"\",結果入力表!G159)","v":109},{"$f":"IF(結果入力表!G187=\"\",\"\",結果入力表!G187)","v":11},{"$f":"IF(結果入力表!F201=\"\",\"\",結果入力表!F201)","v":31},3,7,707,{"$f":"IF(N28=\"\",\"\",IF(C28=登録!$I$8,P28,N28*登録!$I$8+SUM(D28:M28)/★個人成績表★!C28*登録!$I$8))","v":707},"",707,{"$f":"IF(COUNTBLANK(D28:M28)=10,\"\",RANK(AA28,$AA23:$AA29))","v":6},{"$f":"IF(★対戦リーグ表★!BS29=0,\"\",★対戦リーグ表★!BS29)","v":""},null,"秋田　倫央",3,7,707,3000707]
[null,{"$f":"IF(登録!AG26=0,\"\",登録!AG26)","v":"大橋　洋子"},{"$f":"登録!X19","v":100},{"$f":"IF(結果入力表!F8=\"\",\"\",結果入力表!F8)","v":64},{"$f":"IF(結果入力表!G29=\"\",\"\",結果入力表!G29)","v":6},{"$f":"IF(結果入力表!G57=\"\",\"\",結果入力表!G57)","v":"w"},{"$f":"IF(結果入力表!G85=\"\",\"\",結果入力表!G85)","v":1},{"$f":"IF(結果入力表!F99=\"\",\"\",結果入力表!F99)","v":27},{"$f":"IF(結果入力表!F111=\"\",\"\",結果入力表!F111)","v":32},{"$f":"IF(結果入力表!G132=\"\",\"\",結果入力表!G132)","v":3},{"$f":"IF(結果入力表!G160=\"\",\"\",結果入力表!G160)","v":16},{"$f":"IF(結果入力表!G188=\"\",\"\",結果入力表!G188)","v":23},{"$f":"IF(結果入力表!F202=\"\",\"\",結果入力表!F202)","v":70},1,9,342,{"$f":"IF(N29=\"\",\"\",IF(C29=登録!$I$8,P29,N29*登録!$I$8+SUM(D29:M29)/★個人成績表★!C29*登録!$I$8))","v":410.4},"*",410.4,{"$f":"IF(COUNTBLANK(D29:M29)=10,\"\",RANK(AA29,$AA23:$AA29))","v":7},{"$f":"IF(★対戦リーグ表★!BS30=0,\"\",★対戦リーグ表★!BS30)","v":""},null,"大橋　洋子",1,9,410.4,1000410.4]
[null,"Total",null,null,null,null,null,null,null,null,null,null,null,{"$f":"IF(COUNTBLANK(N23:N29)=7,\"\",SUM(N23:N29))","v":32},{"$f":"IF(COUNTBLANK(O23:O29)=7,\"\",SUM(O23:O29))","v":38},{"$f":"IF(COUNTBLANK(P23:P29)=7,\"\",SUM(P23:P29))","v":5632},{"$f":"IF(COUNTBLANK(Q23:Q29)=7,\"\",SUM(Q23:Q29))","v":5700.4},"*",{"$f":"IF(COUNTBLANK(S23:S29)=7,\"\",IF(Q30=P30,P30,Q30))","v":5700.4},null,null,null,null,32,38,5700.4,32005700.399999999]
[{"$f":"IF(登録!B20=\"\",\"\",登録!B20)","v":"NRC"},{"$f":"B22","v":"Player＼VS"},{"$f":"C22","v":"持点"},{"$f":"登録!BI6","v":"SBC"},{"$f":"登録!BJ6","v":"WRC"},{"$f":"登録!BK6","v":"KRC"},{"$f":"登録!BL6","v":"HRC"},{"$f":"登録!BM6","v":"ORC"},{"$f":"D31","v":"SBC"},{"$f":"E31","v":"WRC"},{"$f":"F31","v":"KRC"},{"$f":"G31","v":"HRC"},{"$f":"H31","v":"ORC"},"W","L","TP","(TP)","TP",null,"R","HR",null,"Player","W","L","TP","R_P"]
[null,{"$f":"IF(登録!AG29=0,\"\",登録!AG29)","v":"吉向　翔平"},{"$f":"登録!F20","v":120},{"$f":"IF(結果入力表!G2=\"\",\"\",結果入力表!G2)","v":55},{"$f":"IF(結果入力表!G30=\"\",\"\",結果入力表!G30)","v":25},{"$f":"IF(結果入力表!G58=\"\",\"\",結果入力表!G58)","v":"w"},{"$f":"IF(結果入力表!F72=\"\",\"\",結果入力表!F72)","v":56},{"$f":"IF(結果入力表!F86=\"\",\"\",結果入力表!F86)","v":63},{"$f":"IF(結果入力表!G111=\"\",\"\",結果入力表!G111)","v":"w"},{"$f":"IF(結果入力表!G139=\"\",\"\",結果入力表!G139)","v":"w"},{"$f":"IF(結果入力表!G167=\"\",\"\",結果入力表!G167)","v":"w"},{"$f":"IF(結果入力表!F181=\"\",\"\",結果入力表!F181)","v":26},{"$f":"IF(結果入力表!F195=\"\",\"\",結果入力表!F195)","v":"w"},{"$f":"IF(COUNTBLANK(D32:M32)=10,\"\",COUNTIF(D32:M32,\"w\"))","v":5},{"$f":"IF(COUNTBLANK(D32:M32)=10,\"\",10-COUNTBLANK(D32:M32)-N32)","v":5},{"$f":"IF(N32=\"\",\"\",N32*C32+SUM(D32:M32))","v":825},{"$f":"IF(N32=\"\",\"\",IF(C32=登録!$I$8,P32,N32*登録!$I$8+SUM(D32:M32)/★個人成績表★!C32*登録!$I$8))","v":825},{"$f":"IF(P32=Q32,\"\",\"*\")","v":""},{"$f":"IF(COUNTBLANK(D32:M32)=10,\"\",Q32)","v":825},{"$f":"IF(COUNTBLANK(D32:M32)=10,\"\",RANK(AA32,$AA32:$AA38))","v":4},{"$f":"IF(★対戦リーグ表★!BS33=0,\"\",★対戦リーグ表★!BS33)","v":""},null,{"$f":"B32","v":"吉向　翔平"},{"$f":"N32","v":5},5,{"$f":"Q32","v":825},{"$f":"X32*1000000+Z32","v":5000825}]
[null,{"$f":"IF(登録!AG30=0,\"\",登録!AG30)","v":"岩本　剛"},{"$f":"登録!I20","v":120},{"$f":"IF(結果入力表!G3=\"\",\"\",結果入力表!G3)","v":112},{"$f":"IF(結果入力表!G31=\"\",\"\",結果入力表!G31)","v":"w"},{"$f":"IF(結果入力表!G59=\"\",\"\",結果入力表!G59)","v":"w"},{"$f":"IF(結果入力表!F73=\"\",\"\",結果入力表!F73)","v":45},{"$f":"IF(結果入力表!F87=\"\",\"\",結果入力表!F87)","v":"w"},{"$f":"IF(結果入力表!G112=\"\",\"\",結果入力表!G112)","v":47},{"$f":"IF(結果入力表!G140=\"\",\"\",結果入力表!G140)","v":"w"},{"$f":"IF(結果入力表!G168=\"\",\"\",結果入力表!G168)","v":53},{"$f":"IF(結果入力表!F182=\"\",\"\",結果入力表!F182)","v":79},{"$f":"IF(結果入力表!F196=\"\",\"\",結果入力表!F196)","v":"w"},{"$f":"IF(COUNTBLANK(D33:M33)=10,\"\",COUNTIF(D33:M33,\"w\"))","v":5},{"$f":"IF(COUNTBLANK(D33:M33)=10,\"\",10-COUNTBLANK(D33:M33)-N33)","v":5},{"$f":"IF(N33=\"\",\"\",N33*C33+SUM(D33:M33))","v":936},{"$f":"IF(N33=\"\",\"\",IF(C33=登録!$I$8,P33,N33*登録!$I$8+SUM(D33:M33)/★個人成績表★!C33*登録!$I$8))","v":936},"",936,{"$f":"IF(COUNTBLANK(D33:M33)=10,\"\",RANK(AA33,$AA32:$AA38))","v":3},{"$f":"IF(★対戦リーグ表★!BS34=0,\"\",★対戦リーグ表★!BS34)","v":""},null,"岩本　剛",5,5,936,5000936]
[null,{"$f":"IF(登録!AG31=0,\"\",登録!AG31)","v":"白戸　玲人"},{"$f":"登録!L20","v":120},{"$f":"IF(結果入力表!G4=\"\",\"\",結果入力表!G4)","v":"w"},{"$f":"IF(結果入力表!G32=\"\",\"\",結果入力表!G32)","v":"w"},{"$f":"IF(結果入力表!G60=\"\",\"\",結果入力表!G60)","v":113},{"$f":"IF(結果入力表!F74=\"\",\"\",結果入力表!F74)","v":0},{"$f":"IF(結果入力表!F88=\"\",\"\",結果入力表!F88)","v":79},{"$f":"IF(結果入力表!G113=\"\",\"\",結果入力表!G113)","v":"w"},{"$f":"IF(結果入力表!G141=\"\",\"\",結果入力表!G141)","v":"w"},{"$f":"IF(結果入力表!G169=\"\",\"\",結果入力表!G169)","v":"w"},{"$f":"IF(結果入力表!F183=\"\",\"\",結果入力表!F183)","v":0},{"$f":"IF(結果入力表!F197=\"\",\"\",結果入力表!F197)","v":"w"},6,4,912,{"$f":"IF(N34=\"\",\"\",IF(C34=登録!$I$8,P34,N34*登録!$I$8+SUM(D34:M34)/★個人成績表★!C34*登録!$I$8))","v":912},"",912,{"$f":"IF(COUNTBLANK(D34:M34)=10,\"\",RANK(AA34,$AA32:$AA38))","v":2},{"$f":"IF(★対戦リーグ表★!BS35=0,\"\",★対戦リーグ表★!BS35)","v":107},null,"白戸　玲人",6,4,912,6000912]
[null,{"$f":"IF(登録!AG32=0,\"\",登録!AG32)","v":"植田　慎也"},{"$f":"登録!O20","v":120},{"$f":"IF(結果入力表!G5=\"\",\"\",結果入力表!G5)","v":72},{"$f":"IF(結果入力表!G33=\"\",\"\",結果入力表!G33)","v":76},{"$f":"IF(結果入力表!G61=\"\",\"\",結果入力表!G61)","v":86},{"$f":"IF(結果入力表!F75=\"\",\"\",結果入力表!F75)","v":34},{"$f":"IF(結果入力表!F89=\"\",\"\",結果入力表!F89)","v":106},{"$f":"IF(結果入力表!G107=\"\",\"\",結果入力表!G107)","v":17},{"$f":"IF(結果入力表!G135=\"\",\"\",結果入力表!G135)","v":"w"},{"$f":"IF(結果入力表!G163=\"\",\"\",結果入力表!G163)","v":24},{"$f":"IF(結果入力表!F177=\"\",\"\",結果入力表!F177)","v":29},{"$f":"IF(結果入力表!F191=\"\",\"\",結果入力表!F191)","v":118},1,9,682,{"$f":"IF(N35=\"\",\"\",IF(C35=登録!$I$8,P35,N35*登録!$I$8+SUM(D35:M35)/★個人成績表★!C35*登録!$I$8))","v":682},"",682,{"$f":"IF(COUNTBLANK(D35:M35)=10,\"\",RANK(AA35,$AA32:$AA38))","v":6},{"$f":"IF(★対戦リーグ表★!BS36=0,\"\",★対戦リーグ表★!BS36)","v":106},null,"植田　慎也",1,9,682,1000682]
[null,{"$f":"IF(登録!AG33=0,\"\",登録!AG33)","v":"近藤　拓馬"},{"$f":"登録!R20","v":120},{"$f":"IF(結果入力表!G6=\"\",\"\",結果入力表!G6)","v":19},{"$f":"IF(結果入力表!G34=\"\",\"\",結果入力表!G34)","v":57},{"$f":"IF(結果入力表!G62=\"\",\"\",結果入力表!G62)","v":"w"},{"$f":"IF(結果入力表!F76=\"\",\"\",結果入力表!F76)","v":21},{"$f":"IF(結果入力表!F90=\"\",\"\",結果入力表!F90)","v":1},{"$f":"IF(結果入力表!G108=\"\",\"\",結果入力表!G108)","v":17},{"$f":"IF(結果入力表!G136=\"\",\"\",結果入力表!G136)","v":81},{"$f":"IF(結果入力表!G164=\"\",\"\",結果入力表!G164)","v":8},{"$f":"IF(結果入力表!F178=\"\",\"\",結果入力表!F178)","v":0},{"$f":"IF(結果入力表!F192=\"\",\"\",結果入力表!F192)","v":33},1,9,357,{"$f":"IF(N36=\"\",\"\",IF(C36=登録!$I$8,P36,N36*登録!$I$8+SUM(D36:M36)/★個人成績表★!C36*登録!$I$8))","v":357},"",357,{"$f":"IF(COUNTBLANK(D36:M36)=10,\"\",RANK(AA36,$AA32:$AA38))","v":7},{"$f":"IF(★対戦リーグ表★!BS37=0,\"\",★対戦リーグ表★!BS37)","v":""},null,"近藤　拓馬",1,9,357,1000357]
[null,{"$f":"IF(登録!AG34=0,\"\",登録!AG34)","v":"長谷川　進"},{"$f":"登録!U20","v":120},{"$f":"IF(結果入力表!G7=\"\",\"\",結果入力表!G7)","v":"w"},{"$f":"IF(結果入力表!G35=\"\",\"\",結果入力表!G35)","v":0},{"$f":"IF(結果入力表!G63=\"\",\"\",結果入力表!G63)","v":"w"},{"$f":"IF(結果入力表!F77=\"\",\"\",結果入力表!F77)","v":21},{"$f":"IF(結果入力表!F91=\"\",\"\",結果入力表!F91)","v":23},{"$f":"IF(結果入力表!G109=\"\",\"\",結果入力表!G109)","v":0},{"$f":"IF(結果入力表!G137=\"\",\"\",結果入力表!G137)","v":13},{"$f":"IF(結果入力表!G165=\"\",\"\",結果入力表!G165)","v":"w"},{"$f":"IF(結果入力表!F179=\"\",\"\",結果入力表!F179)","v":32},{"$f":"IF(結果入力表!F193=\"\",\"\",結果入力表!F193)","v":55},3,7,504,{"$f":"IF(N37=\"\",\"\",IF(C37=登録!$I$8,P37,N37*登録!$I$8+SUM(D37:M37)/★個人成績表★!C37*登録!$I$8))","v":504},"",504,{"$f":"IF(COUNTBLANK(D37:M37)=10,\"\",RANK(AA37,$AA32:$AA38))","v":5},{"$f":"IF(★対戦リーグ表★!BS38=0,\"\",★対戦リーグ表★!BS38)","v":""},null,"長谷川　進",3,7,504,3000504]
[null,{"$f":"IF(登録!AG35=0,\"\",登録!AG35)","v":"白戸　恭子"},{"$f":"登録!X20","v":100},{"$f":"IF(結果入力表!G8=\"\",\"\",結果入力表!G8)","v":"w"},{"$f":"IF(結果入力表!G36=\"\",\"\",結果入力表!G36)","v":39},{"$f":"IF(結果入力表!G64=\"\",\"\",結果入力表!G64)","v":"w"},{"$f":"IF(結果入力表!F78=\"\",\"\",結果入力表!F78)","v":41},{"$f":"IF(結果入力表!F92=\"\",\"\",結果入力表!F92)","v":"w"},{"$f":"IF(結果入力表!G110=\"\",\"\",結果入力表!G110)","v":"w"},{"$f":"IF(結果入力表!G138=\"\",\"\",結果入力表!G138)","v":"w"},{"$f":"IF(結果入力表!G166=\"\",\"\",結果入力表!G166)","v":66},{"$f":"IF(結果入力表!F180=\"\",\"\",結果入力表!F180)","v":"w"},{"$f":"IF(結果入力表!F194=\"\",\"\",結果入力表!F194)","v":25},6,4,771,{"$f":"IF(N38=\"\",\"\",IF(C38=登録!$I$8,P38,N38*登録!$I$8+SUM(D38:M38)/★個人成績表★!C38*登録!$I$8))","v":925.2},"*",925.2,{"$f":"IF(COUNTBLANK(D38:M38)=10,\"\",RANK(AA38,$AA32:$AA38))","v":1},{"$f":"IF(★対戦リーグ表★!BS39=0,\"\",★対戦リーグ表★!BS39)","v":"A120"},null,"白戸　恭子",6,4,925.2,6000925.2000000002]
[null,"Total",null,null,null,null,null,null,null,null,null,null,null,{"$f":"IF(COUNTBLANK(N32:N38)=7,\"\",SUM(N32:N38))","v":27},{"$f":"IF(COUNTBLANK(O32:O38)=7,\"\",SUM(O32:O38))","v":43},{"$f":"IF(COUNTBLANK(P32:P38)=7,\"\",SUM(P32:P38))","v":4987},{"$f":"IF(COUNTBLANK(Q32:Q38)=7,\"\",SUM(Q32:Q38))","v":5141.2},"*",{"$f":"IF(COUNTBLANK(S32:S38)=7,\"\",IF(Q39=P39,P39,Q39))","v":5141.2},null,null,null,null,27,43,5141.2,27005141.199999999]
[{"$f":"IF(登録!B21=\"\",\"\",登録!B21)","v":"ORC"},{"$f":"B22","v":"Player＼VS"},{"$f":"C22","v":"持点"},{"$f":"登録!BI7","v":"HRC"},{"$f":"登録!BJ7","v":"KRC"},{"$f":"登録!BK7","v":"SBC"},{"$f":"登録!BL7","v":"WRC"},{"$f":"登録!BM7","v":"NRC"},{"$f":"D40","v":"HRC"},{"$f":"E40","v":"KRC"},{"$f":"F40","v":"SBC"},{"$f":"G40","v":"WRC"},{"$f":"H40","v":"NRC"},"W","L","TP","(TP)","TP",null,"R","HR",null,"Player","W","L","TP","R_P"]
[null,{"$f":"IF(登録!AG38=0,\"\",登録!AG38)","v":"松居　勝巳"},{"$f":"登録!F21","v":120},{"$f":"IF(結果入力表!G9=\"\",\"\",結果入力表!G9)","v":104},{"$f":"IF(結果入力表!G37=\"\",\"\",結果入力表!G37)","v":"w"},{"$f":"IF(結果入力表!F51=\"\",\"\",結果入力表!F51)","v":0},{"$f":"IF(結果入力表!F65=\"\",\"\",結果入力表!F65)","v":58},{"$f":"IF(結果入力表!G86=\"\",\"\",結果入力表!G86)","v":"w"},{"$f":"IF(結果入力表!G117=\"\",\"\",結果入力表!G117)","v":"w"},{"$f":"IF(結果入力表!G145=\"\",\"\",結果入力表!G145)","v":"w"},{"$f":"IF(結果入力表!F159=\"\",\"\",結果入力表!F159)","v":"w"},{"$f":"IF(結果入力表!F173=\"\",\"\",結果入力表!F173)","v":"w"},{"$f":"IF(結果入力表!G194=\"\",\"\",結果入力表!G194)","v":"w"},{"$f":"IF(COUNTBLANK(D41:M41)=10,\"\",COUNTIF(D41:M41,\"w\"))","v":7},{"$f":"IF(COUNTBLANK(D41:M41)=10,\"\",10-COUNTBLANK(D41:M41)-N41)","v":3},{"$f":"IF(N41=\"\",\"\",N41*C41+SUM(D41:M41))","v":1002},{"$f":"IF(N41=\"\",\"\",IF(C41=登録!$I$8,P41,N41*登録!$I$8+SUM(D41:M41)/★個人成績表★!C41*登録!$I$8))","v":1002},{"$f":"IF(P41=Q41,\"\",\"*\")","v":""},{"$f":"IF(COUNTBLANK(D41:M41)=10,\"\",Q41)","v":1002},{"$f":"IF(COUNTBLANK(D41:M41)=10,\"\",RANK(AA41,$AA41:$AA47))","v":3},{"$f":"IF(★対戦リーグ表★!BS42=0,\"\",★対戦リーグ表★!BS42)","v":""},null,{"$f":"B41","v":"松居　勝巳"},{"$f":"N41","v":7},{"$f":"O41","v":3},{"$f":"Q41","v":1002},{"$f":"X41*1000000+Z41","v":7001002}]
[null,{"$f":"IF(登録!AG39=0,\"\",登録!AG39)","v":"藤明　宏樹"},{"$f":"登録!I21","v":120},{"$f":"IF(結果入力表!G10=\"\",\"\",結果入力表!G10)","v":86},{"$f":"IF(結果入力表!G38=\"\",\"\",結果入力表!G38)","v":83},{"$f":"IF(結果入力表!F52=\"\",\"\",結果入力表!F52)","v":67},{"$f":"IF(結果入力表!F66=\"\",\"\",結果入力表!F66)","v":48},{"$f":"IF(結果入力表!G87=\"\",\"\",結果入力表!G87)","v":5},{"$f":"IF(結果入力表!G118=\"\",\"\",結果入力表!G118)","v":"w"},{"$f":"IF(結果入力表!G146=\"\",\"\",結果入力表!G146)","v":"w"},{"$f":"IF(結果入力表!F160=\"\",\"\",結果入力表!F160)","v":"w"},{"$f":"IF(結果入力表!F174=\"\",\"\",結果入力表!F174)","v":92},{"$f":"IF(結果入力表!G195=\"\",\"\",結果入力表!G195)","v":60},{"$f":"IF(COUNTBLANK(D42:M42)=10,\"\",COUNTIF(D42:M42,\"w\"))","v":3},{"$f":"IF(COUNTBLANK(D42:M42)=10,\"\",10-COUNTBLANK(D42:M42)-N42)","v":7},{"$f":"IF(N42=\"\",\"\",N42*C42+SUM(D42:M42))","v":801},{"$f":"IF(N42=\"\",\"\",IF(C42=登録!$I$8,P42,N42*登録!$I$8+SUM(D42:M42)/★個人成績表★!C42*登録!$I$8))","v":801},"",801,{"$f":"IF(COUNTBLANK(D42:M42)=10,\"\",RANK(AA42,$AA41:$AA47))","v":7},{"$f":"IF(★対戦リーグ表★!BS43=0,\"\",★対戦リーグ表★!BS43)","v":""},null,"藤明　宏樹",3,7,801,3000801]
[null,{"$f":"IF(登録!AG40=0,\"\",登録!AG40)","v":"吉岡　保俊"},{"$f":"登録!L21","v":120},{"$f":"IF(結果入力表!G11=\"\",\"\",結果入力表!G11)","v":106},{"$f":"IF(結果入力表!G39=\"\",\"\",結果入力表!G39)","v":67},{"$f":"IF(結果入力表!F53=\"\",\"\",結果入力表!F53)","v":"w"},{"$f":"IF(結果入力表!F67=\"\",\"\",結果入力表!F67)","v":98},{"$f":"IF(結果入力表!G88=\"\",\"\",結果入力表!G88)","v":"w"},{"$f":"IF(結果入力表!G119=\"\",\"\",結果入力表!G119)","v":"w"},{"$f":"IF(結果入力表!G147=\"\",\"\",結果入力表!G147)","v":"w"},{"$f":"IF(結果入力表!F161=\"\",\"\",結果入力表!F161)","v":"w"},{"$f":"IF(結果入力表!F175=\"\",\"\",結果入力表!F175)","v":83},{"$f":"IF(結果入力表!G196=\"\",\"\",結果入力表!G196)","v":18},5,5,972,{"$f":"IF(N43=\"\",\"\",IF(C43=登録!$I$8,P43,N43*登録!$I$8+SUM(D43:M43)/★個人成績表★!C43*登録!$I$8))","v":972},"",972,{"$f":"IF(COUNTBLANK(D43:M43)=10,\"\",RANK(AA43,$AA41:$AA47))","v":5},{"$f":"IF(★対戦リーグ表★!BS44=0,\"\",★対戦リーグ表★!BS44)","v":106},null,"吉岡　保俊",5,5,972,5000972]
[null,{"$f":"IF(登録!AG41=0,\"\",登録!AG41)","v":"村上　泰辰"},{"$f":"登録!O21","v":120},{"$f":"IF(結果入力表!G12=\"\",\"\",結果入力表!G12)","v":"w"},{"$f":"IF(結果入力表!G40=\"\",\"\",結果入力表!G40)","v":34},{"$f":"IF(結果入力表!F54=\"\",\"\",結果入力表!F54)","v":"w"},{"$f":"IF(結果入力表!F68=\"\",\"\",結果入力表!F68)","v":"w"},{"$f":"IF(結果入力表!G89=\"\",\"\",結果入力表!G89)","v":"w"},{"$f":"IF(結果入力表!G120=\"\",\"\",結果入力表!G120)","v":"w"},{"$f":"IF(結果入力表!G148=\"\",\"\",結果入力表!G148)","v":"w"},{"$f":"IF(結果入力表!F162=\"\",\"\",結果入力表!F162)","v":"w"},{"$f":"IF(結果入力表!F176=\"\",\"\",結果入力表!F176)","v":38},{"$f":"IF(結果入力表!G197=\"\",\"\",結果入力表!G197)","v":11},7,3,923,{"$f":"IF(N44=\"\",\"\",IF(C44=登録!$I$8,P44,N44*登録!$I$8+SUM(D44:M44)/★個人成績表★!C44*登録!$I$8))","v":923},"",923,{"$f":"IF(COUNTBLANK(D44:M44)=10,\"\",RANK(AA44,$AA41:$AA47))","v":4},{"$f":"IF(★対戦リーグ表★!BS45=0,\"\",★対戦リーグ表★!BS45)","v":""},null,"村上　泰辰",7,3,923,7000923]
[null,{"$f":"IF(登録!AG42=0,\"\",登録!AG42)","v":"小原　嘉丈"},{"$f":"登録!R21","v":120},{"$f":"IF(結果入力表!G13=\"\",\"\",結果入力表!G13)","v":"w"},{"$f":"IF(結果入力表!G41=\"\",\"\",結果入力表!G41)","v":0},{"$f":"IF(結果入力表!F55=\"\",\"\",結果入力表!F55)","v":"w"},{"$f":"IF(結果入力表!F69=\"\",\"\",結果入力表!F69)","v":73},{"$f":"IF(結果入力表!G90=\"\",\"\",結果入力表!G90)","v":"w"},{"$f":"IF(結果入力表!G114=\"\",\"\",結果入力表!G114)","v":"w"},{"$f":"IF(結果入力表!G142=\"\",\"\",結果入力表!G142)","v":"w"},{"$f":"IF(結果入力表!F156=\"\",\"\",結果入力表!F156)","v":"w"},{"$f":"IF(結果入力表!F170=\"\",\"\",結果入力表!F170)","v":"w"},{"$f":"IF(結果入力表!G191=\"\",\"\",結果入力表!G191)","v":"w"},8,2,1033,{"$f":"IF(N45=\"\",\"\",IF(C45=登録!$I$8,P45,N45*登録!$I$8+SUM(D45:M45)/★個人成績表★!C45*登録!$I$8))","v":1033},"",1033,{"$f":"IF(COUNTBLANK(D45:M45)=10,\"\",RANK(AA45,$AA41:$AA47))","v":2},{"$f":"IF(★対戦リーグ表★!BS46=0,\"\",★対戦リーグ表★!BS46)","v":116},null,"小原　嘉丈",8,2,1033,8001033]
[null,{"$f":"IF(登録!AG43=0,\"\",登録!AG43)","v":"乾　伸綱"},{"$f":"登録!U21","v":120},{"$f":"IF(結果入力表!G14=\"\",\"\",結果入力表!G14)","v":"w"},{"$f":"IF(結果入力表!G42=\"\",\"\",結果入力表!G42)","v":"w"},{"$f":"IF(結果入力表!F56=\"\",\"\",結果入力表!F56)","v":"w"},{"$f":"IF(結果入力表!F70=\"\",\"\",結果入力表!F70)","v":"w"},{"$f":"IF(結果入力表!G91=\"\",\"\",結果入力表!G91)","v":"w"},{"$f":"IF(結果入力表!G115=\"\",\"\",結果入力表!G115)","v":115},{"$f":"IF(結果入力表!G143=\"\",\"\",結果入力表!G143)","v":"w"},{"$f":"IF(結果入力表!F157=\"\",\"\",結果入力表!F157)","v":85},{"$f":"IF(結果入力表!F171=\"\",\"\",結果入力表!F171)","v":"w"},{"$f":"IF(結果入力表!G192=\"\",\"\",結果入力表!G192)","v":"w"},8,2,1160,{"$f":"IF(N46=\"\",\"\",IF(C46=登録!$I$8,P46,N46*登録!$I$8+SUM(D46:M46)/★個人成績表★!C46*登録!$I$8))","v":1160},"",1160,{"$f":"IF(COUNTBLANK(D46:M46)=10,\"\",RANK(AA46,$AA41:$AA47))","v":1},{"$f":"IF(★対戦リーグ表★!BS47=0,\"\",★対戦リーグ表★!BS47)","v":""},null,"乾　伸綱",8,2,1160,8001160]
[null,{"$f":"IF(登録!AG44=0,\"\",登録!AG44)","v":"山崎真紀子"},{"$f":"登録!X21","v":100},{"$f":"IF(結果入力表!G15=\"\",\"\",結果入力表!G15)","v":"w"},{"$f":"IF(結果入力表!G43=\"\",\"\",結果入力表!G43)","v":"w"},{"$f":"IF(結果入力表!F57=\"\",\"\",結果入力表!F57)","v":27},{"$f":"IF(結果入力表!F71=\"\",\"\",結果入力表!F71)","v":91},{"$f":"IF(結果入力表!G92=\"\",\"\",結果入力表!G92)","v":88},{"$f":"IF(結果入力表!G116=\"\",\"\",結果入力表!G116)","v":84},{"$f":"IF(結果入力表!G144=\"\",\"\",結果入力表!G144)","v":1},{"$f":"IF(結果入力表!F158=\"\",\"\",結果入力表!F158)","v":61},{"$f":"IF(結果入力表!F172=\"\",\"\",結果入力表!F172)","v":52},{"$f":"IF(結果入力表!G193=\"\",\"\",結果入力表!G193)","v":"w"},3,7,704,{"$f":"IF(N47=\"\",\"\",IF(C47=登録!$I$8,P47,N47*登録!$I$8+SUM(D47:M47)/★個人成績表★!C47*登録!$I$8))","v":844.8},"*",844.8,{"$f":"IF(COUNTBLANK(D47:M47)=10,\"\",RANK(AA47,$AA41:$AA47))","v":6},{"$f":"IF(★対戦リーグ表★!BS48=0,\"\",★対戦リーグ表★!BS48)","v":""},null,"山崎真紀子",3,7,844.8,3000844.8]
[null,"Total",null,null,null,null,null,null,null,null,null,null,null,{"$f":"IF(COUNTBLANK(N41:N47)=7,\"\",SUM(N41:N47))","v":41},{"$f":"IF(COUNTBLANK(O41:O47)=7,\"\",SUM(O41:O47))","v":29},{"$f":"IF(COUNTBLANK(P41:P47)=7,\"\",SUM(P41:P47))","v":6595},{"$f":"IF(COUNTBLANK(Q41:Q47)=7,\"\",SUM(Q41:Q47))","v":6735.8},"*",{"$f":"IF(COUNTBLANK(S41:S47)=7,\"\",IF(Q48=P48,P48,Q48))","v":6735.8},null,null,null,null,41,29,6735.8,41006735.799999997]
[{"$f":"IF(登録!B22=\"\",\"\",登録!B22)","v":"WRC"},{"$f":"B31","v":"Player＼VS"},{"$f":"C31","v":"持点"},{"$f":"IF(登録!$Q$5=5,\"\",登録!BI8)","v":"KRC"},{"$f":"IF(登録!$Q$5=5,\"\",登録!BJ8)","v":"NRC"},{"$f":"IF(登録!$Q$5=5,\"\",登録!BK8)","v":"HRC"},{"$f":"IF(登録!$Q$5=5,\"\",登録!BL8)","v":"ORC"},{"$f":"IF(登録!$Q$5=5,\"\",登録!BM8)","v":"SBC"},{"$f":"D49","v":"KRC"},{"$f":"E49","v":"NRC"},{"$f":"F49","v":"HRC"},{"$f":"G49","v":"ORC"},{"$f":"H49","v":"SBC"},"W","L","TP","(TP)","TP",null,"R","HR",null,"Player","W","L","TP","R_P"]
[null,{"$f":"IF(登録!AG47=0,\"\",登録!AG47)","v":"末岡　修"},{"$f":"IF(登録!F22=\"\",\"\",登録!F22)","v":120},{"$f":"IF(結果入力表!G16=\"\",\"\",結果入力表!G16)","v":48},{"$f":"IF(結果入力表!F30=\"\",\"\",結果入力表!F30)","v":"w"},{"$f":"IF(結果入力表!F44=\"\",\"\",結果入力表!F44)","v":"w"},{"$f":"IF(結果入力表!G65=\"\",\"\",結果入力表!G65)","v":"w"},{"$f":"IF(結果入力表!G93=\"\",\"\",結果入力表!G93)","v":79},{"$f":"IF(結果入力表!G123=\"\",\"\",結果入力表!G123)","v":117},{"$f":"IF(結果入力表!F137=\"\",\"\",結果入力表!F137)","v":"w"},{"$f":"IF(結果入力表!F151=\"\",\"\",結果入力表!F151)","v":"w"},{"$f":"IF(結果入力表!G172=\"\",\"\",結果入力表!G172)","v":"w"},{"$f":"IF(結果入力表!G200=\"\",\"\",結果入力表!G200)","v":87},{"$f":"IF(COUNTBLANK(D50:M50)=10,\"\",COUNTIF(D50:M50,\"w\"))","v":6},{"$f":"IF(COUNTBLANK(D50:M50)=10,\"\",10-COUNTBLANK(D50:M50)-N50)","v":4},{"$f":"IF(N50=\"\",\"\",N50*C50+SUM(D50:M50))","v":1051},{"$f":"IF(N50=\"\",\"\",IF(C50=登録!$I$8,P50,N50*登録!$I$8+SUM(D50:M50)/★個人成績表★!C50*登録!$I$8))","v":1051},"",{"$f":"IF(COUNTBLANK(D50:M50)=10,\"\",Q50)","v":1051},{"$f":"IF(COUNTBLANK(D50:M50)=10,\"\",RANK(AA50,$AA50:$AA56))","v":3},{"$f":"IF(★対戦リーグ表★!BS51=0,\"\",★対戦リーグ表★!BS51)","v":""},null,{"$f":"B50","v":"末岡　修"},{"$f":"N50","v":6},{"$f":"O50","v":4},{"$f":"Q50","v":1051},{"$f":"X50*1000000+Z50","v":6001051}]
[null,{"$f":"IF(登録!AG48=0,\"\",登録!AG48)","v":"和田宗一郎"},{"$f":"IF(登録!I22=\"\",\"\",登録!I22)","v":120},{"$f":"IF(結果入力表!G17=\"\",\"\",結果入力表!G17)","v":33},{"$f":"IF(結果入力表!F31=\"\",\"\",結果入力表!F31)","v":22},{"$f":"IF(結果入力表!F45=\"\",\"\",結果入力表!F45)","v":"w"},{"$f":"IF(結果入力表!G66=\"\",\"\",結果入力表!G66)","v":"w"},{"$f":"IF(結果入力表!G94=\"\",\"\",結果入力表!G94)","v":51},{"$f":"IF(結果入力表!G124=\"\",\"\",結果入力表!G124)","v":61},{"$f":"IF(結果入力表!F138=\"\",\"\",結果入力表!F138)","v":0},{"$f":"IF(結果入力表!F152=\"\",\"\",結果入力表!F152)","v":37},{"$f":"IF(結果入力表!G173=\"\",\"\",結果入力表!G173)","v":83},{"$f":"IF(結果入力表!G201=\"\",\"\",結果入力表!G201)","v":"w"},{"$f":"IF(COUNTBLANK(D51:M51)=10,\"\",COUNTIF(D51:M51,\"w\"))","v":3},{"$f":"IF(COUNTBLANK(D51:M51)=10,\"\",10-COUNTBLANK(D51:M51)-N51)","v":7},{"$f":"IF(N51=\"\",\"\",N51*C51+SUM(D51:M51))","v":647},{"$f":"IF(N51=\"\",\"\",IF(C51=登録!$I$8,P51,N51*登録!$I$8+SUM(D51:M51)/★個人成績表★!C51*登録!$I$8))","v":647},"",647,{"$f":"IF(COUNTBLANK(D51:M51)=10,\"\",RANK(AA51,$AA50:$AA56))","v":6},{"$f":"IF(★対戦リーグ表★!BS52=0,\"\",★対戦リーグ表★!BS52)","v":""},null,"和田宗一郎",3,7,647,3000647]
[null,{"$f":"IF(登録!AG49=0,\"\",登録!AG49)","v":"杉本　博章"},{"$f":"IF(登録!L22=\"\",\"\",登録!L22)","v":120},{"$f":"IF(結果入力表!G18=\"\",\"\",結果入力表!G18)","v":38},{"$f":"IF(結果入力表!F32=\"\",\"\",結果入力表!F32)","v":71},{"$f":"IF(結果入力表!F46=\"\",\"\",結果入力表!F46)","v":"w"},{"$f":"IF(結果入力表!G67=\"\",\"\",結果入力表!G67)","v":"w"},{"$f":"IF(結果入力表!G95=\"\",\"\",結果入力表!G95)","v":87},{"$f":"IF(結果入力表!G125=\"\",\"\",結果入力表!G125)","v":"w"},{"$f":"IF(結果入力表!F139=\"\",\"\",結果入力表!F139)","v":80},{"$f":"IF(結果入力表!F153=\"\",\"\",結果入力表!F153)","v":"w"},{"$f":"IF(結果入力表!G174=\"\",\"\",結果入力表!G174)","v":"w"},{"$f":"IF(結果入力表!G202=\"\",\"\",結果入力表!G202)","v":"w"},6,4,996,{"$f":"IF(N52=\"\",\"\",IF(C52=登録!$I$8,P52,N52*登録!$I$8+SUM(D52:M52)/★個人成績表★!C52*登録!$I$8))","v":996},"",996,{"$f":"IF(COUNTBLANK(D52:M52)=10,\"\",RANK(AA52,$AA50:$AA56))","v":4},{"$f":"IF(★対戦リーグ表★!BS53=0,\"\",★対戦リーグ表★!BS53)","v":""},null,"杉本　博章",6,4,996,6000996]
[null,{"$f":"IF(登録!AG50=0,\"\",登録!AG50)","v":"中本　雅大"},{"$f":"IF(登録!O22=\"\",\"\",登録!O22)","v":120},{"$f":"IF(結果入力表!G19=\"\",\"\",結果入力表!G19)","v":64},{"$f":"IF(結果入力表!F33=\"\",\"\",結果入力表!F33)","v":"w"},{"$f":"IF(結果入力表!F47=\"\",\"\",結果入力表!F47)","v":"w"},{"$f":"IF(結果入力表!G68=\"\",\"\",結果入力表!G68)","v":119},{"$f":"IF(結果入力表!G96=\"\",\"\",結果入力表!G96)","v":"w"},{"$f":"IF(結果入力表!G126=\"\",\"\",結果入力表!G126)","v":"w"},{"$f":"IF(結果入力表!F140=\"\",\"\",結果入力表!F140)","v":68},{"$f":"IF(結果入力表!F154=\"\",\"\",結果入力表!F154)","v":51},{"$f":"IF(結果入力表!G175=\"\",\"\",結果入力表!G175)","v":"w"},{"$f":"IF(結果入力表!G203=\"\",\"\",結果入力表!G203)","v":105},5,5,1007,{"$f":"IF(N53=\"\",\"\",IF(C53=登録!$I$8,P53,N53*登録!$I$8+SUM(D53:M53)/★個人成績表★!C53*登録!$I$8))","v":1007},"",1007,{"$f":"IF(COUNTBLANK(D53:M53)=10,\"\",RANK(AA53,$AA50:$AA56))","v":5},{"$f":"IF(★対戦リーグ表★!BS54=0,\"\",★対戦リーグ表★!BS54)","v":""},null,"中本　雅大",5,5,1007,5001007]
[null,{"$f":"IF(登録!AG51=0,\"\",登録!AG51)","v":"山中　康介"},{"$f":"IF(登録!R22=\"\",\"\",登録!R22)","v":120},{"$f":"IF(結果入力表!G20=\"\",\"\",結果入力表!G20)","v":"w"},{"$f":"IF(結果入力表!F34=\"\",\"\",結果入力表!F34)","v":"w"},{"$f":"IF(結果入力表!F48=\"\",\"\",結果入力表!F48)","v":"w"},{"$f":"IF(結果入力表!G69=\"\",\"\",結果入力表!G69)","v":"w"},{"$f":"IF(結果入力表!G97=\"\",\"\",結果入力表!G97)","v":"w"},{"$f":"IF(結果入力表!G127=\"\",\"\",結果入力表!G127)","v":81},{"$f":"IF(結果入力表!F141=\"\",\"\",結果入力表!F141)","v":0},{"$f":"IF(結果入力表!F155=\"\",\"\",結果入力表!F155)","v":"w"},{"$f":"IF(結果入力表!G176=\"\",\"\",結果入力表!G176)","v":"w"},{"$f":"IF(結果入力表!G204=\"\",\"\",結果入力表!G204)","v":53},7,3,974,{"$f":"IF(N54=\"\",\"\",IF(C54=登録!$I$8,P54,N54*登録!$I$8+SUM(D54:M54)/★個人成績表★!C54*登録!$I$8))","v":974},"",974,{"$f":"IF(COUNTBLANK(D54:M54)=10,\"\",RANK(AA54,$AA50:$AA56))","v":1},{"$f":"IF(★対戦リーグ表★!BS55=0,\"\",★対戦リーグ表★!BS55)","v":105},null,"山中　康介",7,3,974,7000974]
[null,{"$f":"IF(登録!AG52=0,\"\",登録!AG52)","v":"芝先　泰生"},{"$f":"IF(登録!U22=\"\",\"\",登録!U22)","v":120},{"$f":"IF(結果入力表!G21=\"\",\"\",結果入力表!G21)","v":"w"},{"$f":"IF(結果入力表!F35=\"\",\"\",結果入力表!F35)","v":"w"},{"$f":"IF(結果入力表!F49=\"\",\"\",結果入力表!F49)","v":65},{"$f":"IF(結果入力表!G70=\"\",\"\",結果入力表!G70)","v":48},{"$f":"IF(結果入力表!G98=\"\",\"\",結果入力表!G98)","v":29},{"$f":"IF(結果入力表!G121=\"\",\"\",結果入力表!G121)","v":"w"},{"$f":"IF(結果入力表!F135=\"\",\"\",結果入力表!F135)","v":25},{"$f":"IF(結果入力表!F149=\"\",\"\",結果入力表!F149)","v":30},{"$f":"IF(結果入力表!G170=\"\",\"\",結果入力表!G170)","v":20},{"$f":"IF(結果入力表!G198=\"\",\"\",結果入力表!G198)","v":4},3,7,581,{"$f":"IF(N55=\"\",\"\",IF(C55=登録!$I$8,P55,N55*登録!$I$8+SUM(D55:M55)/★個人成績表★!C55*登録!$I$8))","v":581},"",581,{"$f":"IF(COUNTBLANK(D55:M55)=10,\"\",RANK(AA55,$AA50:$AA56))","v":7},{"$f":"IF(★対戦リーグ表★!BS56=0,\"\",★対戦リーグ表★!BS56)","v":"A120"},null,"芝先　泰生",3,7,581,3000581]
[null,{"$f":"IF(登録!AG53=0,\"\",登録!AG53)","v":"松房ゆかり"},{"$f":"IF(登録!X22=\"\",\"\",登録!X22)","v":100},{"$f":"IF(結果入力表!G22=\"\",\"\",結果入力表!G22)","v":"w"},{"$f":"IF(結果入力表!F36=\"\",\"\",結果入力表!F36)","v":"w"},{"$f":"IF(結果入力表!F50=\"\",\"\",結果入力表!F50)","v":46},{"$f":"IF(結果入力表!G71=\"\",\"\",結果入力表!G71)","v":"w"},{"$f":"IF(結果入力表!G99=\"\",\"\",結果入力表!G99)","v":"w"},{"$f":"IF(結果入力表!G122=\"\",\"\",結果入力表!G122)","v":"w"},{"$f":"IF(結果入力表!F136=\"\",\"\",結果入力表!F136)","v":"w"},{"$f":"IF(結果入力表!F150=\"\",\"\",結果入力表!F150)","v":58},{"$f":"IF(結果入力表!G171=\"\",\"\",結果入力表!G171)","v":0},{"$f":"IF(結果入力表!G199=\"\",\"\",結果入力表!G199)","v":"w"},7,3,804,{"$f":"IF(N56=\"\",\"\",IF(C56=登録!$I$8,P56,N56*登録!$I$8+SUM(D56:M56)/★個人成績表★!C56*登録!$I$8))","v":964.8},"*",964.8,{"$f":"IF(COUNTBLANK(D56:M56)=10,\"\",RANK(AA56,$AA50:$AA56))","v":2},{"$f":"IF(★対戦リーグ表★!BS57=0,\"\",★対戦リーグ表★!BS57)","v":""},null,"松房ゆかり",7,3,964.8,7000964.7999999998]
[null,"Total",null,null,null,null,null,null,null,null,null,null,null,{"$f":"IF(COUNTBLANK(N50:N56)=7,\"\",SUM(N50:N56))","v":37},{"$f":"IF(COUNTBLANK(O50:O56)=7,\"\",SUM(O50:O56))","v":33},{"$f":"IF(COUNTBLANK(P50:P56)=7,\"\",SUM(P50:P56))","v":6060},{"$f":"IF(COUNTBLANK(Q50:Q56)=7,\"\",SUM(Q50:Q56))","v":6220.8},"*",{"$f":"IF(COUNTBLANK(S50:S56)=7,\"\",IF(Q57=P57,P57,Q57))","v":6220.8},null,null,null,null,37,33,6220.8,37006220.799999997]
[]
[null,null,null,null,null,null,null,null,null,null,null,null,null,null,null,null,null,"*","：ハンデ換算値"]

{"sheet":"★対戦リーグ表★","index":3,"n_rows":59,"n_cols":71,"rows_kept":59,"cut":false,"hidden":false,"merged":[[1,19,1,21],[1,43,1,45]]}
[null,{"$f":"★個人成績表★!A1&\"  (1/2)\"","v":"第31回　京阪神和奈滋対抗戦　　　(奈良；玉出エース)  (1/2)"},null,null,null,null,null,null,null,null,null,null,null,null,null,null,null,null,null,null,null,null,null,null,null,{"$f":"★個人成績表★!A1&\"  (2/2)\"","v":"第31回　京阪神和奈滋対抗戦　　　(奈良；玉出エース)  (2/2)"},null,null,null,null,null,null,null,null,null,null,null,null,null,null,null,null,null,null,null,null,null,null,null,"HR"]
[null,null,null,null,null,null,null,null,null,null,null,null,null,null,null,null,null,null,null,{"$f":"登録!E3","v":"2019-01-13"},null,null,null,null,null,null,null,null,null,null,null,null,null,null,null,null,null,null,null,null,null,null,null,{"$f":"登録!E3","v":"2019-01-13"},null,null,null,null,null,1,null,{"$f":"VLOOKUP(AX2,$AX$6:$BP$59,3,FALSE)","v":"芝先　泰生"},{"$f":"VLOOKUP(AX2,$AX$6:$BP$59,4,FALSE)","v":"WRC"},{"$f":"VLOOKUP(AX2,$AX$6:$BP$59,15,FALSE)","v":"A120"}]
[null,"1st","Section",null,null,null,null,null,null,null,null,null,null,null,null,null,null,null,null,null,null,null,null,null,null,"2nd","Section",null,null,null,null,null,null,null,null,null,null,null,null,null,null,null,null,null,null,null,null,null,null,null,null,null,null,null,null,null,null,null,null,null,null,null,null,null,null,null,null,null,null,null,"max"]
[]
[null,1,"Player","handy",{"$f":"B6","v":"KRC"},{"$f":"B7","v":"HRC"},{"$f":"B8","v":"SBC"},{"$f":"B9","v":"NRC"},{"$f":"B10","v":"ORC"},{"$f":"B11","v":"WRC"},"W","L","TP","(TP)","TP",null,"R_P","R","HR",null,null,null,null,null,null,1,"Player","handy",{"$f":"$B$6","v":"KRC"},{"$f":"$B$7","v":"HRC"},{"$f":"$B$8","v":"SBC"},{"$f":"$B$9","v":"NRC"},{"$f":"$B$10","v":"ORC"},{"$f":"$B$11","v":"WRC"},"W","L","TP","(TP)","TP",null,"R_P","R","HR",null,null,null,null,null,null,"R",null,null,null,"1G","2G","3G","4G","5G","6G","7G","8G","9G","10G","max","A","B","Ｎ","HR_PT"]
[1,{"$f":"IF(登録!$AF17=\"\",\"\",登録!$B17)","v":"KRC"},{"$f":"VLOOKUP(VALUE(A6&B5),登録!$AE$2:$AH$55,3,FALSE)","v":"松好　太一"},{"$f":"VLOOKUP(VALUE(A6&B5),登録!$AE$2:$AH$55,4,FALSE)","v":120},null,{"$f":"★個人成績表★!H5","v":"w"},{"$f":"★個人成績表★!G5","v":83},{"$f":"★個人成績表★!F5","v":83},{"$f":"★個人成績表★!E5","v":105},{"$f":"★個人成績表★!D5","v":"w"},{"$f":"IF(COUNTBLANK(E6:J6)=6,\"\",COUNTIF(E6:J6,\"w\"))","v":2},{"$f":"IF(COUNTBLANK(E6:J6)=6,\"\",6-COUNTBLANK(E6:J6)-K6)","v":3},{"$f":"K6*D6+SUM(E6:J6)","v":511},{"$f":"M6*登録!$I$8/★対戦リーグ表★!D6","v":511},{"$f":"IF(ISERROR(N6),\"\",IF(M6=N6,\"\",\"*\"))","v":""},{"$f":"IF(COUNTBLANK(E6:J6)=6,\"\",N6)","v":511},{"$f":"K6*100000+N6","v":200511},{"$f":"IF(COUNTBLANK(E6:J6)=6,\"\",RANK(Q6,Q6:Q11))","v":4},null,{"$f":"IF(結果入力表!E100=\"\",\"\",結果入力表!E100)","v":""},{"$f":"IF(結果入力表!E79=\"\",\"\",結果入力表!E79)","v":""},{"$f":"IF(結果入力表!E58=\"\",\"\",結果入力表!E58)","v":""},{"$f":"IF(結果入力表!E37=\"\",\"\",結果入力表!E37)","v":""},{"$f":"IF(結果入力表!E16=\"\",\"\",結果入力表!E16)","v":""},11,{"$f":"IF(登録!$AF17=\"\",\"\",登録!$B17)","v":"KRC"},{"$f":"VLOOKUP(Y6,登録!$AE$2:$AH$55,3,FALSE)","v":"松好　太一"},{"$f":"VLOOKUP(Y6,登録!$AE$2:$AH$55,4,FALSE)","v":120},null,{"$f":"★個人成績表★!M5","v":"w"},{"$f":"★個人成績表★!L5","v":"w"},{"$f":"★個人成績表★!K5","v":"w"},{"$f":"★個人成績表★!J5","v":57},{"$f":"★個人成績表★!I5","v":97},{"$f":"IF(COUNTBLANK(AC6:AH6)=6,\"\",COUNTIF(AC6:AH6,\"w\"))","v":3},{"$f":"IF(COUNTBLANK(AC6:AH6)=6,\"\",6-COUNTBLANK(AC6:AH6)-AI6)","v":2},{"$f":"AI6*AB6+SUM(AC6:AH6)","v":514},{"$f":"AK6*登録!$I$8/★対戦リーグ表★!AB6","v":514},{"$f":"IF(ISERROR(AL6),\"\",IF(AK6=AL6,\"\",\"*\"))","v":""},{"$f":"IF(COUNTBLANK(AC6:AH6)=6,\"\",AL6)","v":514},{"$f":"AI6*100000+AL6","v":300514},{"$f":"IF(COUNTBLANK(AC6:AH6)=6,\"\",RANK(AO6,AO6:AO11))","v":3},null,{"$f":"IF(結果入力表!E205=\"\",\"\",結果入力表!E205)","v":""},{"$f":"IF(結果入力表!E184=\"\",\"\",結果入力表!E184)","v":""},{"$f":"IF(結果入力表!E163=\"\",\"\",結果入力表!E163)","v":""},{"$f":"IF(結果入力表!E142=\"\",\"\",結果入力表!E142)","v":""},{"$f":"IF(結果入力表!E121=\"\",\"\",結果入力表!E121)","v":""},null,{"$f":"RANK(BP6,$BP$6:$BP$59)","v":16},null,{"$f":"C6","v":"松好　太一"},{"$f":"B6","v":"KRC"},{"$f":"IF(LEFT(T6,1)=\"A\",\"A\",IF(LEFT(T6,1)=\"B\",\"B\",T6))","v":""},{"$f":"IF(LEFT(U6,1)=\"A\",\"A\",IF(LEFT(U6,1)=\"B\",\"B\",U6))","v":""},{"$f":"IF(LEFT(V6,1)=\"A\",\"A\",IF(LEFT(V6,1)=\"B\",\"B\",V6))","v":""},{"$f":"IF(LEFT(W6,1)=\"A\",\"A\",IF(LEFT(W6,1)=\"B\",\"B\",W6))","v":""},{"$f":"IF(LEFT(X6,1)=\"A\",\"A\",IF(LEFT(X6,1)=\"B\",\"B\",X6))","v":""},{"$f":"IF(LEFT(AR6,1)=\"A\",\"A\",IF(LEFT(AR6,1)=\"B\",\"B\",AR6))","v":""},{"$f":"IF(LEFT(AS6,1)=\"A\",\"A\",IF(LEFT(AS6,1)=\"B\",\"B\",AS6))","v":""},{"$f":"IF(LEFT(AT6,1)=\"A\",\"A\",IF(LEFT(AT6,1)=\"B\",\"B\",AT6))","v":""},{"$f":"IF(LEFT(AU6,1)=\"A\",\"A\",IF(LEFT(AU6,1)=\"B\",\"B\",AU6))","v":""},{"$f":"IF(LEFT(AV6,1)=\"A\",\"A\",IF(LEFT(AV6,1)=\"B\",\"B\",AV6))","v":""},{"$f":"IF(BM6>0,\"A\"&登録!$I$8,IF(BN6>0,\"B\"&登録!$I$8,BO6))","v":0},{"$f":"COUNTIF($BB6:$BK6,BM$5)","v":0},0,{"$f":"MAX(BB6:BK6)","v":0},{"$f":"BM6*10000+BN6*1000+BO6","v":0},null,{"$f":"★個人成績表★!B5","v":"松好　太一"},{"$f":"VLOOKUP(BR6,$AZ$6:$BL$59,13,FALSE)","v":0}]
[2,{"$f":"IF(登録!$B18=\"\",\"\",登録!$B18)","v":"HRC"},{"$f":"VLOOKUP(VALUE(A7&B5),登録!$AE$2:$AH$55,3,FALSE)","v":"鐵山　泰三"},{"$f":"VLOOKUP(VALUE(A7&B5),登録!$AE$2:$AH$55,4,FALSE)","v":120},{"$f":"★個人成績表★!H14","v":100},null,{"$f":"★個人成績表★!E14","v":"w"},{"$f":"★個人成績表★!G14","v":"w"},{"$f":"★個人成績表★!D14","v":"w"},{"$f":"★個人成績表★!F14","v":13},3,2,473,{"$f":"M7*登録!$I$8/★対戦リーグ表★!D7","v":473},"",473,{"$f":"K7*100000+N7","v":300473},{"$f":"IF(COUNTBLANK(E7:J7)=6,\"\",RANK(Q7,Q6:Q11))","v":3},{"$f":"IF(結果入力表!H100=\"\",\"\",結果入力表!H100)","v":""},null,{"$f":"IF(結果入力表!E23=\"\",\"\",結果入力表!E23)","v":""},{"$f":"IF(結果入力表!H72=\"\",\"\",結果入力表!H72)","v":""},{"$f":"IF(結果入力表!E9=\"\",\"\",結果入力表!E9)","v":""},{"$f":"IF(結果入力表!H44=\"\",\"\",結果入力表!H44)","v":""},22,{"$f":"IF(登録!$B18=\"\",\"\",登録!$B18)","v":"HRC"},{"$f":"VLOOKUP(Y7,登録!$AE$2:$AH$55,3,FALSE)","v":"堂園　雅也"},{"$f":"VLOOKUP(Y7,登録!$AE$2:$AH$55,4,FALSE)","v":120},{"$f":"★個人成績表★!M15","v":41},null,{"$f":"★個人成績表★!J15","v":"w"},{"$f":"★個人成績表★!L15","v":"w"},{"$f":"★個人成績表★!I15","v":114},{"$f":"★個人成績表★!K15","v":"w"},3,2,515,{"$f":"AK7*登録!$I$8/★対戦リーグ表★!AB7","v":515},"",515,{"$f":"AI7*100000+AL7","v":300515},{"$f":"IF(COUNTBLANK(AC7:AH7)=6,\"\",RANK(AO7,AO6:AO11))","v":2},{"$f":"IF(結果入力表!H205=\"\",\"\",結果入力表!H205)","v":""},null,{"$f":"IF(結果入力表!E128=\"\",\"\",結果入力表!E128)","v":104},{"$f":"IF(結果入力表!H177=\"\",\"\",結果入力表!H177)","v":""},{"$f":"IF(結果入力表!E114=\"\",\"\",結果入力表!E114)","v":""},{"$f":"IF(結果入力表!H149=\"\",\"\",結果入力表!H149)","v":""},null,6,null,"鐵山　泰三","HRC",{"$f":"IF(LEFT(S7,1)=\"A\",\"A\",IF(LEFT(S7,1)=\"B\",\"B\",S7))","v":""},{"$f":"IF(LEFT(U7,1)=\"A\",\"A\",IF(LEFT(U7,1)=\"B\",\"B\",U7))","v":""},{"$f":"IF(LEFT(V7,1)=\"A\",\"A\",IF(LEFT(V7,1)=\"B\",\"B\",V7))","v":""},{"$f":"IF(LEFT(W7,1)=\"A\",\"A\",IF(LEFT(W7,1)=\"B\",\"B\",W7))","v":""},{"$f":"IF(LEFT(X7,1)=\"A\",\"A\",IF(LEFT(X7,1)=\"B\",\"B\",X7))","v":""},{"$f":"IF(LEFT(AQ55,1)=\"A\",\"A\",IF(LEFT(AQ55,1)=\"B\",\"B\",AQ55))","v":128},{"$f":"IF(LEFT(AS55,1)=\"A\",\"A\",IF(LEFT(AS55,1)=\"B\",\"B\",AS55))","v":""},{"$f":"IF(LEFT(AT55,1)=\"A\",\"A\",IF(LEFT(AT55,1)=\"B\",\"B\",AT55))","v":""},{"$f":"IF(LEFT(AU55,1)=\"A\",\"A\",IF(LEFT(AU55,1)=\"B\",\"B\",AU55))","v":""},{"$f":"IF(LEFT(AV55,1)=\"A\",\"A\",IF(LEFT(AV55,1)=\"B\",\"B\",AV55))","v":""},{"$f":"IF(BM7>0,\"A\"&登録!$I$8,IF(BN7>0,\"B\"&登録!$I$8,BO7))","v":128},0,0,128,128,null,{"$f":"★個人成績表★!B6","v":"清水　義晴"},0]
[3,{"$f":"IF(登録!$B19=\"\",\"\",登録!$B19)","v":"SBC"},{"$f":"VLOOKUP(VALUE(A8&B5),登録!$AE$2:$AH$55,3,FALSE)","v":"林　秀忠"},{"$f":"VLOOKUP(VALUE(A8&B5),登録!$AE$2:$AH$55,4,FALSE)","v":120},{"$f":"★個人成績表★!G23","v":"w"},{"$f":"★個人成績表★!E23","v":31},null,{"$f":"★個人成績表★!D23","v":"w"},{"$f":"★個人成績表★!F23","v":"w"},{"$f":"★個人成績表★!H23","v":"w"},4,1,511,{"$f":"M8*登録!$I$8/★対戦リーグ表★!D8","v":511},"",511,{"$f":"K8*100000+N8","v":400511},{"$f":"IF(COUNTBLANK(E8:J8)=6,\"\",RANK(Q8,Q6:Q11))","v":1},{"$f":"IF(結果入力表!H79=\"\",\"\",結果入力表!H79)","v":""},{"$f":"IF(結果入力表!H23=\"\",\"\",結果入力表!H23)","v":""},null,{"$f":"IF(結果入力表!E2=\"\",\"\",結果入力表!E2)","v":""},{"$f":"IF(結果入力表!H51=\"\",\"\",結果入力表!H51)","v":"A120"},{"$f":"IF(結果入力表!E93=\"\",\"\",結果入力表!E93)","v":""},33,{"$f":"IF(登録!$B19=\"\",\"\",登録!$B19)","v":"SBC"},{"$f":"VLOOKUP(Y8,登録!$AE$2:$AH$55,3,FALSE)","v":"山中　康寛"},{"$f":"VLOOKUP(Y8,登録!$AE$2:$AH$55,4,FALSE)","v":120},{"$f":"★個人成績表★!L25","v":71},{"$f":"★個人成績表★!J25","v":0},null,{"$f":"★個人成績表★!I25","v":"w"},{"$f":"★個人成績表★!K25","v":90},{"$f":"★個人成績表★!M25","v":"w"},2,3,401,{"$f":"AK8*登録!$I$8/★対戦リーグ表★!AB8","v":401},"",401,{"$f":"AI8*100000+AL8","v":200401},{"$f":"IF(COUNTBLANK(AC8:AH8)=6,\"\",RANK(AO8,AO6:AO11))","v":4},{"$f":"IF(結果入力表!H184=\"\",\"\",結果入力表!H184)","v":""},{"$f":"IF(結果入力表!H128=\"\",\"\",結果入力表!H128)","v":""},null,{"$f":"IF(結果入力表!E107=\"\",\"\",結果入力表!E107)","v":""},{"$f":"IF(結果入力表!H156=\"\",\"\",結果入力表!H156)","v":""},{"$f":"IF(結果入力表!E198=\"\",\"\",結果入力表!E198)","v":""},null,2,null,"林　秀忠","SBC","","",{"$f":"IF(LEFT(V8,1)=\"A\",\"A\",IF(LEFT(V8,1)=\"B\",\"B\",V8))","v":""},{"$f":"IF(LEFT(W8,1)=\"A\",\"A\",IF(LEFT(W8,1)=\"B\",\"B\",W8))","v":"A"},{"$f":"IF(LEFT(X8,1)=\"A\",\"A\",IF(LEFT(X8,1)=\"B\",\"B\",X8))","v":""},{"$f":"IF(LEFT(AQ48,1)=\"A\",\"A\",IF(LEFT(AQ48,1)=\"B\",\"B\",AQ48))","v":""},{"$f":"IF(LEFT(AR48,1)=\"A\",\"A\",IF(LEFT(AR48,1)=\"B\",\"B\",AR48))","v":""},{"$f":"IF(LEFT(AT48,1)=\"A\",\"A\",IF(LEFT(AT48,1)=\"B\",\"B\",AT48))","v":""},{"$f":"IF(LEFT(AU48,1)=\"A\",\"A\",IF(LEFT(AU48,1)=\"B\",\"B\",AU48))","v":""},{"$f":"IF(LEFT(AV48,1)=\"A\",\"A\",IF(LEFT(AV48,1)=\"B\",\"B\",AV48))","v":""},{"$f":"IF(BM8>0,\"A\"&登録!$I$8,IF(BN8>0,\"B\"&登録!$I$8,BO8))","v":"A120"},1,0,0,10000,null,{"$f":"★個人成績表★!B7","v":"鈴木　康文"},107]
[4,{"$f":"IF(登録!$B20=\"\",\"\",登録!$B20)","v":"NRC"},{"$f":"VLOOKUP(VALUE(A9&B5),登録!$AE$2:$AH$55,3,FALSE)","v":"吉向　翔平"},{"$f":"VLOOKUP(VALUE(A9&B5),登録!$AE$2:$AH$55,4,FALSE)","v":120},{"$f":"★個人成績表★!F32","v":"w"},{"$f":"★個人成績表★!G32","v":56},{"$f":"★個人成績表★!D32","v":55},null,{"$f":"★個人成績表★!H32","v":63},{"$f":"★個人成績表★!E32","v":25},1,4,319,{"$f":"M9*登録!$I$8/★対戦リーグ表★!D9","v":319},"",319,{"$f":"K9*100000+N9","v":100319},{"$f":"IF(COUNTBLANK(E9:J9)=6,\"\",RANK(Q9,Q6:Q11))","v":6},{"$f":"IF(結果入力表!H58=\"\",\"\",結果入力表!H58)","v":""},{"$f":"IF(結果入力表!E72=\"\",\"\",結果入力表!E72)","v":""},{"$f":"IF(結果入力表!H2=\"\",\"\",結果入力表!H2)","v":""},null,{"$f":"IF(結果入力表!E86=\"\",\"\",結果入力表!E86)","v":""},{"$f":"IF(結果入力表!H30=\"\",\"\",結果入力表!H30)","v":""},44,{"$f":"IF(登録!$B20=\"\",\"\",登録!$B20)","v":"NRC"},{"$f":"VLOOKUP(Y9,登録!$AE$2:$AH$55,3,FALSE)","v":"植田　慎也"},{"$f":"VLOOKUP(Y9,登録!$AE$2:$AH$55,4,FALSE)","v":120},{"$f":"★個人成績表★!K35","v":24},{"$f":"★個人成績表★!L35","v":29},{"$f":"★個人成績表★!I35","v":17},null,{"$f":"★個人成績表★!M35","v":118},{"$f":"★個人成績表★!J35","v":"w"},1,4,308,{"$f":"AK9*登録!$I$8/★対戦リーグ表★!AB9","v":308},"",308,{"$f":"AI9*100000+AL9","v":100308},{"$f":"IF(COUNTBLANK(AC9:AH9)=6,\"\",RANK(AO9,AO6:AO11))","v":5},{"$f":"IF(結果入力表!H163=\"\",\"\",結果入力表!H163)","v":""},{"$f":"IF(結果入力表!E177=\"\",\"\",結果入力表!E177)","v":""},{"$f":"IF(結果入力表!H107=\"\",\"\",結果入力表!H107)","v":""},null,{"$f":"IF(結果入力表!E191=\"\",\"\",結果入力表!E191)","v":""},{"$f":"IF(結果入力表!H135=\"\",\"\",結果入力表!H135)","v":106},null,16,null,"吉向　翔平","NRC","","","",{"$f":"IF(LEFT(W9,1)=\"A\",\"A\",IF(LEFT(W9,1)=\"B\",\"B\",W9))","v":""},{"$f":"IF(LEFT(X9,1)=\"A\",\"A\",IF(LEFT(X9,1)=\"B\",\"B\",X9))","v":""},{"$f":"IF(LEFT(AQ41,1)=\"A\",\"A\",IF(LEFT(AQ41,1)=\"B\",\"B\",AQ41))","v":""},{"$f":"IF(LEFT(AR41,1)=\"A\",\"A\",IF(LEFT(AR41,1)=\"B\",\"B\",AR41))","v":""},{"$f":"IF(LEFT(AS41,1)=\"A\",\"A\",IF(LEFT(AS41,1)=\"B\",\"B\",AS41))","v":""},{"$f":"IF(LEFT(AU41,1)=\"A\",\"A\",IF(LEFT(AU41,1)=\"B\",\"B\",AU41))","v":""},{"$f":"IF(LEFT(AV41,1)=\"A\",\"A\",IF(LEFT(AV41,1)=\"B\",\"B\",AV41))","v":""},{"$f":"IF(BM9>0,\"A\"&登録!$I$8,IF(BN9>0,\"B\"&登録!$I$8,BO9))","v":0},0,0,0,0,null,{"$f":"★個人成績表★!B8","v":"早川　徹"},0]
[5,{"$f":"IF(登録!$B21=\"\",\"\",登録!$B21)","v":"ORC"},{"$f":"VLOOKUP(VALUE(A10&B5),登録!$AE$2:$AH$55,3,FALSE)","v":"松居　勝巳"},{"$f":"VLOOKUP(VALUE(A10&B5),登録!$AE$2:$AH$55,4,FALSE)","v":120},{"$f":"★個人成績表★!E41","v":"w"},{"$f":"★個人成績表★!D41","v":104},{"$f":"★個人成績表★!F41","v":0},{"$f":"★個人成績表★!H41","v":"w"},null,{"$f":"★個人成績表★!G41","v":58},2,3,402,{"$f":"M10*登録!$I$8/★対戦リーグ表★!D10","v":402},"",402,{"$f":"K10*100000+N10","v":200402},{"$f":"IF(COUNTBLANK(E10:J10)=6,\"\",RANK(Q10,Q6:Q11))","v":5},{"$f":"IF(結果入力表!H37=\"\",\"\",結果入力表!H37)","v":""},{"$f":"IF(結果入力表!H9=\"\",\"\",結果入力表!H9)","v":""},{"$f":"IF(結果入力表!E51=\"\",\"\",結果入力表!E51)","v":""},{"$f":"IF(結果入力表!H86=\"\",\"\",結果入力表!H86)","v":""},null,{"$f":"IF(結果入力表!E65=\"\",\"\",結果入力表!E65)","v":""},55,{"$f":"IF(登録!$B21=\"\",\"\",登録!$B21)","v":"ORC"},{"$f":"VLOOKUP(Y10,登録!$AE$2:$AH$55,3,FALSE)","v":"小原　嘉丈"},{"$f":"VLOOKUP(Y10,登録!$AE$2:$AH$55,4,FALSE)","v":120},{"$f":"★個人成績表★!J45","v":"w"},{"$f":"★個人成績表★!I45","v":"w"},{"$f":"★個人成績表★!K45","v":"w"},{"$f":"★個人成績表★!M45","v":"w"},null,{"$f":"★個人成績表★!L45","v":"w"},5,0,600,{"$f":"AK10*登録!$I$8/★対戦リーグ表★!AB10","v":600},"",600,{"$f":"AI10*100000+AL10","v":500600},{"$f":"IF(COUNTBLANK(AC10:AH10)=6,\"\",RANK(AO10,AO6:AO11))","v":1},{"$f":"IF(結果入力表!H142=\"\",\"\",結果入力表!H142)","v":""},{"$f":"IF(結果入力表!H114=\"\",\"\",結果入力表!H114)","v":""},{"$f":"IF(結果入力表!E156=\"\",\"\",結果入力表!E156)","v":""},{"$f":"IF(結果入力表!H191=\"\",\"\",結果入力表!H191)","v":""},null,{"$f":"IF(結果入力表!E170=\"\",\"\",結果入力表!E170)","v":""},null,16,null,"松居　勝巳","ORC","","","","",{"$f":"IF(LEFT(X10,1)=\"A\",\"A\",IF(LEFT(X10,1)=\"B\",\"B\",X10))","v":""},{"$f":"IF(LEFT(AQ34,1)=\"A\",\"A\",IF(LEFT(AQ34,1)=\"B\",\"B\",AQ34))","v":""},{"$f":"IF(LEFT(AR34,1)=\"A\",\"A\",IF(LEFT(AR34,1)=\"B\",\"B\",AR34))","v":""},{"$f":"IF(LEFT(AS34,1)=\"A\",\"A\",IF(LEFT(AS34,1)=\"B\",\"B\",AS34))","v":""},{"$f":"IF(LEFT(AT34,1)=\"A\",\"A\",IF(LEFT(AT34,1)=\"B\",\"B\",AT34))","v":""},{"$f":"IF(LEFT(AV34,1)=\"A\",\"A\",IF(LEFT(AV34,1)=\"B\",\"B\",AV34))","v":""},{"$f":"IF(BM10>0,\"A\"&登録!$I$8,IF(BN10>0,\"B\"&登録!$I$8,BO10))","v":0},0,0,0,0,null,{"$f":"★個人成績表★!B9","v":"井関　一成"},0]
[6,{"$f":"IF(登録!$B22=\"\",\"\",登録!$B22)","v":"WRC"},{"$f":"IF(B11=\"\",\"\",VLOOKUP(VALUE(A11&B5),登録!$AE$2:$AH$55,3,FALSE))","v":"末岡　修"},{"$f":"IF(B11=\"\",\"\",VLOOKUP(VALUE(A11&B5),登録!$AE$2:$AH$55,4,FALSE))","v":120},{"$f":"★個人成績表★!D50","v":48},{"$f":"★個人成績表★!F50","v":"w"},{"$f":"★個人成績表★!H50","v":79},{"$f":"★個人成績表★!E50","v":"w"},{"$f":"★個人成績表★!G50","v":"w"},null,3,2,487,{"$f":"M11*登録!$I$8/★対戦リーグ表★!D11","v":487},"",487,{"$f":"IF(D11=\"\",\"\",K11*100000+N11)","v":300487},{"$f":"IF(COUNTBLANK(E11:J11)=6,\"\",RANK(Q11,Q6:Q11))","v":2},{"$f":"IF(結果入力表!H16=\"\",\"\",結果入力表!H16)","v":""},{"$f":"IF(結果入力表!E44=\"\",\"\",結果入力表!E44)","v":""},{"$f":"IF(結果入力表!H93=\"\",\"\",結果入力表!H93)","v":""},{"$f":"IF(結果入力表!E30=\"\",\"\",結果入力表!E30)","v":""},{"$f":"IF(結果入力表!H65=\"\",\"\",結果入力表!H65)","v":""},null,66,{"$f":"IF(登録!$B22=\"\",\"\",登録!$B22)","v":"WRC"},{"$f":"IF(Z11=\"\",\"\",VLOOKUP(Y11,登録!$AE$2:$AH$55,3,FALSE))","v":"芝先　泰生"},{"$f":"IF(Z11=\"\",\"\",VLOOKUP(Y11,登録!$AE$2:$AH$55,4,FALSE))","v":120},{"$f":"★個人成績表★!I55","v":"w"},{"$f":"★個人成績表★!K55","v":30},{"$f":"★個人成績表★!M55","v":4},{"$f":"★個人成績表★!J55","v":25},{"$f":"★個人成績表★!L55","v":20},null,1,4,199,{"$f":"AK11*登録!$I$8/★対戦リーグ表★!AB11","v":199},"",199,{"$f":"IF(AB11=\"\",\"\",AI11*100000+AL11)","v":100199},{"$f":"IF(COUNTBLANK(AC11:AH11)=6,\"\",RANK(AO11,AO6:AO11))","v":6},{"$f":"IF(結果入力表!H121=\"\",\"\",結果入力表!H121)","v":""},{"$f":"IF(結果入力表!E149=\"\",\"\",結果入力表!E149)","v":""},{"$f":"IF(結果入力表!H198=\"\",\"\",結果入力表!H198)","v":""},{"$f":"IF(結果入力表!E135=\"\",\"\",結果入力表!E135)","v":""},{"$f":"IF(結果入力表!H170=\"\",\"\",結果入力表!H170)","v":""},null,null,16,null,"末岡　修","WRC","","","","","",{"$f":"IF(LEFT(AQ27,1)=\"A\",\"A\",IF(LEFT(AQ27,1)=\"B\",\"B\",AQ27))","v":""},{"$f":"IF(LEFT(AR27,1)=\"A\",\"A\",IF(LEFT(AR27,1)=\"B\",\"B\",AR27))","v":""},{"$f":"IF(LEFT(AS27,1)=\"A\",\"A\",IF(LEFT(AS27,1)=\"B\",\"B\",AS27))","v":""},{"$f":"IF(LEFT(AT27,1)=\"A\",\"A\",IF(LEFT(AT27,1)=\"B\",\"B\",AT27))","v":""},{"$f":"IF(LEFT(AU27,1)=\"A\",\"A\",IF(LEFT(AU27,1)=\"B\",\"B\",AU27))","v":""},{"$f":"IF(BM11>0,\"A\"&登録!$I$8,IF(BN11>0,\"B\"&登録!$I$8,BO11))","v":0},0,0,0,0,null,{"$f":"★個人成績表★!B10","v":"今村　哲也"},0]
[null,null,null,null,null,null,null,null,null,null,null,null,null,null,null,null,null,null,null,null,null,null,null,null,null,null,null,null,null,null,null,null,null,null,null,null,null,null,null,null,null,null,null,null,null,null,null,null,null,null,null,null,null,null,null,null,null,null,null,null,null,null,null,null,null,null,null,null,null,{"$f":"★個人成績表★!B11","v":"森田由佳里"},0]
[null,2,"Player","handy",{"$f":"B14","v":"KRC"},{"$f":"B15","v":"HRC"},{"$f":"B16","v":"SBC"},{"$f":"B17","v":"NRC"},{"$f":"B18","v":"ORC"},{"$f":"B19","v":"WRC"},"W","L","TP","(TP)","TP",null,"R_P","R",null,null,null,null,null,null,null,2,"Player","handy",{"$f":"$B$6","v":"KRC"},{"$f":"$B$7","v":"HRC"},{"$f":"$B$8","v":"SBC"},{"$f":"$B$9","v":"NRC"},{"$f":"$B$10","v":"ORC"},{"$f":"$B$11","v":"WRC"},"W","L","TP","(TP)","TP",null,"R_P","R"]
[1,{"$f":"B6","v":"KRC"},{"$f":"VLOOKUP(VALUE(A14&B13),登録!$AE$2:$AH$55,3,FALSE)","v":"清水　義晴"},{"$f":"VLOOKUP(VALUE(A14&B13),登録!$AE$2:$AH$55,4,FALSE)","v":120},null,{"$f":"★個人成績表★!H6","v":"w"},{"$f":"★個人成績表★!G6","v":22},{"$f":"★個人成績表★!F6","v":58},{"$f":"★個人成績表★!E6","v":"w"},{"$f":"★個人成績表★!D6","v":"w"},{"$f":"IF(COUNTBLANK(E14:J14)=6,\"\",COUNTIF(E14:J14,\"w\"))","v":3},{"$f":"IF(COUNTBLANK(E14:J14)=6,\"\",6-COUNTBLANK(E14:J14)-K14)","v":2},{"$f":"K14*D14+SUM(E14:J14)","v":440},{"$f":"M14*登録!$I$8/★対戦リーグ表★!D14","v":440},{"$f":"IF(ISERROR(N14),\"\",IF(M14=N14,\"\",\"*\"))","v":""},{"$f":"IF(COUNTBLANK(E14:J14)=6,\"\",N14)","v":440},{"$f":"K14*100000+N14","v":300440},{"$f":"IF(COUNTBLANK(E14:J14)=6,\"\",RANK(Q14,Q14:Q19))","v":4},null,{"$f":"IF(結果入力表!E101=\"\",\"\",結果入力表!E101)","v":""},{"$f":"IF(結果入力表!E80=\"\",\"\",結果入力表!E80)","v":""},{"$f":"IF(結果入力表!E59=\"\",\"\",結果入力表!E59)","v":""},{"$f":"IF(結果入力表!E38=\"\",\"\",結果入力表!E38)","v":""},{"$f":"IF(結果入力表!E17=\"\",\"\",結果入力表!E17)","v":""},12,{"$f":"Z6","v":"KRC"},{"$f":"VLOOKUP(Y14,登録!$AE$2:$AH$55,3,FALSE)","v":"清水　義晴"},{"$f":"VLOOKUP(Y14,登録!$AE$2:$AH$55,4,FALSE)","v":120},null,{"$f":"★個人成績表★!M6","v":117},{"$f":"★個人成績表★!L6","v":"w"},{"$f":"★個人成績表★!K6","v":"w"},{"$f":"★個人成績表★!J6","v":108},{"$f":"★個人成績表★!I6","v":5},{"$f":"IF(COUNTBLANK(AC14:AH14)=6,\"\",COUNTIF(AC14:AH14,\"w\"))","v":2},{"$f":"IF(COUNTBLANK(AC14:AH14)=6,\"\",6-COUNTBLANK(AC14:AH14)-AI14)","v":3},{"$f":"AI14*AB14+SUM(AC14:AH14)","v":470},{"$f":"AK14*登録!$I$8/★対戦リーグ表★!AB14","v":470},{"$f":"IF(ISERROR(AL14),\"\",IF(AK14=AL14,\"\",\"*\"))","v":""},{"$f":"IF(COUNTBLANK(AC14:AH14)=6,\"\",AL14)","v":470},{"$f":"AI14*100000+AL14","v":200470},{"$f":"IF(COUNTBLANK(AC14:AH14)=6,\"\",RANK(AO14,AO14:AO19))","v":5},null,{"$f":"IF(結果入力表!E206=\"\",\"\",結果入力表!E206)","v":""},{"$f":"IF(結果入力表!E185=\"\",\"\",結果入力表!E185)","v":""},{"$f":"IF(結果入力表!E164=\"\",\"\",結果入力表!E164)","v":""},{"$f":"IF(結果入力表!E143=\"\",\"\",結果入力表!E143)","v":""},{"$f":"IF(結果入力表!E122=\"\",\"\",結果入力表!E122)","v":""},null,{"$f":"RANK(BP14,$BP$6:$BP$59)","v":16},null,{"$f":"C14","v":"清水　義晴"},{"$f":"B14","v":"KRC"},{"$f":"IF(LEFT(T14,1)=\"A\",\"A\",IF(LEFT(T14,1)=\"B\",\"B\",T14))","v":""},{"$f":"IF(LEFT(U14,1)=\"A\",\"A\",IF(LEFT(U14,1)=\"B\",\"B\",U14))","v":""},{"$f":"IF(LEFT(V14,1)=\"A\",\"A\",IF(LEFT(V14,1)=\"B\",\"B\",V14))","v":""},{"$f":"IF(LEFT(W14,1)=\"A\",\"A\",IF(LEFT(W14,1)=\"B\",\"B\",W14))","v":""},{"$f":"IF(LEFT(X14,1)=\"A\",\"A\",IF(LEFT(X14,1)=\"B\",\"B\",X14))","v":""},{"$f":"IF(LEFT(AR14,1)=\"A\",\"A\",IF(LEFT(AR14,1)=\"B\",\"B\",AR14))","v":""},{"$f":"IF(LEFT(AS14,1)=\"A\",\"A\",IF(LEFT(AS14,1)=\"B\",\"B\",AS14))","v":""},{"$f":"IF(LEFT(AT14,1)=\"A\",\"A\",IF(LEFT(AT14,1)=\"B\",\"B\",AT14))","v":""},{"$f":"IF(LEFT(AU14,1)=\"A\",\"A\",IF(LEFT(AU14,1)=\"B\",\"B\",AU14))","v":""},{"$f":"IF(LEFT(AV14,1)=\"A\",\"A\",IF(LEFT(AV14,1)=\"B\",\"B\",AV14))","v":""},{"$f":"IF(BM14>0,\"A\"&登録!$I$8,IF(BN14>0,\"B\"&登録!$I$8,BO14))","v":0},{"$f":"COUNTIF($BB14:$BK14,BM$5)","v":0},0,{"$f":"MAX(BB14:BK14)","v":0},{"$f":"BM14*10000+BN14*1000+BO14","v":0}]
[2,"HRC",{"$f":"VLOOKUP(VALUE(A15&B13),登録!$AE$2:$AH$55,3,FALSE)","v":"堂園　雅也"},{"$f":"VLOOKUP(VALUE(A15&B13),登録!$AE$2:$AH$55,4,FALSE)","v":120},{"$f":"★個人成績表★!H15","v":114},null,{"$f":"★個人成績表★!E15","v":"w"},{"$f":"★個人成績表★!G15","v":"w"},{"$f":"★個人成績表★!D15","v":"w"},{"$f":"★個人成績表★!F15","v":8},3,2,482,{"$f":"M15*登録!$I$8/★対戦リーグ表★!D15","v":482},"",482,{"$f":"K15*100000+N15","v":300482},{"$f":"IF(COUNTBLANK(E15:J15)=6,\"\",RANK(Q15,Q14:Q19))","v":3},{"$f":"IF(結果入力表!H101=\"\",\"\",結果入力表!H101)","v":""},null,{"$f":"IF(結果入力表!E24=\"\",\"\",結果入力表!E24)","v":""},{"$f":"IF(結果入力表!H73=\"\",\"\",結果入力表!H73)","v":""},{"$f":"IF(結果入力表!E10=\"\",\"\",結果入力表!E10)","v":""},{"$f":"IF(結果入力表!H45=\"\",\"\",結果入力表!H45)","v":""},23,"HRC",{"$f":"VLOOKUP(Y15,登録!$AE$2:$AH$55,3,FALSE)","v":"宮本　一"},{"$f":"VLOOKUP(Y15,登録!$AE$2:$AH$55,4,FALSE)","v":120},{"$f":"★個人成績表★!M16","v":"w"},null,{"$f":"★個人成績表★!J16","v":76},{"$f":"★個人成績表★!L16","v":"w"},{"$f":"★個人成績表★!I16","v":"w"},{"$f":"★個人成績表★!K16","v":"w"},4,1,556,{"$f":"AK15*登録!$I$8/★対戦リーグ表★!AB15","v":556},"",556,{"$f":"AI15*100000+AL15","v":400556},{"$f":"IF(COUNTBLANK(AC15:AH15)=6,\"\",RANK(AO15,AO14:AO19))","v":1},{"$f":"IF(結果入力表!H206=\"\",\"\",結果入力表!H206)","v":""},null,{"$f":"IF(結果入力表!E129=\"\",\"\",結果入力表!E129)","v":""},{"$f":"IF(結果入力表!H178=\"\",\"\",結果入力表!H178)","v":112},{"$f":"IF(結果入力表!E115=\"\",\"\",結果入力表!E115)","v":""},{"$f":"IF(結果入力表!H150=\"\",\"\",結果入力表!H150)","v":""},null,14,null,"堂園　雅也","HRC",{"$f":"IF(LEFT(S15,1)=\"A\",\"A\",IF(LEFT(S15,1)=\"B\",\"B\",S15))","v":""},{"$f":"IF(LEFT(U15,1)=\"A\",\"A\",IF(LEFT(U15,1)=\"B\",\"B\",U15))","v":""},{"$f":"IF(LEFT(V15,1)=\"A\",\"A\",IF(LEFT(V15,1)=\"B\",\"B\",V15))","v":""},{"$f":"IF(LEFT(W15,1)=\"A\",\"A\",IF(LEFT(W15,1)=\"B\",\"B\",W15))","v":""},{"$f":"IF(LEFT(X15,1)=\"A\",\"A\",IF(LEFT(X15,1)=\"B\",\"B\",X15))","v":""},{"$f":"IF(LEFT(AQ7,1)=\"A\",\"A\",IF(LEFT(AQ7,1)=\"B\",\"B\",AQ7))","v":""},{"$f":"IF(LEFT(AS7,1)=\"A\",\"A\",IF(LEFT(AS7,1)=\"B\",\"B\",AS7))","v":104},{"$f":"IF(LEFT(AT7,1)=\"A\",\"A\",IF(LEFT(AT7,1)=\"B\",\"B\",AT7))","v":""},{"$f":"IF(LEFT(AU7,1)=\"A\",\"A\",IF(LEFT(AU7,1)=\"B\",\"B\",AU7))","v":""},{"$f":"IF(LEFT(AV7,1)=\"A\",\"A\",IF(LEFT(AV7,1)=\"B\",\"B\",AV7))","v":""},{"$f":"IF(BM15>0,\"A\"&登録!$I$8,IF(BN15>0,\"B\"&登録!$I$8,BO15))","v":104},0,0,104,104,null,{"$f":"★個人成績表★!B14","v":"鐵山　泰三"},{"$f":"VLOOKUP(BR15,$AZ$6:$BL$59,13,FALSE)","v":128}]
[3,"SBC",{"$f":"VLOOKUP(VALUE(A16&B13),登録!$AE$2:$AH$55,3,FALSE)","v":"大橋　義治"},{"$f":"VLOOKUP(VALUE(A16&B13),登録!$AE$2:$AH$55,4,FALSE)","v":120},{"$f":"★個人成績表★!G24","v":"w"},{"$f":"★個人成績表★!E24","v":61},null,{"$f":"★個人成績表★!D24","v":"w"},{"$f":"★個人成績表★!F24","v":"w"},{"$f":"★個人成績表★!H24","v":"w"},4,1,541,{"$f":"M16*登録!$I$8/★対戦リーグ表★!D16","v":541},"",541,{"$f":"K16*100000+N16","v":400541},{"$f":"IF(COUNTBLANK(E16:J16)=6,\"\",RANK(Q16,Q14:Q19))","v":1},{"$f":"IF(結果入力表!H80=\"\",\"\",結果入力表!H80)","v":""},{"$f":"IF(結果入力表!H24=\"\",\"\",結果入力表!H24)","v":""},null,{"$f":"IF(結果入力表!E3=\"\",\"\",結果入力表!E3)","v":""},{"$f":"IF(結果入力表!H52=\"\",\"\",結果入力表!H52)","v":""},{"$f":"IF(結果入力表!E94=\"\",\"\",結果入力表!E94)","v":""},34,"SBC",{"$f":"VLOOKUP(Y16,登録!$AE$2:$AH$55,3,FALSE)","v":"西峰　久祐"},{"$f":"VLOOKUP(Y16,登録!$AE$2:$AH$55,4,FALSE)","v":120},{"$f":"★個人成績表★!L26","v":116},{"$f":"★個人成績表★!J26","v":"w"},null,{"$f":"★個人成績表★!I26","v":"w"},{"$f":"★個人成績表★!K26","v":"w"},{"$f":"★個人成績表★!M26","v":81},3,2,557,{"$f":"AK16*登録!$I$8/★対戦リーグ表★!AB16","v":557},"",557,{"$f":"AI16*100000+AL16","v":300557},{"$f":"IF(COUNTBLANK(AC16:AH16)=6,\"\",RANK(AO16,AO14:AO19))","v":3},{"$f":"IF(結果入力表!H185=\"\",\"\",結果入力表!H185)","v":""},{"$f":"IF(結果入力表!H129=\"\",\"\",結果入力表!H129)","v":""},null,{"$f":"IF(結果入力表!E108=\"\",\"\",結果入力表!E108)","v":""},{"$f":"IF(結果入力表!H157=\"\",\"\",結果入力表!H157)","v":101},{"$f":"IF(結果入力表!E199=\"\",\"\",結果入力表!E199)","v":""},null,16,null,"大橋　義治","SBC",{"$f":"IF(LEFT(S16,1)=\"A\",\"A\",IF(LEFT(S16,1)=\"B\",\"B\",S16))","v":""},{"$f":"IF(LEFT(T16,1)=\"A\",\"A\",IF(LEFT(T16,1)=\"B\",\"B\",T16))","v":""},{"$f":"IF(LEFT(V16,1)=\"A\",\"A\",IF(LEFT(V16,1)=\"B\",\"B\",V16))","v":""},{"$f":"IF(LEFT(W16,1)=\"A\",\"A\",IF(LEFT(W16,1)=\"B\",\"B\",W16))","v":""},{"$f":"IF(LEFT(X16,1)=\"A\",\"A\",IF(LEFT(X16,1)=\"B\",\"B\",X16))","v":""},{"$f":"IF(LEFT(AQ56,1)=\"A\",\"A\",IF(LEFT(AQ56,1)=\"B\",\"B\",AQ56))","v":""},{"$f":"IF(LEFT(AR56,1)=\"A\",\"A\",IF(LEFT(AR56,1)=\"B\",\"B\",AR56))","v":""},{"$f":"IF(LEFT(AT56,1)=\"A\",\"A\",IF(LEFT(AT56,1)=\"B\",\"B\",AT56))","v":""},{"$f":"IF(LEFT(AU56,1)=\"A\",\"A\",IF(LEFT(AU56,1)=\"B\",\"B\",AU56))","v":""},{"$f":"IF(LEFT(AV56,1)=\"A\",\"A\",IF(LEFT(AV56,1)=\"B\",\"B\",AV56))","v":""},{"$f":"IF(BM16>0,\"A\"&登録!$I$8,IF(BN16>0,\"B\"&登録!$I$8,BO16))","v":0},0,0,0,0,null,{"$f":"★個人成績表★!B15","v":"堂園　雅也"},104]
[4,"NRC",{"$f":"VLOOKUP(VALUE(A17&B13),登録!$AE$2:$AH$55,3,FALSE)","v":"岩本　剛"},{"$f":"VLOOKUP(VALUE(A17&B13),登録!$AE$2:$AH$55,4,FALSE)","v":120},{"$f":"★個人成績表★!F33","v":"w"},{"$f":"★個人成績表★!G33","v":45},{"$f":"★個人成績表★!D33","v":112},null,{"$f":"★個人成績表★!H33","v":"w"},{"$f":"★個人成績表★!E33","v":"w"},3,2,517,{"$f":"M17*登録!$I$8/★対戦リーグ表★!D17","v":517},"",517,{"$f":"K17*100000+N17","v":300517},{"$f":"IF(COUNTBLANK(E17:J17)=6,\"\",RANK(Q17,Q14:Q19))","v":2},{"$f":"IF(結果入力表!H59=\"\",\"\",結果入力表!H59)","v":""},{"$f":"IF(結果入力表!E73=\"\",\"\",結果入力表!E73)","v":""},{"$f":"IF(結果入力表!H3=\"\",\"\",結果入力表!H3)","v":""},null,{"$f":"IF(結果入力表!E87=\"\",\"\",結果入力表!E87)","v":""},{"$f":"IF(結果入力表!H31=\"\",\"\",結果入力表!H31)","v":""},45,"NRC",{"$f":"VLOOKUP(Y17,登録!$AE$2:$AH$55,3,FALSE)","v":"近藤　拓馬"},{"$f":"VLOOKUP(Y17,登録!$AE$2:$AH$55,4,FALSE)","v":120},{"$f":"★個人成績表★!K36","v":8},{"$f":"★個人成績表★!L36","v":0},{"$f":"★個人成績表★!I36","v":17},null,{"$f":"★個人成績表★!M36","v":33},{"$f":"★個人成績表★!J36","v":81},0,5,139,{"$f":"AK17*登録!$I$8/★対戦リーグ表★!AB17","v":139},"",139,{"$f":"AI17*100000+AL17","v":139},{"$f":"IF(COUNTBLANK(AC17:AH17)=6,\"\",RANK(AO17,AO14:AO19))","v":6},{"$f":"IF(結果入力表!H164=\"\",\"\",結果入力表!H164)","v":""},{"$f":"IF(結果入力表!E178=\"\",\"\",結果入力表!E178)","v":""},{"$f":"IF(結果入力表!H108=\"\",\"\",結果入力表!H108)","v":""},null,{"$f":"IF(結果入力表!E192=\"\",\"\",結果入力表!E192)","v":""},{"$f":"IF(結果入力表!H136=\"\",\"\",結果入力表!H136)","v":""},null,16,null,"岩本　剛","NRC",{"$f":"IF(LEFT(S17,1)=\"A\",\"A\",IF(LEFT(S17,1)=\"B\",\"B\",S17))","v":""},{"$f":"IF(LEFT(T17,1)=\"A\",\"A\",IF(LEFT(T17,1)=\"B\",\"B\",T17))","v":""},{"$f":"IF(LEFT(U17,1)=\"A\",\"A\",IF(LEFT(U17,1)=\"B\",\"B\",U17))","v":""},{"$f":"IF(LEFT(W17,1)=\"A\",\"A\",IF(LEFT(W17,1)=\"B\",\"B\",W17))","v":""},{"$f":"IF(LEFT(X17,1)=\"A\",\"A\",IF(LEFT(X17,1)=\"B\",\"B\",X17))","v":""},{"$f":"IF(LEFT(AQ49,1)=\"A\",\"A\",IF(LEFT(AQ49,1)=\"B\",\"B\",AQ49))","v":""},{"$f":"IF(LEFT(AR49,1)=\"A\",\"A\",IF(LEFT(AR49,1)=\"B\",\"B\",AR49))","v":""},{"$f":"IF(LEFT(AS49,1)=\"A\",\"A\",IF(LEFT(AS49,1)=\"B\",\"B\",AS49))","v":""},{"$f":"IF(LEFT(AU49,1)=\"A\",\"A\",IF(LEFT(AU49,1)=\"B\",\"B\",AU49))","v":""},{"$f":"IF(LEFT(AV49,1)=\"A\",\"A\",IF(LEFT(AV49,1)=\"B\",\"B\",AV49))","v":""},{"$f":"IF(BM17>0,\"A\"&登録!$I$8,IF(BN17>0,\"B\"&登録!$I$8,BO17))","v":0},0,0,0,0,null,{"$f":"★個人成績表★!B16","v":"宮本　一"},"B120"]
[5,"ORC",{"$f":"VLOOKUP(VALUE(A18&B13),登録!$AE$2:$AH$55,3,FALSE)","v":"藤明　宏樹"},{"$f":"VLOOKUP(VALUE(A18&B13),登録!$AE$2:$AH$55,4,FALSE)","v":120},{"$f":"★個人成績表★!E42","v":83},{"$f":"★個人成績表★!D42","v":86},{"$f":"★個人成績表★!F42","v":67},{"$f":"★個人成績表★!H42","v":5},null,{"$f":"★個人成績表★!G42","v":48},0,5,289,{"$f":"M18*登録!$I$8/★対戦リーグ表★!D18","v":289},"",289,{"$f":"K18*100000+N18","v":289},{"$f":"IF(COUNTBLANK(E18:J18)=6,\"\",RANK(Q18,Q14:Q19))","v":6},{"$f":"IF(結果入力表!H38=\"\",\"\",結果入力表!H38)","v":""},{"$f":"IF(結果入力表!H10=\"\",\"\",結果入力表!H10)","v":""},{"$f":"IF(結果入力表!E52=\"\",\"\",結果入力表!E52)","v":""},{"$f":"IF(結果入力表!H87=\"\",\"\",結果入力表!H87)","v":""},null,{"$f":"IF(結果入力表!E66=\"\",\"\",結果入力表!E66)","v":""},56,"ORC",{"$f":"VLOOKUP(Y18,登録!$AE$2:$AH$55,3,FALSE)","v":"乾　伸綱"},{"$f":"VLOOKUP(Y18,登録!$AE$2:$AH$55,4,FALSE)","v":120},{"$f":"★個人成績表★!J46","v":"w"},{"$f":"★個人成績表★!I46","v":115},{"$f":"★個人成績表★!K46","v":85},{"$f":"★個人成績表★!M46","v":"w"},null,{"$f":"★個人成績表★!L46","v":"w"},3,2,560,{"$f":"AK18*登録!$I$8/★対戦リーグ表★!AB18","v":560},"",560,{"$f":"AI18*100000+AL18","v":300560},{"$f":"IF(COUNTBLANK(AC18:AH18)=6,\"\",RANK(AO18,AO14:AO19))","v":2},{"$f":"IF(結果入力表!H143=\"\",\"\",結果入力表!H143)","v":""},{"$f":"IF(結果入力表!H115=\"\",\"\",結果入力表!H115)","v":""},{"$f":"IF(結果入力表!E157=\"\",\"\",結果入力表!E157)","v":""},{"$f":"IF(結果入力表!H192=\"\",\"\",結果入力表!H192)","v":""},null,{"$f":"IF(結果入力表!E171=\"\",\"\",結果入力表!E171)","v":""},null,16,null,"藤明　宏樹","ORC",{"$f":"IF(LEFT(S18,1)=\"A\",\"A\",IF(LEFT(S18,1)=\"B\",\"B\",S18))","v":""},{"$f":"IF(LEFT(T18,1)=\"A\",\"A\",IF(LEFT(T18,1)=\"B\",\"B\",T18))","v":""},{"$f":"IF(LEFT(U18,1)=\"A\",\"A\",IF(LEFT(U18,1)=\"B\",\"B\",U18))","v":""},{"$f":"IF(LEFT(V18,1)=\"A\",\"A\",IF(LEFT(V18,1)=\"B\",\"B\",V18))","v":""},{"$f":"IF(LEFT(X18,1)=\"A\",\"A\",IF(LEFT(X18,1)=\"B\",\"B\",X18))","v":""},{"$f":"IF(LEFT(AQ42,1)=\"A\",\"A\",IF(LEFT(AQ42,1)=\"B\",\"B\",AQ42))","v":""},{"$f":"IF(LEFT(AR42,1)=\"A\",\"A\",IF(LEFT(AR42,1)=\"B\",\"B\",AR42))","v":""},{"$f":"IF(LEFT(AS42,1)=\"A\",\"A\",IF(LEFT(AS42,1)=\"B\",\"B\",AS42))","v":""},{"$f":"IF(LEFT(AT42,1)=\"A\",\"A\",IF(LEFT(AT42,1)=\"B\",\"B\",AT42))","v":""},{"$f":"IF(LEFT(AV42,1)=\"A\",\"A\",IF(LEFT(AV42,1)=\"B\",\"B\",AV42))","v":""},{"$f":"IF(BM18>0,\"A\"&登録!$I$8,IF(BN18>0,\"B\"&登録!$I$8,BO18))","v":0},0,0,0,0,null,{"$f":"★個人成績表★!B17","v":"伊藤　登"},0]
[6,"WRC",{"$f":"IF(B19=\"\",\"\",VLOOKUP(VALUE(A19&B13),登録!$AE$2:$AH$55,3,FALSE))","v":"和田宗一郎"},{"$f":"IF(B19=\"\",\"\",VLOOKUP(VALUE(A19&B13),登録!$AE$2:$AH$55,4,FALSE))","v":120},{"$f":"★個人成績表★!D51","v":33},{"$f":"★個人成績表★!F51","v":"w"},{"$f":"★個人成績表★!H51","v":51},{"$f":"★個人成績表★!E51","v":22},{"$f":"★個人成績表★!G51","v":"w"},null,2,3,346,{"$f":"M19*登録!$I$8/★対戦リーグ表★!D19","v":346},"",346,{"$f":"IF(D19=\"\",\"\",K19*100000+N19)","v":200346},{"$f":"IF(COUNTBLANK(E19:J19)=6,\"\",RANK(Q19,Q14:Q19))","v":5},{"$f":"IF(結果入力表!H17=\"\",\"\",結果入力表!H17)","v":""},{"$f":"IF(結果入力表!E45=\"\",\"\",結果入力表!E45)","v":""},{"$f":"IF(結果入力表!H94=\"\",\"\",結果入力表!H94)","v":""},{"$f":"IF(結果入力表!E31=\"\",\"\",結果入力表!E31)","v":""},{"$f":"IF(結果入力表!H66=\"\",\"\",結果入力表!H66)","v":""},null,67,"WRC",{"$f":"IF(Z19=\"\",\"\",VLOOKUP(Y19,登録!$AE$2:$AH$55,3,FALSE))","v":"松房ゆかり"},{"$f":"IF(Z19=\"\",\"\",VLOOKUP(Y19,登録!$AE$2:$AH$55,4,FALSE))","v":100},{"$f":"★個人成績表★!I56","v":"w"},{"$f":"★個人成績表★!K56","v":58},{"$f":"★個人成績表★!M56","v":"w"},{"$f":"★個人成績表★!J56","v":"w"},{"$f":"★個人成績表★!L56","v":0},null,3,2,358,{"$f":"AK19*登録!$I$8/★対戦リーグ表★!AB19","v":429.6},"*",429.6,{"$f":"IF(AB19=\"\",\"\",AI19*100000+AL19)","v":300429.59999999998},{"$f":"IF(COUNTBLANK(AC19:AH19)=6,\"\",RANK(AO19,AO14:AO19))","v":4},{"$f":"IF(結果入力表!H122=\"\",\"\",結果入力表!H122)","v":""},{"$f":"IF(結果入力表!E150=\"\",\"\",結果入力表!E150)","v":""},{"$f":"IF(結果入力表!H199=\"\",\"\",結果入力表!H199)","v":""},{"$f":"IF(結果入力表!E136=\"\",\"\",結果入力表!E136)","v":""},{"$f":"IF(結果入力表!H171=\"\",\"\",結果入力表!H171)","v":""},null,null,16,null,"和田宗一郎","WRC",{"$f":"IF(LEFT(S19,1)=\"A\",\"A\",IF(LEFT(S19,1)=\"B\",\"B\",S19))","v":""},{"$f":"IF(LEFT(T19,1)=\"A\",\"A\",IF(LEFT(T19,1)=\"B\",\"B\",T19))","v":""},{"$f":"IF(LEFT(U19,1)=\"A\",\"A\",IF(LEFT(U19,1)=\"B\",\"B\",U19))","v":""},{"$f":"IF(LEFT(V19,1)=\"A\",\"A\",IF(LEFT(V19,1)=\"B\",\"B\",V19))","v":""},{"$f":"IF(LEFT(W19,1)=\"A\",\"A\",IF(LEFT(W19,1)=\"B\",\"B\",W19))","v":""},{"$f":"IF(LEFT(AQ35,1)=\"A\",\"A\",IF(LEFT(AQ35,1)=\"B\",\"B\",AQ35))","v":""},{"$f":"IF(LEFT(AR35,1)=\"A\",\"A\",IF(LEFT(AR35,1)=\"B\",\"B\",AR35))","v":""},{"$f":"IF(LEFT(AS35,1)=\"A\",\"A\",IF(LEFT(AS35,1)=\"B\",\"B\",AS35))","v":""},{"$f":"IF(LEFT(AT35,1)=\"A\",\"A\",IF(LEFT(AT35,1)=\"B\",\"B\",AT35))","v":""},{"$f":"IF(LEFT(AU35,1)=\"A\",\"A\",IF(LEFT(AU35,1)=\"B\",\"B\",AU35))","v":""},{"$f":"IF(BM19>0,\"A\"&登録!$I$8,IF(BN19>0,\"B\"&登録!$I$8,BO19))","v":0},0,0,0,0,null,{"$f":"★個人成績表★!B18","v":"宮井健太郎"},0]
[null,null,null,null,null,null,null,null,null,null,null,null,null,null,null,null,null,null,null,null,null,null,null,null,null,null,null,null,null,null,null,null,null,null,null,null,null,null,null,null,null,null,null,null,null,null,null,null,null,null,null,null,null,null,null,null,null,null,null,null,null,null,null,null,null,null,null,null,null,{"$f":"★個人成績表★!B19","v":"白澤雄一郎"},107]
[null,3,"Player","handy",{"$f":"B22","v":"KRC"},{"$f":"B23","v":"HRC"},{"$f":"B24","v":"SBC"},{"$f":"B25","v":"NRC"},{"$f":"B26","v":"ORC"},{"$f":"B27","v":"WRC"},"W","L","TP","(TP)","TP",null,"R_P","R",null,null,null,null,null,null,null,3,"Player","handy",{"$f":"$B$6","v":"KRC"},{"$f":"$B$7","v":"HRC"},{"$f":"$B$8","v":"SBC"},{"$f":"$B$9","v":"NRC"},{"$f":"$B$10","v":"ORC"},{"$f":"$B$11","v":"WRC"},"W","L","TP","(TP)","TP",null,"R_P","R",null,null,null,null,null,null,null,null,null,null,null,null,null,null,null,null,null,null,null,null,null,{"$f":"IF(BM21>0,\"A\"&登録!$I$8,IF(BN21>0,\"B\"&登録!$I$8,BO21))","v":0},null,null,null,null,null,{"$f":"★個人成績表★!B20","v":"河地　恵里"},0]
[1,{"$f":"B14","v":"KRC"},{"$f":"VLOOKUP(VALUE(A22&B21),登録!$AE$2:$AH$55,3,FALSE)","v":"鈴木　康文"},{"$f":"VLOOKUP(VALUE(A22&B21),登録!$AE$2:$AH$55,4,FALSE)","v":120},null,{"$f":"★個人成績表★!H7","v":2},{"$f":"★個人成績表★!G7","v":"w"},{"$f":"★個人成績表★!F7","v":"w"},{"$f":"★個人成績表★!E7","v":"w"},{"$f":"★個人成績表★!D7","v":"w"},{"$f":"IF(COUNTBLANK(E22:J22)=6,\"\",COUNTIF(E22:J22,\"w\"))","v":4},{"$f":"IF(COUNTBLANK(E22:J22)=6,\"\",6-COUNTBLANK(E22:J22)-K22)","v":1},{"$f":"K22*D22+SUM(E22:J22)","v":482},{"$f":"M22*登録!$I$8/★対戦リーグ表★!D22","v":482},{"$f":"IF(ISERROR(N22),\"\",IF(M22=N22,\"\",\"*\"))","v":""},{"$f":"IF(COUNTBLANK(E22:J22)=6,\"\",N22)","v":482},{"$f":"K22*100000+N22","v":400482},{"$f":"IF(COUNTBLANK(E22:J22)=6,\"\",RANK(Q22,Q22:Q27))","v":1},null,{"$f":"IF(結果入力表!E102=\"\",\"\",結果入力表!E102)","v":""},{"$f":"IF(結果入力表!E81=\"\",\"\",結果入力表!E81)","v":""},{"$f":"IF(結果入力表!E60=\"\",\"\",結果入力表!E60)","v":""},{"$f":"IF(結果入力表!E39=\"\",\"\",結果入力表!E39)","v":""},{"$f":"IF(結果入力表!E18=\"\",\"\",結果入力表!E18)","v":""},13,{"$f":"Z14","v":"KRC"},{"$f":"VLOOKUP(Y22,登録!$AE$2:$AH$55,3,FALSE)","v":"鈴木　康文"},{"$f":"VLOOKUP(Y22,登録!$AE$2:$AH$55,4,FALSE)","v":120},null,{"$f":"★個人成績表★!M7","v":53},{"$f":"★個人成績表★!L7","v":"w"},{"$f":"★個人成績表★!K7","v":119},{"$f":"★個人成績表★!J7","v":"w"},{"$f":"★個人成績表★!I7","v":"w"},{"$f":"IF(COUNTBLANK(AC22:AH22)=6,\"\",COUNTIF(AC22:AH22,\"w\"))","v":3},{"$f":"IF(COUNTBLANK(AC22:AH22)=6,\"\",6-COUNTBLANK(AC22:AH22)-AI22)","v":2},{"$f":"AI22*AB22+SUM(AC22:AH22)","v":532},{"$f":"AK22*登録!$I$8/★対戦リーグ表★!AB22","v":532},{"$f":"IF(ISERROR(AL22),\"\",IF(AK22=AL22,\"\",\"*\"))","v":""},{"$f":"IF(COUNTBLANK(AC22:AH22)=6,\"\",AL22)","v":532},{"$f":"AI22*100000+AL22","v":300532},{"$f":"IF(COUNTBLANK(AC22:AH22)=6,\"\",RANK(AO22,AO22:AO27))","v":3},null,{"$f":"IF(結果入力表!E207=\"\",\"\",結果入力表!E207)","v":""},{"$f":"IF(結果入力表!E186=\"\",\"\",結果入力表!E186)","v":""},{"$f":"IF(結果入力表!E165=\"\",\"\",結果入力表!E165)","v":""},{"$f":"IF(結果入力表!E144=\"\",\"\",結果入力表!E144)","v":107},{"$f":"IF(結果入力表!E123=\"\",\"\",結果入力表!E123)","v":""},null,{"$f":"RANK(BP22,$BP$6:$BP$59)","v":8},null,{"$f":"C22","v":"鈴木　康文"},{"$f":"B22","v":"KRC"},{"$f":"IF(LEFT(T22,1)=\"A\",\"A\",IF(LEFT(T22,1)=\"B\",\"B\",T22))","v":""},{"$f":"IF(LEFT(U22,1)=\"A\",\"A\",IF(LEFT(U22,1)=\"B\",\"B\",U22))","v":""},{"$f":"IF(LEFT(V22,1)=\"A\",\"A\",IF(LEFT(V22,1)=\"B\",\"B\",V22))","v":""},{"$f":"IF(LEFT(W22,1)=\"A\",\"A\",IF(LEFT(W22,1)=\"B\",\"B\",W22))","v":""},{"$f":"IF(LEFT(X22,1)=\"A\",\"A\",IF(LEFT(X22,1)=\"B\",\"B\",X22))","v":""},{"$f":"IF(LEFT(AR22,1)=\"A\",\"A\",IF(LEFT(AR22,1)=\"B\",\"B\",AR22))","v":""},{"$f":"IF(LEFT(AS22,1)=\"A\",\"A\",IF(LEFT(AS22,1)=\"B\",\"B\",AS22))","v":""},{"$f":"IF(LEFT(AT22,1)=\"A\",\"A\",IF(LEFT(AT22,1)=\"B\",\"B\",AT22))","v":""},{"$f":"IF(LEFT(AU22,1)=\"A\",\"A\",IF(LEFT(AU22,1)=\"B\",\"B\",AU22))","v":107},{"$f":"IF(LEFT(AV22,1)=\"A\",\"A\",IF(LEFT(AV22,1)=\"B\",\"B\",AV22))","v":""},{"$f":"IF(BM22>0,\"A\"&登録!$I$8,IF(BN22>0,\"B\"&登録!$I$8,BO22))","v":107},{"$f":"COUNTIF($BB22:$BK22,BM$5)","v":0},0,{"$f":"MAX(BB22:BK22)","v":107},{"$f":"BM22*10000+BN22*1000+BO22","v":107}]
[2,"HRC",{"$f":"VLOOKUP(VALUE(A23&B21),登録!$AE$2:$AH$55,3,FALSE)","v":"宮本　一"},{"$f":"VLOOKUP(VALUE(A23&B21),登録!$AE$2:$AH$55,4,FALSE)","v":120},{"$f":"★個人成績表★!H16","v":"w"},null,{"$f":"★個人成績表★!E16","v":91},{"$f":"★個人成績表★!G16","v":"w"},{"$f":"★個人成績表★!D16","v":"w"},{"$f":"★個人成績表★!F16","v":115},3,2,566,{"$f":"M23*登録!$I$8/★対戦リーグ表★!D23","v":566},"",566,{"$f":"K23*100000+N23","v":300566},{"$f":"IF(COUNTBLANK(E23:J23)=6,\"\",RANK(Q23,Q22:Q27))","v":2},{"$f":"IF(結果入力表!H102=\"\",\"\",結果入力表!H102)","v":105},null,{"$f":"IF(結果入力表!E25=\"\",\"\",結果入力表!E25)","v":""},{"$f":"IF(結果入力表!H74=\"\",\"\",結果入力表!H74)","v":"B120"},{"$f":"IF(結果入力表!E11=\"\",\"\",結果入力表!E11)","v":""},{"$f":"IF(結果入力表!H46=\"\",\"\",結果入力表!H46)","v":""},24,"HRC",{"$f":"VLOOKUP(Y23,登録!$AE$2:$AH$55,3,FALSE)","v":"伊藤　登"},{"$f":"VLOOKUP(Y23,登録!$AE$2:$AH$55,4,FALSE)","v":120},{"$f":"★個人成績表★!M17","v":"w"},null,{"$f":"★個人成績表★!J17","v":72},{"$f":"★個人成績表★!L17","v":"w"},{"$f":"★個人成績表★!I17","v":"w"},{"$f":"★個人成績表★!K17","v":42},3,2,474,{"$f":"AK23*登録!$I$8/★対戦リーグ表★!AB23","v":474},"",474,{"$f":"AI23*100000+AL23","v":300474},{"$f":"IF(COUNTBLANK(AC23:AH23)=6,\"\",RANK(AO23,AO22:AO27))","v":4},{"$f":"IF(結果入力表!H207=\"\",\"\",結果入力表!H207)","v":""},null,{"$f":"IF(結果入力表!E130=\"\",\"\",結果入力表!E130)","v":""},{"$f":"IF(結果入力表!H179=\"\",\"\",結果入力表!H179)","v":""},{"$f":"IF(結果入力表!E116=\"\",\"\",結果入力表!E116)","v":""},{"$f":"IF(結果入力表!H151=\"\",\"\",結果入力表!H151)","v":""},null,5,null,"宮本　一","HRC",{"$f":"IF(LEFT(S23,1)=\"A\",\"A\",IF(LEFT(S23,1)=\"B\",\"B\",S23))","v":105},{"$f":"IF(LEFT(U23,1)=\"A\",\"A\",IF(LEFT(U23,1)=\"B\",\"B\",U23))","v":""},{"$f":"IF(LEFT(V23,1)=\"A\",\"A\",IF(LEFT(V23,1)=\"B\",\"B\",V23))","v":"B"},{"$f":"IF(LEFT(W23,1)=\"A\",\"A\",IF(LEFT(W23,1)=\"B\",\"B\",W23))","v":""},{"$f":"IF(LEFT(X23,1)=\"A\",\"A\",IF(LEFT(X23,1)=\"B\",\"B\",X23))","v":""},{"$f":"IF(LEFT(AQ15,1)=\"A\",\"A\",IF(LEFT(AQ15,1)=\"B\",\"B\",AQ15))","v":""},{"$f":"IF(LEFT(AS15,1)=\"A\",\"A\",IF(LEFT(AS15,1)=\"B\",\"B\",AS15))","v":""},{"$f":"IF(LEFT(AT15,1)=\"A\",\"A\",IF(LEFT(AT15,1)=\"B\",\"B\",AT15))","v":112},{"$f":"IF(LEFT(AU15,1)=\"A\",\"A\",IF(LEFT(AU15,1)=\"B\",\"B\",AU15))","v":""},{"$f":"IF(LEFT(AV15,1)=\"A\",\"A\",IF(LEFT(AV15,1)=\"B\",\"B\",AV15))","v":""},{"$f":"IF(BM23>0,\"A\"&登録!$I$8,IF(BN23>0,\"B\"&登録!$I$8,BO23))","v":"B120"},0,1,112,1112]
[3,"SBC",{"$f":"VLOOKUP(VALUE(A24&B21),登録!$AE$2:$AH$55,3,FALSE)","v":"山中　康寛"},{"$f":"VLOOKUP(VALUE(A24&B21),登録!$AE$2:$AH$55,4,FALSE)","v":120},{"$f":"★個人成績表★!G25","v":51},{"$f":"★個人成績表★!E25","v":"w"},null,{"$f":"★個人成績表★!D25","v":0},{"$f":"★個人成績表★!F25","v":63},{"$f":"★個人成績表★!H25","v":"w"},2,3,354,{"$f":"M24*登録!$I$8/★対戦リーグ表★!D24","v":354},"",354,{"$f":"K24*100000+N24","v":200354},{"$f":"IF(COUNTBLANK(E24:J24)=6,\"\",RANK(Q24,Q22:Q27))","v":6},{"$f":"IF(結果入力表!H81=\"\",\"\",結果入力表!H81)","v":""},{"$f":"IF(結果入力表!H25=\"\",\"\",結果入力表!H25)","v":""},null,{"$f":"IF(結果入力表!E4=\"\",\"\",結果入力表!E4)","v":""},{"$f":"IF(結果入力表!H53=\"\",\"\",結果入力表!H53)","v":""},{"$f":"IF(結果入力表!E95=\"\",\"\",結果入力表!E95)","v":""},35,"SBC",{"$f":"VLOOKUP(Y24,登録!$AE$2:$AH$55,3,FALSE)","v":"大橋　正寛"},{"$f":"VLOOKUP(Y24,登録!$AE$2:$AH$55,4,FALSE)","v":120},{"$f":"★個人成績表★!L27","v":44},{"$f":"★個人成績表★!J27","v":"w"},null,{"$f":"★個人成績表★!I27","v":"w"},{"$f":"★個人成績表★!K27","v":"w"},{"$f":"★個人成績表★!M27","v":"w"},4,1,524,{"$f":"AK24*登録!$I$8/★対戦リーグ表★!AB24","v":524},"",524,{"$f":"AI24*100000+AL24","v":400524},{"$f":"IF(COUNTBLANK(AC24:AH24)=6,\"\",RANK(AO24,AO22:AO27))","v":1},{"$f":"IF(結果入力表!H186=\"\",\"\",結果入力表!H186)","v":""},{"$f":"IF(結果入力表!H130=\"\",\"\",結果入力表!H130)","v":""},null,{"$f":"IF(結果入力表!E109=\"\",\"\",結果入力表!E109)","v":"A120"},{"$f":"IF(結果入力表!H158=\"\",\"\",結果入力表!H158)","v":""},{"$f":"IF(結果入力表!E200=\"\",\"\",結果入力表!E200)","v":""},null,16,null,"山中　康寛","SBC",{"$f":"IF(LEFT(S24,1)=\"A\",\"A\",IF(LEFT(S24,1)=\"B\",\"B\",S24))","v":""},{"$f":"IF(LEFT(T24,1)=\"A\",\"A\",IF(LEFT(T24,1)=\"B\",\"B\",T24))","v":""},{"$f":"IF(LEFT(V24,1)=\"A\",\"A\",IF(LEFT(V24,1)=\"B\",\"B\",V24))","v":""},{"$f":"IF(LEFT(W24,1)=\"A\",\"A\",IF(LEFT(W24,1)=\"B\",\"B\",W24))","v":""},{"$f":"IF(LEFT(X24,1)=\"A\",\"A\",IF(LEFT(X24,1)=\"B\",\"B\",X24))","v":""},{"$f":"IF(LEFT(AQ8,1)=\"A\",\"A\",IF(LEFT(AQ8,1)=\"B\",\"B\",AQ8))","v":""},{"$f":"IF(LEFT(AR8,1)=\"A\",\"A\",IF(LEFT(AR8,1)=\"B\",\"B\",AR8))","v":""},{"$f":"IF(LEFT(AT8,1)=\"A\",\"A\",IF(LEFT(AT8,1)=\"B\",\"B\",AT8))","v":""},{"$f":"IF(LEFT(AU8,1)=\"A\",\"A\",IF(LEFT(AU8,1)=\"B\",\"B\",AU8))","v":""},{"$f":"IF(LEFT(AV8,1)=\"A\",\"A\",IF(LEFT(AV8,1)=\"B\",\"B\",AV8))","v":""},{"$f":"IF(BM24>0,\"A\"&登録!$I$8,IF(BN24>0,\"B\"&登録!$I$8,BO24))","v":0},0,0,0,0,null,{"$f":"★個人成績表★!B23","v":"林　秀忠"},{"$f":"VLOOKUP(BR24,$AZ$6:$BL$59,13,FALSE)","v":"A120"}]
[4,"NRC",{"$f":"VLOOKUP(VALUE(A25&B21),登録!$AE$2:$AH$55,3,FALSE)","v":"白戸　玲人"},{"$f":"VLOOKUP(VALUE(A25&B21),登録!$AE$2:$AH$55,4,FALSE)","v":120},{"$f":"★個人成績表★!F34","v":113},{"$f":"★個人成績表★!G34","v":0},{"$f":"★個人成績表★!D34","v":"w"},null,{"$f":"★個人成績表★!H34","v":79},{"$f":"★個人成績表★!E34","v":"w"},2,3,432,{"$f":"M25*登録!$I$8/★対戦リーグ表★!D25","v":432},"",432,{"$f":"K25*100000+N25","v":200432},{"$f":"IF(COUNTBLANK(E25:J25)=6,\"\",RANK(Q25,Q22:Q27))","v":5},{"$f":"IF(結果入力表!H60=\"\",\"\",結果入力表!H60)","v":""},{"$f":"IF(結果入力表!E74=\"\",\"\",結果入力表!E74)","v":""},{"$f":"IF(結果入力表!H4=\"\",\"\",結果入力表!H4)","v":""},null,{"$f":"IF(結果入力表!E88=\"\",\"\",結果入力表!E88)","v":""},{"$f":"IF(結果入力表!H32=\"\",\"\",結果入力表!H32)","v":""},46,"NRC",{"$f":"VLOOKUP(Y25,登録!$AE$2:$AH$55,3,FALSE)","v":"長谷川　進"},{"$f":"VLOOKUP(Y25,登録!$AE$2:$AH$55,4,FALSE)","v":120},{"$f":"★個人成績表★!K37","v":"w"},{"$f":"★個人成績表★!L37","v":32},{"$f":"★個人成績表★!I37","v":0},null,{"$f":"★個人成績表★!M37","v":55},{"$f":"★個人成績表★!J37","v":13},1,4,220,{"$f":"AK25*登録!$I$8/★対戦リーグ表★!AB25","v":220},"",220,{"$f":"AI25*100000+AL25","v":100220},{"$f":"IF(COUNTBLANK(AC25:AH25)=6,\"\",RANK(AO25,AO22:AO27))","v":6},{"$f":"IF(結果入力表!H165=\"\",\"\",結果入力表!H165)","v":""},{"$f":"IF(結果入力表!E179=\"\",\"\",結果入力表!E179)","v":""},{"$f":"IF(結果入力表!H109=\"\",\"\",結果入力表!H109)","v":""},null,{"$f":"IF(結果入力表!E193=\"\",\"\",結果入力表!E193)","v":""},{"$f":"IF(結果入力表!H137=\"\",\"\",結果入力表!H137)","v":""},null,8,null,"白戸　玲人","NRC",{"$f":"IF(LEFT(S25,1)=\"A\",\"A\",IF(LEFT(S25,1)=\"B\",\"B\",S25))","v":""},{"$f":"IF(LEFT(T25,1)=\"A\",\"A\",IF(LEFT(T25,1)=\"B\",\"B\",T25))","v":""},{"$f":"IF(LEFT(U25,1)=\"A\",\"A\",IF(LEFT(U25,1)=\"B\",\"B\",U25))","v":""},{"$f":"IF(LEFT(W25,1)=\"A\",\"A\",IF(LEFT(W25,1)=\"B\",\"B\",W25))","v":""},{"$f":"IF(LEFT(X25,1)=\"A\",\"A\",IF(LEFT(X25,1)=\"B\",\"B\",X25))","v":""},{"$f":"IF(LEFT(AQ57,1)=\"A\",\"A\",IF(LEFT(AQ57,1)=\"B\",\"B\",AQ57))","v":""},{"$f":"IF(LEFT(AR57,1)=\"A\",\"A\",IF(LEFT(AR57,1)=\"B\",\"B\",AR57))","v":""},{"$f":"IF(LEFT(AS57,1)=\"A\",\"A\",IF(LEFT(AS57,1)=\"B\",\"B\",AS57))","v":""},{"$f":"IF(LEFT(AU57,1)=\"A\",\"A\",IF(LEFT(AU57,1)=\"B\",\"B\",AU57))","v":""},{"$f":"IF(LEFT(AV57,1)=\"A\",\"A\",IF(LEFT(AV57,1)=\"B\",\"B\",AV57))","v":107},{"$f":"IF(BM25>0,\"A\"&登録!$I$8,IF(BN25>0,\"B\"&登録!$I$8,BO25))","v":107},0,0,107,107,null,{"$f":"★個人成績表★!B24","v":"大橋　義治"},0]
[5,"ORC",{"$f":"VLOOKUP(VALUE(A26&B21),登録!$AE$2:$AH$55,3,FALSE)","v":"吉岡　保俊"},{"$f":"VLOOKUP(VALUE(A26&B21),登録!$AE$2:$AH$55,4,FALSE)","v":120},{"$f":"★個人成績表★!E43","v":67},{"$f":"★個人成績表★!D43","v":106},{"$f":"★個人成績表★!F43","v":"w"},{"$f":"★個人成績表★!H43","v":"w"},null,{"$f":"★個人成績表★!G43","v":98},2,3,511,{"$f":"M26*登録!$I$8/★対戦リーグ表★!D26","v":511},"",511,{"$f":"K26*100000+N26","v":200511},{"$f":"IF(COUNTBLANK(E26:J26)=6,\"\",RANK(Q26,Q22:Q27))","v":3},{"$f":"IF(結果入力表!H39=\"\",\"\",結果入力表!H39)","v":""},{"$f":"IF(結果入力表!H11=\"\",\"\",結果入力表!H11)","v":106},{"$f":"IF(結果入力表!E53=\"\",\"\",結果入力表!E53)","v":""},{"$f":"IF(結果入力表!H88=\"\",\"\",結果入力表!H88)","v":""},null,{"$f":"IF(結果入力表!E67=\"\",\"\",結果入力表!E67)","v":""},57,"ORC",{"$f":"VLOOKUP(Y26,登録!$AE$2:$AH$55,3,FALSE)","v":"山崎真紀子"},{"$f":"VLOOKUP(Y26,登録!$AE$2:$AH$55,4,FALSE)","v":100},{"$f":"★個人成績表★!J47","v":1},{"$f":"★個人成績表★!I47","v":84},{"$f":"★個人成績表★!K47","v":61},{"$f":"★個人成績表★!M47","v":"w"},null,{"$f":"★個人成績表★!L47","v":52},1,4,298,{"$f":"AK26*登録!$I$8/★対戦リーグ表★!AB26","v":357.6},"*",357.6,{"$f":"AI26*100000+AL26","v":100357.6},{"$f":"IF(COUNTBLANK(AC26:AH26)=6,\"\",RANK(AO26,AO22:AO27))","v":5},{"$f":"IF(結果入力表!H144=\"\",\"\",結果入力表!H144)","v":""},{"$f":"IF(結果入力表!H116=\"\",\"\",結果入力表!H116)","v":""},{"$f":"IF(結果入力表!E158=\"\",\"\",結果入力表!E158)","v":""},{"$f":"IF(結果入力表!H193=\"\",\"\",結果入力表!H193)","v":""},null,{"$f":"IF(結果入力表!E172=\"\",\"\",結果入力表!E172)","v":""},null,11,null,"吉岡　保俊","ORC",{"$f":"IF(LEFT(S26,1)=\"A\",\"A\",IF(LEFT(S26,1)=\"B\",\"B\",S26))","v":""},{"$f":"IF(LEFT(T26,1)=\"A\",\"A\",IF(LEFT(T26,1)=\"B\",\"B\",T26))","v":106},{"$f":"IF(LEFT(U26,1)=\"A\",\"A\",IF(LEFT(U26,1)=\"B\",\"B\",U26))","v":""},{"$f":"IF(LEFT(V26,1)=\"A\",\"A\",IF(LEFT(V26,1)=\"B\",\"B\",V26))","v":""},{"$f":"IF(LEFT(X26,1)=\"A\",\"A\",IF(LEFT(X26,1)=\"B\",\"B\",X26))","v":""},{"$f":"IF(LEFT(AQ50,1)=\"A\",\"A\",IF(LEFT(AQ50,1)=\"B\",\"B\",AQ50))","v":""},{"$f":"IF(LEFT(AR50,1)=\"A\",\"A\",IF(LEFT(AR50,1)=\"B\",\"B\",AR50))","v":""},{"$f":"IF(LEFT(AS50,1)=\"A\",\"A\",IF(LEFT(AS50,1)=\"B\",\"B\",AS50))","v":""},{"$f":"IF(LEFT(AT50,1)=\"A\",\"A\",IF(LEFT(AT50,1)=\"B\",\"B\",AT50))","v":""},{"$f":"IF(LEFT(AV50,1)=\"A\",\"A\",IF(LEFT(AV50,1)=\"B\",\"B\",AV50))","v":""},{"$f":"IF(BM26>0,\"A\"&登録!$I$8,IF(BN26>0,\"B\"&登録!$I$8,BO26))","v":106},0,0,106,106,null,{"$f":"★個人成績表★!B25","v":"山中　康寛"},0]
[6,"WRC",{"$f":"IF(B27=\"\",\"\",VLOOKUP(VALUE(A27&B21),登録!$AE$2:$AH$55,3,FALSE))","v":"杉本　博章"},{"$f":"IF(B27=\"\",\"\",VLOOKUP(VALUE(A27&B21),登録!$AE$2:$AH$55,4,FALSE))","v":120},{"$f":"★個人成績表★!D52","v":38},{"$f":"★個人成績表★!F52","v":"w"},{"$f":"★個人成績表★!H52","v":87},{"$f":"★個人成績表★!E52","v":71},{"$f":"★個人成績表★!G52","v":"w"},null,2,3,436,{"$f":"M27*登録!$I$8/★対戦リーグ表★!D27","v":436},"",436,{"$f":"IF(D27=\"\",\"\",K27*100000+N27)","v":200436},{"$f":"IF(COUNTBLANK(E27:J27)=6,\"\",RANK(Q27,Q22:Q27))","v":4},{"$f":"IF(結果入力表!H18=\"\",\"\",結果入力表!H18)","v":""},{"$f":"IF(結果入力表!E46=\"\",\"\",結果入力表!E46)","v":""},{"$f":"IF(結果入力表!H95=\"\",\"\",結果入力表!H95)","v":""},{"$f":"IF(結果入力表!E32=\"\",\"\",結果入力表!E32)","v":""},{"$f":"IF(結果入力表!H67=\"\",\"\",結果入力表!H67)","v":""},null,61,"WRC",{"$f":"IF(Z27=\"\",\"\",VLOOKUP(Y27,登録!$AE$2:$AH$55,3,FALSE))","v":"末岡　修"},{"$f":"IF(Z27=\"\",\"\",VLOOKUP(Y27,登録!$AE$2:$AH$55,4,FALSE))","v":120},{"$f":"★個人成績表★!I50","v":117},{"$f":"★個人成績表★!K50","v":"w"},{"$f":"★個人成績表★!M50","v":87},{"$f":"★個人成績表★!J50","v":"w"},{"$f":"★個人成績表★!L50","v":"w"},null,3,2,564,{"$f":"AK27*登録!$I$8/★対戦リーグ表★!AB27","v":564},"",564,{"$f":"IF(AB27=\"\",\"\",AI27*100000+AL27)","v":300564},{"$f":"IF(COUNTBLANK(AC27:AH27)=6,\"\",RANK(AO27,AO22:AO27))","v":2},{"$f":"IF(結果入力表!H123=\"\",\"\",結果入力表!H123)","v":""},{"$f":"IF(結果入力表!E151=\"\",\"\",結果入力表!E151)","v":""},{"$f":"IF(結果入力表!H200=\"\",\"\",結果入力表!H200)","v":""},{"$f":"IF(結果入力表!E137=\"\",\"\",結果入力表!E137)","v":""},{"$f":"IF(結果入力表!H172=\"\",\"\",結果入力表!H172)","v":""},null,null,16,null,"杉本　博章","WRC",{"$f":"IF(LEFT(S27,1)=\"A\",\"A\",IF(LEFT(S27,1)=\"B\",\"B\",S27))","v":""},{"$f":"IF(LEFT(T27,1)=\"A\",\"A\",IF(LEFT(T27,1)=\"B\",\"B\",T27))","v":""},{"$f":"IF(LEFT(U27,1)=\"A\",\"A\",IF(LEFT(U27,1)=\"B\",\"B\",U27))","v":""},{"$f":"IF(LEFT(V27,1)=\"A\",\"A\",IF(LEFT(V27,1)=\"B\",\"B\",V27))","v":""},{"$f":"IF(LEFT(W27,1)=\"A\",\"A\",IF(LEFT(W27,1)=\"B\",\"B\",W27))","v":""},{"$f":"IF(LEFT(AQ43,1)=\"A\",\"A\",IF(LEFT(AQ43,1)=\"B\",\"B\",AQ43))","v":""},{"$f":"IF(LEFT(AR43,1)=\"A\",\"A\",IF(LEFT(AR43,1)=\"B\",\"B\",AR43))","v":""},{"$f":"IF(LEFT(AS43,1)=\"A\",\"A\",IF(LEFT(AS43,1)=\"B\",\"B\",AS43))","v":""},{"$f":"IF(LEFT(AT43,1)=\"A\",\"A\",IF(LEFT(AT43,1)=\"B\",\"B\",AT43))","v":""},{"$f":"IF(LEFT(AU43,1)=\"A\",\"A\",IF(LEFT(AU43,1)=\"B\",\"B\",AU43))","v":""},{"$f":"IF(BM27>0,\"A\"&登録!$I$8,IF(BN27>0,\"B\"&登録!$I$8,BO27))","v":0},0,0,0,0,null,{"$f":"★個人成績表★!B26","v":"西峰　久祐"},101]
[null,null,null,null,null,null,null,null,null,null,null,null,null,null,null,null,null,null,null,null,null,null,null,null,null,null,null,null,null,null,null,null,null,null,null,null,null,null,null,null,null,null,null,null,null,null,null,null,null,null,null,null,null,null,null,null,null,null,null,null,null,null,null,{"$f":"IF(BM28>0,\"A\"&登録!$I$8,IF(BN28>0,\"B\"&登録!$I$8,BO28))","v":0},null,null,null,null,null,{"$f":"★個人成績表★!B27","v":"大橋　正寛"},"A120"]
[null,4,"Player","handy",{"$f":"B30","v":"KRC"},{"$f":"B31","v":"HRC"},{"$f":"B32","v":"SBC"},{"$f":"B33","v":"NRC"},{"$f":"B34","v":"ORC"},{"$f":"B35","v":"WRC"},"W","L","TP","(TP)","TP",null,"R_P","R",null,null,null,null,null,null,null,4,"Player","handy",{"$f":"$B$6","v":"KRC"},{"$f":"$B$7","v":"HRC"},{"$f":"$B$8","v":"SBC"},{"$f":"$B$9","v":"NRC"},{"$f":"$B$10","v":"ORC"},{"$f":"$B$11","v":"WRC"},"W","L","TP","(TP)","TP",null,"R_P","R",null,null,null,null,null,null,null,null,null,null,null,null,null,null,null,null,null,null,null,null,null,{"$f":"IF(BM29>0,\"A\"&登録!$I$8,IF(BN29>0,\"B\"&登録!$I$8,BO29))","v":0},null,null,null,null,null,{"$f":"★個人成績表★!B28","v":"秋田　倫央"},0]
[1,{"$f":"B22","v":"KRC"},{"$f":"VLOOKUP(VALUE(A30&B29),登録!$AE$2:$AH$55,3,FALSE)","v":"早川　徹"},{"$f":"VLOOKUP(VALUE(A30&B29),登録!$AE$2:$AH$55,4,FALSE)","v":120},null,{"$f":"★個人成績表★!H8","v":"w"},{"$f":"★個人成績表★!G8","v":"w"},{"$f":"★個人成績表★!F8","v":"w"},{"$f":"★個人成績表★!E8","v":"w"},{"$f":"★個人成績表★!D8","v":"w"},{"$f":"IF(COUNTBLANK(E30:J30)=6,\"\",COUNTIF(E30:J30,\"w\"))","v":5},{"$f":"IF(COUNTBLANK(E30:J30)=6,\"\",6-COUNTBLANK(E30:J30)-K30)","v":0},{"$f":"K30*D30+SUM(E30:J30)","v":600},{"$f":"M30*登録!$I$8/★対戦リーグ表★!D30","v":600},{"$f":"IF(ISERROR(N30),\"\",IF(M30=N30,\"\",\"*\"))","v":""},{"$f":"IF(COUNTBLANK(E30:J30)=6,\"\",N30)","v":600},{"$f":"K30*100000+N30","v":500600},{"$f":"IF(COUNTBLANK(E30:J30)=6,\"\",RANK(Q30,Q30:Q35))","v":1},null,{"$f":"IF(結果入力表!E103=\"\",\"\",結果入力表!E103)","v":""},{"$f":"IF(結果入力表!E82=\"\",\"\",結果入力表!E82)","v":""},{"$f":"IF(結果入力表!E61=\"\",\"\",結果入力表!E61)","v":""},{"$f":"IF(結果入力表!E40=\"\",\"\",結果入力表!E40)","v":""},{"$f":"IF(結果入力表!E19=\"\",\"\",結果入力表!E19)","v":""},14,{"$f":"Z22","v":"KRC"},{"$f":"VLOOKUP(Y30,登録!$AE$2:$AH$55,3,FALSE)","v":"早川　徹"},{"$f":"VLOOKUP(Y30,登録!$AE$2:$AH$55,4,FALSE)","v":120},null,{"$f":"★個人成績表★!M8","v":"w"},{"$f":"★個人成績表★!L8","v":"w"},{"$f":"★個人成績表★!K8","v":"w"},{"$f":"★個人成績表★!J8","v":38},{"$f":"★個人成績表★!I8","v":"w"},{"$f":"IF(COUNTBLANK(AC30:AH30)=6,\"\",COUNTIF(AC30:AH30,\"w\"))","v":4},{"$f":"IF(COUNTBLANK(AC30:AH30)=6,\"\",6-COUNTBLANK(AC30:AH30)-AI30)","v":1},{"$f":"AI30*AB30+SUM(AC30:AH30)","v":518},{"$f":"AK30*登録!$I$8/★対戦リーグ表★!AB30","v":518},{"$f":"IF(ISERROR(AL30),\"\",IF(AK30=AL30,\"\",\"*\"))","v":""},{"$f":"IF(COUNTBLANK(AC30:AH30)=6,\"\",AL30)","v":518},{"$f":"AI30*100000+AL30","v":400518},{"$f":"IF(COUNTBLANK(AC30:AH30)=6,\"\",RANK(AO30,AO30:AO35))","v":2},null,{"$f":"IF(結果入力表!E208=\"\",\"\",結果入力表!E208)","v":""},{"$f":"IF(結果入力表!E187=\"\",\"\",結果入力表!E187)","v":""},{"$f":"IF(結果入力表!E166=\"\",\"\",結果入力表!E166)","v":""},{"$f":"IF(結果入力表!E145=\"\",\"\",結果入力表!E145)","v":""},{"$f":"IF(結果入力表!E124=\"\",\"\",結果入力表!E124)","v":""},null,{"$f":"RANK(BP30,$BP$6:$BP$59)","v":16},null,{"$f":"C30","v":"早川　徹"},{"$f":"B30","v":"KRC"},{"$f":"IF(LEFT(T30,1)=\"A\",\"A\",IF(LEFT(T30,1)=\"B\",\"B\",T30))","v":""},{"$f":"IF(LEFT(U30,1)=\"A\",\"A\",IF(LEFT(U30,1)=\"B\",\"B\",U30))","v":""},{"$f":"IF(LEFT(V30,1)=\"A\",\"A\",IF(LEFT(V30,1)=\"B\",\"B\",V30))","v":""},{"$f":"IF(LEFT(W30,1)=\"A\",\"A\",IF(LEFT(W30,1)=\"B\",\"B\",W30))","v":""},{"$f":"IF(LEFT(X30,1)=\"A\",\"A\",IF(LEFT(X30,1)=\"B\",\"B\",X30))","v":""},{"$f":"IF(LEFT(AR30,1)=\"A\",\"A\",IF(LEFT(AR30,1)=\"B\",\"B\",AR30))","v":""},{"$f":"IF(LEFT(AS30,1)=\"A\",\"A\",IF(LEFT(AS30,1)=\"B\",\"B\",AS30))","v":""},{"$f":"IF(LEFT(AT30,1)=\"A\",\"A\",IF(LEFT(AT30,1)=\"B\",\"B\",AT30))","v":""},{"$f":"IF(LEFT(AU30,1)=\"A\",\"A\",IF(LEFT(AU30,1)=\"B\",\"B\",AU30))","v":""},{"$f":"IF(LEFT(AV30,1)=\"A\",\"A\",IF(LEFT(AV30,1)=\"B\",\"B\",AV30))","v":""},{"$f":"IF(BM30>0,\"A\"&登録!$I$8,IF(BN30>0,\"B\"&登録!$I$8,BO30))","v":0},{"$f":"COUNTIF($BB30:$BK30,BM$5)","v":0},0,{"$f":"MAX(BB30:BK30)","v":0},{"$f":"BM30*10000+BN30*1000+BO30","v":0},null,{"$f":"★個人成績表★!B29","v":"大橋　洋子"},0]
[2,"HRC",{"$f":"VLOOKUP(VALUE(A31&B29),登録!$AE$2:$AH$55,3,FALSE)","v":"伊藤　登"},{"$f":"VLOOKUP(VALUE(A31&B29),登録!$AE$2:$AH$55,4,FALSE)","v":120},{"$f":"★個人成績表★!H17","v":100},null,{"$f":"★個人成績表★!E17","v":"w"},{"$f":"★個人成績表★!G17","v":"w"},{"$f":"★個人成績表★!D17","v":88},{"$f":"★個人成績表★!F17","v":6},2,3,434,{"$f":"M31*登録!$I$8/★対戦リーグ表★!D31","v":434},"",434,{"$f":"K31*100000+N31","v":200434},{"$f":"IF(COUNTBLANK(E31:J31)=6,\"\",RANK(Q31,Q30:Q35))","v":4},{"$f":"IF(結果入力表!H103=\"\",\"\",結果入力表!H103)","v":""},null,{"$f":"IF(結果入力表!E26=\"\",\"\",結果入力表!E26)","v":""},{"$f":"IF(結果入力表!H75=\"\",\"\",結果入力表!H75)","v":""},{"$f":"IF(結果入力表!E12=\"\",\"\",結果入力表!E12)","v":""},{"$f":"IF(結果入力表!H47=\"\",\"\",結果入力表!H47)","v":""},25,"HRC",{"$f":"VLOOKUP(Y31,登録!$AE$2:$AH$55,3,FALSE)","v":"宮井健太郎"},{"$f":"VLOOKUP(Y31,登録!$AE$2:$AH$55,4,FALSE)","v":120},{"$f":"★個人成績表★!M18","v":45},null,{"$f":"★個人成績表★!J18","v":107},{"$f":"★個人成績表★!L18","v":92},{"$f":"★個人成績表★!I18","v":32},{"$f":"★個人成績表★!K18","v":"w"},1,4,396,{"$f":"AK31*登録!$I$8/★対戦リーグ表★!AB31","v":396},"",396,{"$f":"AI31*100000+AL31","v":100396},{"$f":"IF(COUNTBLANK(AC31:AH31)=6,\"\",RANK(AO31,AO30:AO35))","v":4},{"$f":"IF(結果入力表!H208=\"\",\"\",結果入力表!H208)","v":""},null,{"$f":"IF(結果入力表!E131=\"\",\"\",結果入力表!E131)","v":""},{"$f":"IF(結果入力表!H180=\"\",\"\",結果入力表!H180)","v":""},{"$f":"IF(結果入力表!E117=\"\",\"\",結果入力表!E117)","v":""},{"$f":"IF(結果入力表!H152=\"\",\"\",結果入力表!H152)","v":""},null,16,null,"伊藤　登","HRC",{"$f":"IF(LEFT(S31,1)=\"A\",\"A\",IF(LEFT(S31,1)=\"B\",\"B\",S31))","v":""},{"$f":"IF(LEFT(U31,1)=\"A\",\"A\",IF(LEFT(U31,1)=\"B\",\"B\",U31))","v":""},{"$f":"IF(LEFT(V31,1)=\"A\",\"A\",IF(LEFT(V31,1)=\"B\",\"B\",V31))","v":""},{"$f":"IF(LEFT(W31,1)=\"A\",\"A\",IF(LEFT(W31,1)=\"B\",\"B\",W31))","v":""},{"$f":"IF(LEFT(X31,1)=\"A\",\"A\",IF(LEFT(X31,1)=\"B\",\"B\",X31))","v":""},{"$f":"IF(LEFT(AQ23,1)=\"A\",\"A\",IF(LEFT(AQ23,1)=\"B\",\"B\",AQ23))","v":""},{"$f":"IF(LEFT(AS23,1)=\"A\",\"A\",IF(LEFT(AS23,1)=\"B\",\"B\",AS23))","v":""},{"$f":"IF(LEFT(AT23,1)=\"A\",\"A\",IF(LEFT(AT23,1)=\"B\",\"B\",AT23))","v":""},{"$f":"IF(LEFT(AU23,1)=\"A\",\"A\",IF(LEFT(AU23,1)=\"B\",\"B\",AU23))","v":""},{"$f":"IF(LEFT(AV23,1)=\"A\",\"A\",IF(LEFT(AV23,1)=\"B\",\"B\",AV23))","v":""},{"$f":"IF(BM31>0,\"A\"&登録!$I$8,IF(BN31>0,\"B\"&登録!$I$8,BO31))","v":0},0,0,0,0]
[3,"SBC",{"$f":"VLOOKUP(VALUE(A32&B29),登録!$AE$2:$AH$55,3,FALSE)","v":"西峰　久祐"},{"$f":"VLOOKUP(VALUE(A32&B29),登録!$AE$2:$AH$55,4,FALSE)","v":120},{"$f":"★個人成績表★!G26","v":57},{"$f":"★個人成績表★!E26","v":61},null,{"$f":"★個人成績表★!D26","v":"w"},{"$f":"★個人成績表★!F26","v":3},{"$f":"★個人成績表★!H26","v":28},1,4,269,{"$f":"M32*登録!$I$8/★対戦リーグ表★!D32","v":269},"",269,{"$f":"K32*100000+N32","v":100269},{"$f":"IF(COUNTBLANK(E32:J32)=6,\"\",RANK(Q32,Q30:Q35))","v":5},{"$f":"IF(結果入力表!H82=\"\",\"\",結果入力表!H82)","v":""},{"$f":"IF(結果入力表!H26=\"\",\"\",結果入力表!H26)","v":""},null,{"$f":"IF(結果入力表!E5=\"\",\"\",結果入力表!E5)","v":""},{"$f":"IF(結果入力表!H54=\"\",\"\",結果入力表!H54)","v":""},{"$f":"IF(結果入力表!E96=\"\",\"\",結果入力表!E96)","v":""},36,"SBC",{"$f":"VLOOKUP(Y32,登録!$AE$2:$AH$55,3,FALSE)","v":"秋田　倫央"},{"$f":"VLOOKUP(Y32,登録!$AE$2:$AH$55,4,FALSE)","v":120},{"$f":"★個人成績表★!L28","v":11},{"$f":"★個人成績表★!J28","v":"w"},null,{"$f":"★個人成績表★!I28","v":46},{"$f":"★個人成績表★!K28","v":109},{"$f":"★個人成績表★!M28","v":31},1,4,317,{"$f":"AK32*登録!$I$8/★対戦リーグ表★!AB32","v":317},"",317,{"$f":"AI32*100000+AL32","v":100317},{"$f":"IF(COUNTBLANK(AC32:AH32)=6,\"\",RANK(AO32,AO30:AO35))","v":5},{"$f":"IF(結果入力表!H187=\"\",\"\",結果入力表!H187)","v":""},{"$f":"IF(結果入力表!H131=\"\",\"\",結果入力表!H131)","v":""},null,{"$f":"IF(結果入力表!E110=\"\",\"\",結果入力表!E110)","v":""},{"$f":"IF(結果入力表!H159=\"\",\"\",結果入力表!H159)","v":""},{"$f":"IF(結果入力表!E201=\"\",\"\",結果入力表!E201)","v":""},null,15,null,"西峰　久祐","SBC",{"$f":"IF(LEFT(S32,1)=\"A\",\"A\",IF(LEFT(S32,1)=\"B\",\"B\",S32))","v":""},{"$f":"IF(LEFT(T32,1)=\"A\",\"A\",IF(LEFT(T32,1)=\"B\",\"B\",T32))","v":""},{"$f":"IF(LEFT(V32,1)=\"A\",\"A\",IF(LEFT(V32,1)=\"B\",\"B\",V32))","v":""},{"$f":"IF(LEFT(W32,1)=\"A\",\"A\",IF(LEFT(W32,1)=\"B\",\"B\",W32))","v":""},{"$f":"IF(LEFT(X32,1)=\"A\",\"A\",IF(LEFT(X32,1)=\"B\",\"B\",X32))","v":""},{"$f":"IF(LEFT(AQ16,1)=\"A\",\"A\",IF(LEFT(AQ16,1)=\"B\",\"B\",AQ16))","v":""},{"$f":"IF(LEFT(AR16,1)=\"A\",\"A\",IF(LEFT(AR16,1)=\"B\",\"B\",AR16))","v":""},{"$f":"IF(LEFT(AT16,1)=\"A\",\"A\",IF(LEFT(AT16,1)=\"B\",\"B\",AT16))","v":""},{"$f":"IF(LEFT(AU16,1)=\"A\",\"A\",IF(LEFT(AU16,1)=\"B\",\"B\",AU16))","v":101},{"$f":"IF(LEFT(AV16,1)=\"A\",\"A\",IF(LEFT(AV16,1)=\"B\",\"B\",AV16))","v":""},{"$f":"IF(BM32>0,\"A\"&登録!$I$8,IF(BN32>0,\"B\"&登録!$I$8,BO32))","v":101},0,0,101,101]
[4,"NRC",{"$f":"VLOOKUP(VALUE(A33&B29),登録!$AE$2:$AH$55,3,FALSE)","v":"植田　慎也"},{"$f":"VLOOKUP(VALUE(A33&B29),登録!$AE$2:$AH$55,4,FALSE)","v":120},{"$f":"★個人成績表★!F35","v":86},{"$f":"★個人成績表★!G35","v":34},{"$f":"★個人成績表★!D35","v":72},null,{"$f":"★個人成績表★!H35","v":106},{"$f":"★個人成績表★!E35","v":76},0,5,374,{"$f":"M33*登録!$I$8/★対戦リーグ表★!D33","v":374},"",374,{"$f":"K33*100000+N33","v":374},{"$f":"IF(COUNTBLANK(E33:J33)=6,\"\",RANK(Q33,Q30:Q35))","v":6},{"$f":"IF(結果入力表!H61=\"\",\"\",結果入力表!H61)","v":""},{"$f":"IF(結果入力表!E75=\"\",\"\",結果入力表!E75)","v":""},{"$f":"IF(結果入力表!H5=\"\",\"\",結果入力表!H5)","v":""},null,{"$f":"IF(結果入力表!E89=\"\",\"\",結果入力表!E89)","v":""},{"$f":"IF(結果入力表!H33=\"\",\"\",結果入力表!H33)","v":""},47,"NRC",{"$f":"VLOOKUP(Y33,登録!$AE$2:$AH$55,3,FALSE)","v":"白戸　恭子"},{"$f":"VLOOKUP(Y33,登録!$AE$2:$AH$55,4,FALSE)","v":100},{"$f":"★個人成績表★!K38","v":66},{"$f":"★個人成績表★!L38","v":"w"},{"$f":"★個人成績表★!I38","v":"w"},null,{"$f":"★個人成績表★!M38","v":25},{"$f":"★個人成績表★!J38","v":"w"},3,2,391,{"$f":"AK33*登録!$I$8/★対戦リーグ表★!AB33","v":469.2},"*",469.2,{"$f":"AI33*100000+AL33","v":300469.2},{"$f":"IF(COUNTBLANK(AC33:AH33)=6,\"\",RANK(AO33,AO30:AO35))","v":3},{"$f":"IF(結果入力表!H166=\"\",\"\",結果入力表!H166)","v":""},{"$f":"IF(結果入力表!E180=\"\",\"\",結果入力表!E180)","v":""},{"$f":"IF(結果入力表!H110=\"\",\"\",結果入力表!H110)","v":""},null,{"$f":"IF(結果入力表!E194=\"\",\"\",結果入力表!E194)","v":""},{"$f":"IF(結果入力表!H138=\"\",\"\",結果入力表!H138)","v":"A105"},null,11,null,"植田　慎也","NRC",{"$f":"IF(LEFT(S33,1)=\"A\",\"A\",IF(LEFT(S33,1)=\"B\",\"B\",S33))","v":""},{"$f":"IF(LEFT(T33,1)=\"A\",\"A\",IF(LEFT(T33,1)=\"B\",\"B\",T33))","v":""},{"$f":"IF(LEFT(U33,1)=\"A\",\"A\",IF(LEFT(U33,1)=\"B\",\"B\",U33))","v":""},{"$f":"IF(LEFT(W33,1)=\"A\",\"A\",IF(LEFT(W33,1)=\"B\",\"B\",W33))","v":""},{"$f":"IF(LEFT(X33,1)=\"A\",\"A\",IF(LEFT(X33,1)=\"B\",\"B\",X33))","v":""},{"$f":"IF(LEFT(AQ9,1)=\"A\",\"A\",IF(LEFT(AQ9,1)=\"B\",\"B\",AQ9))","v":""},{"$f":"IF(LEFT(AR9,1)=\"A\",\"A\",IF(LEFT(AR9,1)=\"B\",\"B\",AR9))","v":""},{"$f":"IF(LEFT(AS9,1)=\"A\",\"A\",IF(LEFT(AS9,1)=\"B\",\"B\",AS9))","v":""},{"$f":"IF(LEFT(AU9,1)=\"A\",\"A\",IF(LEFT(AU9,1)=\"B\",\"B\",AU9))","v":""},{"$f":"IF(LEFT(AV9,1)=\"A\",\"A\",IF(LEFT(AV9,1)=\"B\",\"B\",AV9))","v":106},{"$f":"IF(BM33>0,\"A\"&登録!$I$8,IF(BN33>0,\"B\"&登録!$I$8,BO33))","v":106},0,0,106,106,null,{"$f":"★個人成績表★!B32","v":"吉向　翔平"},{"$f":"VLOOKUP(BR33,$AZ$6:$BL$59,13,FALSE)","v":0}]
[5,"ORC",{"$f":"VLOOKUP(VALUE(A34&B29),登録!$AE$2:$AH$55,3,FALSE)","v":"村上　泰辰"},{"$f":"VLOOKUP(VALUE(A34&B29),登録!$AE$2:$AH$55,4,FALSE)","v":120},{"$f":"★個人成績表★!E44","v":34},{"$f":"★個人成績表★!D44","v":"w"},{"$f":"★個人成績表★!F44","v":"w"},{"$f":"★個人成績表★!H44","v":"w"},null,{"$f":"★個人成績表★!G44","v":"w"},4,1,514,{"$f":"M34*登録!$I$8/★対戦リーグ表★!D34","v":514},"",514,{"$f":"K34*100000+N34","v":400514},{"$f":"IF(COUNTBLANK(E34:J34)=6,\"\",RANK(Q34,Q30:Q35))","v":2},{"$f":"IF(結果入力表!H40=\"\",\"\",結果入力表!H40)","v":""},{"$f":"IF(結果入力表!H12=\"\",\"\",結果入力表!H12)","v":""},{"$f":"IF(結果入力表!E54=\"\",\"\",結果入力表!E54)","v":""},{"$f":"IF(結果入力表!H89=\"\",\"\",結果入力表!H89)","v":""},null,{"$f":"IF(結果入力表!E68=\"\",\"\",結果入力表!E68)","v":""},51,"ORC",{"$f":"VLOOKUP(Y34,登録!$AE$2:$AH$55,3,FALSE)","v":"松居　勝巳"},{"$f":"VLOOKUP(Y34,登録!$AE$2:$AH$55,4,FALSE)","v":120},{"$f":"★個人成績表★!J41","v":"w"},{"$f":"★個人成績表★!I41","v":"w"},{"$f":"★個人成績表★!K41","v":"w"},{"$f":"★個人成績表★!M41","v":"w"},null,{"$f":"★個人成績表★!L41","v":"w"},5,0,600,{"$f":"AK34*登録!$I$8/★対戦リーグ表★!AB34","v":600},"",600,{"$f":"AI34*100000+AL34","v":500600},{"$f":"IF(COUNTBLANK(AC34:AH34)=6,\"\",RANK(AO34,AO30:AO35))","v":1},{"$f":"IF(結果入力表!H145=\"\",\"\",結果入力表!H145)","v":""},{"$f":"IF(結果入力表!H117=\"\",\"\",結果入力表!H117)","v":""},{"$f":"IF(結果入力表!E159=\"\",\"\",結果入力表!E159)","v":""},{"$f":"IF(結果入力表!H194=\"\",\"\",結果入力表!H194)","v":""},null,{"$f":"IF(結果入力表!E173=\"\",\"\",結果入力表!E173)","v":""},null,16,null,"村上　泰辰","ORC",{"$f":"IF(LEFT(S34,1)=\"A\",\"A\",IF(LEFT(S34,1)=\"B\",\"B\",S34))","v":""},{"$f":"IF(LEFT(T34,1)=\"A\",\"A\",IF(LEFT(T34,1)=\"B\",\"B\",T34))","v":""},{"$f":"IF(LEFT(U34,1)=\"A\",\"A\",IF(LEFT(U34,1)=\"B\",\"B\",U34))","v":""},{"$f":"IF(LEFT(V34,1)=\"A\",\"A\",IF(LEFT(V34,1)=\"B\",\"B\",V34))","v":""},{"$f":"IF(LEFT(X34,1)=\"A\",\"A\",IF(LEFT(X34,1)=\"B\",\"B\",X34))","v":""},{"$f":"IF(LEFT(AQ58,1)=\"A\",\"A\",IF(LEFT(AQ58,1)=\"B\",\"B\",AQ58))","v":""},{"$f":"IF(LEFT(AR58,1)=\"A\",\"A\",IF(LEFT(AR58,1)=\"B\",\"B\",AR58))","v":""},{"$f":"IF(LEFT(AS58,1)=\"A\",\"A\",IF(LEFT(AS58,1)=\"B\",\"B\",AS58))","v":""},{"$f":"IF(LEFT(AT58,1)=\"A\",\"A\",IF(LEFT(AT58,1)=\"B\",\"B\",AT58))","v":""},{"$f":"IF(LEFT(AV58,1)=\"A\",\"A\",IF(LEFT(AV58,1)=\"B\",\"B\",AV58))","v":""},{"$f":"IF(BM34>0,\"A\"&登録!$I$8,IF(BN34>0,\"B\"&登録!$I$8,BO34))","v":0},0,0,0,0,null,{"$f":"★個人成績表★!B33","v":"岩本　剛"},0]
[6,"WRC",{"$f":"IF(B35=\"\",\"\",VLOOKUP(VALUE(A35&B29),登録!$AE$2:$AH$55,3,FALSE))","v":"中本　雅大"},{"$f":"IF(B35=\"\",\"\",VLOOKUP(VALUE(A35&B29),登録!$AE$2:$AH$55,4,FALSE))","v":120},{"$f":"★個人成績表★!D53","v":64},{"$f":"★個人成績表★!F53","v":"w"},{"$f":"★個人成績表★!H53","v":"w"},{"$f":"★個人成績表★!E53","v":"w"},{"$f":"★個人成績表★!G53","v":119},null,3,2,543,{"$f":"M35*登録!$I$8/★対戦リーグ表★!D35","v":543},"",543,{"$f":"IF(D35=\"\",\"\",K35*100000+N35)","v":300543},{"$f":"IF(COUNTBLANK(E35:J35)=6,\"\",RANK(Q35,Q30:Q35))","v":3},{"$f":"IF(結果入力表!H19=\"\",\"\",結果入力表!H19)","v":""},{"$f":"IF(結果入力表!E47=\"\",\"\",結果入力表!E47)","v":""},{"$f":"IF(結果入力表!H96=\"\",\"\",結果入力表!H96)","v":""},{"$f":"IF(結果入力表!E33=\"\",\"\",結果入力表!E33)","v":""},{"$f":"IF(結果入力表!H68=\"\",\"\",結果入力表!H68)","v":""},null,62,"WRC",{"$f":"IF(Z35=\"\",\"\",VLOOKUP(Y35,登録!$AE$2:$AH$55,3,FALSE))","v":"和田宗一郎"},{"$f":"IF(Z35=\"\",\"\",VLOOKUP(Y35,登録!$AE$2:$AH$55,4,FALSE))","v":120},{"$f":"★個人成績表★!I51","v":61},{"$f":"★個人成績表★!K51","v":37},{"$f":"★個人成績表★!M51","v":"w"},{"$f":"★個人成績表★!J51","v":0},{"$f":"★個人成績表★!L51","v":83},null,1,4,301,{"$f":"AK35*登録!$I$8/★対戦リーグ表★!AB35","v":301},"",301,{"$f":"IF(AB35=\"\",\"\",AI35*100000+AL35)","v":100301},{"$f":"IF(COUNTBLANK(AC35:AH35)=6,\"\",RANK(AO35,AO30:AO35))","v":6},{"$f":"IF(結果入力表!H124=\"\",\"\",結果入力表!H124)","v":""},{"$f":"IF(結果入力表!E152=\"\",\"\",結果入力表!E152)","v":""},{"$f":"IF(結果入力表!H201=\"\",\"\",結果入力表!H201)","v":""},{"$f":"IF(結果入力表!E138=\"\",\"\",結果入力表!E138)","v":""},{"$f":"IF(結果入力表!H173=\"\",\"\",結果入力表!H173)","v":""},null,null,16,null,"中本　雅大","WRC",{"$f":"IF(LEFT(S35,1)=\"A\",\"A\",IF(LEFT(S35,1)=\"B\",\"B\",S35))","v":""},{"$f":"IF(LEFT(T35,1)=\"A\",\"A\",IF(LEFT(T35,1)=\"B\",\"B\",T35))","v":""},{"$f":"IF(LEFT(U35,1)=\"A\",\"A\",IF(LEFT(U35,1)=\"B\",\"B\",U35))","v":""},{"$f":"IF(LEFT(V35,1)=\"A\",\"A\",IF(LEFT(V35,1)=\"B\",\"B\",V35))","v":""},{"$f":"IF(LEFT(W35,1)=\"A\",\"A\",IF(LEFT(W35,1)=\"B\",\"B\",W35))","v":""},{"$f":"IF(LEFT(AQ51,1)=\"A\",\"A\",IF(LEFT(AQ51,1)=\"B\",\"B\",AQ51))","v":""},{"$f":"IF(LEFT(AR51,1)=\"A\",\"A\",IF(LEFT(AR51,1)=\"B\",\"B\",AR51))","v":""},{"$f":"IF(LEFT(AS51,1)=\"A\",\"A\",IF(LEFT(AS51,1)=\"B\",\"B\",AS51))","v":""},{"$f":"IF(LEFT(AT51,1)=\"A\",\"A\",IF(LEFT(AT51,1)=\"B\",\"B\",AT51))","v":""},{"$f":"IF(LEFT(AU51,1)=\"A\",\"A\",IF(LEFT(AU51,1)=\"B\",\"B\",AU51))","v":""},{"$f":"IF(BM35>0,\"A\"&登録!$I$8,IF(BN35>0,\"B\"&登録!$I$8,BO35))","v":0},0,0,0,0,null,{"$f":"★個人成績表★!B34","v":"白戸　玲人"},107]
[null,null,null,null,null,null,null,null,null,null,null,null,null,null,null,null,null,null,null,null,null,null,null,null,null,null,null,null,null,null,null,null,null,null,null,null,null,null,null,null,null,null,null,null,null,null,null,null,null,null,null,null,null,null,null,null,null,null,null,null,null,null,null,{"$f":"IF(BM36>0,\"A\"&登録!$I$8,IF(BN36>0,\"B\"&登録!$I$8,BO36))","v":0},null,null,null,null,null,{"$f":"★個人成績表★!B35","v":"植田　慎也"},106]
[null,5,"Player","handy",{"$f":"B38","v":"KRC"},{"$f":"B39","v":"HRC"},{"$f":"B40","v":"SBC"},{"$f":"B41","v":"NRC"},{"$f":"B42","v":"ORC"},{"$f":"B43","v":"WRC"},"W","L","TP","(TP)","TP",null,"R_P","R",null,null,null,null,null,null,null,5,"Player","handy",{"$f":"$B$6","v":"KRC"},{"$f":"$B$7","v":"HRC"},{"$f":"$B$8","v":"SBC"},{"$f":"$B$9","v":"NRC"},{"$f":"$B$10","v":"ORC"},{"$f":"$B$11","v":"WRC"},"W","L","TP","(TP)","TP",null,"R_P","R",null,null,null,null,null,null,null,null,null,null,null,null,null,null,null,null,null,null,null,null,null,{"$f":"IF(BM37>0,\"A\"&登録!$I$8,IF(BN37>0,\"B\"&登録!$I$8,BO37))","v":0},null,null,null,null,null,{"$f":"★個人成績表★!B36","v":"近藤　拓馬"},0]
[1,{"$f":"B30","v":"KRC"},{"$f":"VLOOKUP(VALUE(A38&B37),登録!$AE$2:$AH$55,3,FALSE)","v":"井関　一成"},{"$f":"VLOOKUP(VALUE(A38&B37),登録!$AE$2:$AH$55,4,FALSE)","v":120},null,{"$f":"★個人成績表★!H9","v":"w"},{"$f":"★個人成績表★!G9","v":50},{"$f":"★個人成績表★!F9","v":102},{"$f":"★個人成績表★!E9","v":"w"},{"$f":"★個人成績表★!D9","v":96},{"$f":"IF(COUNTBLANK(E38:J38)=6,\"\",COUNTIF(E38:J38,\"w\"))","v":2},{"$f":"IF(COUNTBLANK(E38:J38)=6,\"\",6-COUNTBLANK(E38:J38)-K38)","v":3},{"$f":"K38*D38+SUM(E38:J38)","v":488},{"$f":"M38*登録!$I$8/★対戦リーグ表★!D38","v":488},{"$f":"IF(ISERROR(N38),\"\",IF(M38=N38,\"\",\"*\"))","v":""},{"$f":"IF(COUNTBLANK(E38:J38)=6,\"\",N38)","v":488},{"$f":"K38*100000+N38","v":200488},{"$f":"IF(COUNTBLANK(E38:J38)=6,\"\",RANK(Q38,Q38:Q43))","v":4},null,{"$f":"IF(結果入力表!E104=\"\",\"\",結果入力表!E104)","v":""},{"$f":"IF(結果入力表!E83=\"\",\"\",結果入力表!E83)","v":""},{"$f":"IF(結果入力表!E62=\"\",\"\",結果入力表!E62)","v":""},{"$f":"IF(結果入力表!E41=\"\",\"\",結果入力表!E41)","v":""},{"$f":"IF(結果入力表!E20=\"\",\"\",結果入力表!E20)","v":""},15,{"$f":"Z30","v":"KRC"},{"$f":"VLOOKUP(Y38,登録!$AE$2:$AH$55,3,FALSE)","v":"井関　一成"},{"$f":"VLOOKUP(Y38,登録!$AE$2:$AH$55,4,FALSE)","v":120},null,{"$f":"★個人成績表★!M9","v":99},{"$f":"★個人成績表★!L9","v":"w"},{"$f":"★個人成績表★!K9","v":76},{"$f":"★個人成績表★!J9","v":63},{"$f":"★個人成績表★!I9","v":119},{"$f":"IF(COUNTBLANK(AC38:AH38)=6,\"\",COUNTIF(AC38:AH38,\"w\"))","v":1},{"$f":"IF(COUNTBLANK(AC38:AH38)=6,\"\",6-COUNTBLANK(AC38:AH38)-AI38)","v":4},{"$f":"AI38*AB38+SUM(AC38:AH38)","v":477},{"$f":"AK38*登録!$I$8/★対戦リーグ表★!AB38","v":477},{"$f":"IF(ISERROR(AL38),\"\",IF(AK38=AL38,\"\",\"*\"))","v":""},{"$f":"IF(COUNTBLANK(AC38:AH38)=6,\"\",AL38)","v":477},{"$f":"AI38*100000+AL38","v":100477},{"$f":"IF(COUNTBLANK(AC38:AH38)=6,\"\",RANK(AO38,AO38:AO43))","v":5},null,{"$f":"IF(結果入力表!E209=\"\",\"\",結果入力表!E209)","v":""},{"$f":"IF(結果入力表!E188=\"\",\"\",結果入力表!E188)","v":""},{"$f":"IF(結果入力表!E167=\"\",\"\",結果入力表!E167)","v":""},{"$f":"IF(結果入力表!E146=\"\",\"\",結果入力表!E146)","v":""},{"$f":"IF(結果入力表!E125=\"\",\"\",結果入力表!E125)","v":""},null,{"$f":"RANK(BP38,$BP$6:$BP$59)","v":16},null,{"$f":"C38","v":"井関　一成"},{"$f":"B38","v":"KRC"},{"$f":"IF(LEFT(T38,1)=\"A\",\"A\",IF(LEFT(T38,1)=\"B\",\"B\",T38))","v":""},{"$f":"IF(LEFT(U38,1)=\"A\",\"A\",IF(LEFT(U38,1)=\"B\",\"B\",U38))","v":""},{"$f":"IF(LEFT(V38,1)=\"A\",\"A\",IF(LEFT(V38,1)=\"B\",\"B\",V38))","v":""},{"$f":"IF(LEFT(W38,1)=\"A\",\"A\",IF(LEFT(W38,1)=\"B\",\"B\",W38))","v":""},{"$f":"IF(LEFT(X38,1)=\"A\",\"A\",IF(LEFT(X38,1)=\"B\",\"B\",X38))","v":""},{"$f":"IF(LEFT(AR38,1)=\"A\",\"A\",IF(LEFT(AR38,1)=\"B\",\"B\",AR38))","v":""},{"$f":"IF(LEFT(AS38,1)=\"A\",\"A\",IF(LEFT(AS38,1)=\"B\",\"B\",AS38))","v":""},{"$f":"IF(LEFT(AT38,1)=\"A\",\"A\",IF(LEFT(AT38,1)=\"B\",\"B\",AT38))","v":""},{"$f":"IF(LEFT(AU38,1)=\"A\",\"A\",IF(LEFT(AU38,1)=\"B\",\"B\",AU38))","v":""},{"$f":"IF(LEFT(AV38,1)=\"A\",\"A\",IF(LEFT(AV38,1)=\"B\",\"B\",AV38))","v":""},{"$f":"IF(BM38>0,\"A\"&登録!$I$8,IF(BN38>0,\"B\"&登録!$I$8,BO38))","v":0},{"$f":"COUNTIF($BB38:$BK38,BM$5)","v":0},0,{"$f":"MAX(BB38:BK38)","v":0},{"$f":"BM38*10000+BN38*1000+BO38","v":0},null,{"$f":"★個人成績表★!B37","v":"長谷川　進"},0]
[2,"HRC",{"$f":"VLOOKUP(VALUE(A39&B37),登録!$AE$2:$AH$55,3,FALSE)","v":"宮井健太郎"},{"$f":"VLOOKUP(VALUE(A39&B37),登録!$AE$2:$AH$55,4,FALSE)","v":120},{"$f":"★個人成績表★!H18","v":25},null,{"$f":"★個人成績表★!E18","v":48},{"$f":"★個人成績表★!G18","v":"w"},{"$f":"★個人成績表★!D18","v":7},{"$f":"★個人成績表★!F18","v":26},1,4,226,{"$f":"M39*登録!$I$8/★対戦リーグ表★!D39","v":226},"",226,{"$f":"K39*100000+N39","v":100226},{"$f":"IF(COUNTBLANK(E39:J39)=6,\"\",RANK(Q39,Q38:Q43))","v":5},{"$f":"IF(結果入力表!H104=\"\",\"\",結果入力表!H104)","v":""},null,{"$f":"IF(結果入力表!E27=\"\",\"\",結果入力表!E27)","v":""},{"$f":"IF(結果入力表!H76=\"\",\"\",結果入力表!H76)","v":""},{"$f":"IF(結果入力表!E13=\"\",\"\",結果入力表!E13)","v":""},{"$f":"IF(結果入力表!H48=\"\",\"\",結果入力表!H48)","v":""},26,"HRC",{"$f":"VLOOKUP(Y39,登録!$AE$2:$AH$55,3,FALSE)","v":"白澤雄一郎"},{"$f":"VLOOKUP(Y39,登録!$AE$2:$AH$55,4,FALSE)","v":120},{"$f":"★個人成績表★!M19","v":"w"},null,{"$f":"★個人成績表★!J19","v":"w"},{"$f":"★個人成績表★!L19","v":"w"},{"$f":"★個人成績表★!I19","v":72},{"$f":"★個人成績表★!K19","v":0},3,2,432,{"$f":"AK39*登録!$I$8/★対戦リーグ表★!AB39","v":432},"",432,{"$f":"AI39*100000+AL39","v":300432},{"$f":"IF(COUNTBLANK(AC39:AH39)=6,\"\",RANK(AO39,AO38:AO43))","v":4},{"$f":"IF(結果入力表!H209=\"\",\"\",結果入力表!H209)","v":""},null,{"$f":"IF(結果入力表!E132=\"\",\"\",結果入力表!E132)","v":""},{"$f":"IF(結果入力表!H181=\"\",\"\",結果入力表!H181)","v":""},{"$f":"IF(結果入力表!E118=\"\",\"\",結果入力表!E118)","v":""},{"$f":"IF(結果入力表!H153=\"\",\"\",結果入力表!H153)","v":""},null,16,null,"宮井健太郎","HRC",{"$f":"IF(LEFT(S39,1)=\"A\",\"A\",IF(LEFT(S39,1)=\"B\",\"B\",S39))","v":""},{"$f":"IF(LEFT(U39,1)=\"A\",\"A\",IF(LEFT(U39,1)=\"B\",\"B\",U39))","v":""},{"$f":"IF(LEFT(V39,1)=\"A\",\"A\",IF(LEFT(V39,1)=\"B\",\"B\",V39))","v":""},{"$f":"IF(LEFT(W39,1)=\"A\",\"A\",IF(LEFT(W39,1)=\"B\",\"B\",W39))","v":""},{"$f":"IF(LEFT(X39,1)=\"A\",\"A\",IF(LEFT(X39,1)=\"B\",\"B\",X39))","v":""},{"$f":"IF(LEFT(AQ31,1)=\"A\",\"A\",IF(LEFT(AQ31,1)=\"B\",\"B\",AQ31))","v":""},{"$f":"IF(LEFT(AS31,1)=\"A\",\"A\",IF(LEFT(AS31,1)=\"B\",\"B\",AS31))","v":""},{"$f":"IF(LEFT(AT31,1)=\"A\",\"A\",IF(LEFT(AT31,1)=\"B\",\"B\",AT31))","v":""},{"$f":"IF(LEFT(AU31,1)=\"A\",\"A\",IF(LEFT(AU31,1)=\"B\",\"B\",AU31))","v":""},{"$f":"IF(LEFT(AV31,1)=\"A\",\"A\",IF(LEFT(AV31,1)=\"B\",\"B\",AV31))","v":""},{"$f":"IF(BM39>0,\"A\"&登録!$I$8,IF(BN39>0,\"B\"&登録!$I$8,BO39))","v":0},0,0,0,0,null,{"$f":"★個人成績表★!B38","v":"白戸　恭子"},"A120"]
[3,"SBC",{"$f":"VLOOKUP(VALUE(A40&B37),登録!$AE$2:$AH$55,3,FALSE)","v":"大橋　正寛"},{"$f":"VLOOKUP(VALUE(A40&B37),登録!$AE$2:$AH$55,4,FALSE)","v":120},{"$f":"★個人成績表★!G27","v":"w"},{"$f":"★個人成績表★!E27","v":"w"},null,{"$f":"★個人成績表★!D27","v":"w"},{"$f":"★個人成績表★!F27","v":20},{"$f":"★個人成績表★!H27","v":39},3,2,419,{"$f":"M40*登録!$I$8/★対戦リーグ表★!D40","v":419},"",419,{"$f":"K40*100000+N40","v":300419},{"$f":"IF(COUNTBLANK(E40:J40)=6,\"\",RANK(Q40,Q38:Q43))","v":3},{"$f":"IF(結果入力表!H83=\"\",\"\",結果入力表!H83)","v":""},{"$f":"IF(結果入力表!H27=\"\",\"\",結果入力表!H27)","v":""},null,{"$f":"IF(結果入力表!E6=\"\",\"\",結果入力表!E6)","v":""},{"$f":"IF(結果入力表!H55=\"\",\"\",結果入力表!H55)","v":""},{"$f":"IF(結果入力表!E97=\"\",\"\",結果入力表!E97)","v":""},37,"SBC",{"$f":"VLOOKUP(Y40,登録!$AE$2:$AH$55,3,FALSE)","v":"大橋　洋子"},{"$f":"VLOOKUP(Y40,登録!$AE$2:$AH$55,4,FALSE)","v":100},{"$f":"★個人成績表★!L29","v":23},{"$f":"★個人成績表★!J29","v":3},null,{"$f":"★個人成績表★!I29","v":32},{"$f":"★個人成績表★!K29","v":16},{"$f":"★個人成績表★!M29","v":70},0,5,144,{"$f":"AK40*登録!$I$8/★対戦リーグ表★!AB40","v":172.8},"*",172.8,{"$f":"AI40*100000+AL40","v":172.8},{"$f":"IF(COUNTBLANK(AC40:AH40)=6,\"\",RANK(AO40,AO38:AO43))","v":6},{"$f":"IF(結果入力表!H188=\"\",\"\",結果入力表!H188)","v":""},{"$f":"IF(結果入力表!H132=\"\",\"\",結果入力表!H132)","v":""},null,{"$f":"IF(結果入力表!E111=\"\",\"\",結果入力表!E111)","v":""},{"$f":"IF(結果入力表!H160=\"\",\"\",結果入力表!H160)","v":""},{"$f":"IF(結果入力表!E202=\"\",\"\",結果入力表!E202)","v":""},null,2,null,"大橋　正寛","SBC",{"$f":"IF(LEFT(S40,1)=\"A\",\"A\",IF(LEFT(S40,1)=\"B\",\"B\",S40))","v":""},{"$f":"IF(LEFT(T40,1)=\"A\",\"A\",IF(LEFT(T40,1)=\"B\",\"B\",T40))","v":""},{"$f":"IF(LEFT(V40,1)=\"A\",\"A\",IF(LEFT(V40,1)=\"B\",\"B\",V40))","v":""},{"$f":"IF(LEFT(W40,1)=\"A\",\"A\",IF(LEFT(W40,1)=\"B\",\"B\",W40))","v":""},{"$f":"IF(LEFT(X40,1)=\"A\",\"A\",IF(LEFT(X40,1)=\"B\",\"B\",X40))","v":""},{"$f":"IF(LEFT(AQ24,1)=\"A\",\"A\",IF(LEFT(AQ24,1)=\"B\",\"B\",AQ24))","v":""},{"$f":"IF(LEFT(AR24,1)=\"A\",\"A\",IF(LEFT(AR24,1)=\"B\",\"B\",AR24))","v":""},{"$f":"IF(LEFT(AT24,1)=\"A\",\"A\",IF(LEFT(AT24,1)=\"B\",\"B\",AT24))","v":"A"},{"$f":"IF(LEFT(AU24,1)=\"A\",\"A\",IF(LEFT(AU24,1)=\"B\",\"B\",AU24))","v":""},{"$f":"IF(LEFT(AV24,1)=\"A\",\"A\",IF(LEFT(AV24,1)=\"B\",\"B\",AV24))","v":""},{"$f":"IF(BM40>0,\"A\"&登録!$I$8,IF(BN40>0,\"B\"&登録!$I$8,BO40))","v":"A120"},1,0,0,10000]
[4,"NRC",{"$f":"VLOOKUP(VALUE(A41&B37),登録!$AE$2:$AH$55,3,FALSE)","v":"近藤　拓馬"},{"$f":"VLOOKUP(VALUE(A41&B37),登録!$AE$2:$AH$55,4,FALSE)","v":120},{"$f":"★個人成績表★!F36","v":"w"},{"$f":"★個人成績表★!G36","v":21},{"$f":"★個人成績表★!D36","v":19},null,{"$f":"★個人成績表★!H36","v":1},{"$f":"★個人成績表★!E36","v":57},1,4,218,{"$f":"M41*登録!$I$8/★対戦リーグ表★!D41","v":218},"",218,{"$f":"K41*100000+N41","v":100218},{"$f":"IF(COUNTBLANK(E41:J41)=6,\"\",RANK(Q41,Q38:Q43))","v":6},{"$f":"IF(結果入力表!H62=\"\",\"\",結果入力表!H62)","v":""},{"$f":"IF(結果入力表!E76=\"\",\"\",結果入力表!E76)","v":""},{"$f":"IF(結果入力表!H6=\"\",\"\",結果入力表!H6)","v":""},null,{"$f":"IF(結果入力表!E90=\"\",\"\",結果入力表!E90)","v":""},{"$f":"IF(結果入力表!H34=\"\",\"\",結果入力表!H34)","v":""},41,"NRC",{"$f":"VLOOKUP(Y41,登録!$AE$2:$AH$55,3,FALSE)","v":"吉向　翔平"},{"$f":"VLOOKUP(Y41,登録!$AE$2:$AH$55,4,FALSE)","v":120},{"$f":"★個人成績表★!K32","v":"w"},{"$f":"★個人成績表★!L32","v":26},{"$f":"★個人成績表★!I32","v":"w"},null,{"$f":"★個人成績表★!M32","v":"w"},{"$f":"★個人成績表★!J32","v":"w"},4,1,506,{"$f":"AK41*登録!$I$8/★対戦リーグ表★!AB41","v":506},"",506,{"$f":"AI41*100000+AL41","v":400506},{"$f":"IF(COUNTBLANK(AC41:AH41)=6,\"\",RANK(AO41,AO38:AO43))","v":2},{"$f":"IF(結果入力表!H167=\"\",\"\",結果入力表!H167)","v":""},{"$f":"IF(結果入力表!E181=\"\",\"\",結果入力表!E181)","v":""},{"$f":"IF(結果入力表!H111=\"\",\"\",結果入力表!H111)","v":""},null,{"$f":"IF(結果入力表!E195=\"\",\"\",結果入力表!E195)","v":""},{"$f":"IF(結果入力表!H139=\"\",\"\",結果入力表!H139)","v":""},null,16,null,"近藤　拓馬","NRC",{"$f":"IF(LEFT(S41,1)=\"A\",\"A\",IF(LEFT(S41,1)=\"B\",\"B\",S41))","v":""},{"$f":"IF(LEFT(T41,1)=\"A\",\"A\",IF(LEFT(T41,1)=\"B\",\"B\",T41))","v":""},{"$f":"IF(LEFT(U41,1)=\"A\",\"A\",IF(LEFT(U41,1)=\"B\",\"B\",U41))","v":""},{"$f":"IF(LEFT(W41,1)=\"A\",\"A\",IF(LEFT(W41,1)=\"B\",\"B\",W41))","v":""},{"$f":"IF(LEFT(X41,1)=\"A\",\"A\",IF(LEFT(X41,1)=\"B\",\"B\",X41))","v":""},{"$f":"IF(LEFT(AQ17,1)=\"A\",\"A\",IF(LEFT(AQ17,1)=\"B\",\"B\",AQ17))","v":""},{"$f":"IF(LEFT(AR17,1)=\"A\",\"A\",IF(LEFT(AR17,1)=\"B\",\"B\",AR17))","v":""},{"$f":"IF(LEFT(AS17,1)=\"A\",\"A\",IF(LEFT(AS17,1)=\"B\",\"B\",AS17))","v":""},{"$f":"IF(LEFT(AU17,1)=\"A\",\"A\",IF(LEFT(AU17,1)=\"B\",\"B\",AU17))","v":""},{"$f":"IF(LEFT(AV17,1)=\"A\",\"A\",IF(LEFT(AV17,1)=\"B\",\"B\",AV17))","v":""},{"$f":"IF(BM41>0,\"A\"&登録!$I$8,IF(BN41>0,\"B\"&登録!$I$8,BO41))","v":0},0,0,0,0]
[5,"ORC",{"$f":"VLOOKUP(VALUE(A42&B37),登録!$AE$2:$AH$55,3,FALSE)","v":"小原　嘉丈"},{"$f":"VLOOKUP(VALUE(A42&B37),登録!$AE$2:$AH$55,4,FALSE)","v":120},{"$f":"★個人成績表★!E45","v":0},{"$f":"★個人成績表★!D45","v":"w"},{"$f":"★個人成績表★!F45","v":"w"},{"$f":"★個人成績表★!H45","v":"w"},null,{"$f":"★個人成績表★!G45","v":73},3,2,433,{"$f":"M42*登録!$I$8/★対戦リーグ表★!D42","v":433},"",433,{"$f":"K42*100000+N42","v":300433},{"$f":"IF(COUNTBLANK(E42:J42)=6,\"\",RANK(Q42,Q38:Q43))","v":2},{"$f":"IF(結果入力表!H41=\"\",\"\",結果入力表!H41)","v":""},{"$f":"IF(結果入力表!H13=\"\",\"\",結果入力表!H13)","v":""},{"$f":"IF(結果入力表!E55=\"\",\"\",結果入力表!E55)","v":""},{"$f":"IF(結果入力表!H90=\"\",\"\",結果入力表!H90)","v":116},null,{"$f":"IF(結果入力表!E69=\"\",\"\",結果入力表!E69)","v":""},52,"ORC",{"$f":"VLOOKUP(Y42,登録!$AE$2:$AH$55,3,FALSE)","v":"藤明　宏樹"},{"$f":"VLOOKUP(Y42,登録!$AE$2:$AH$55,4,FALSE)","v":120},{"$f":"★個人成績表★!J42","v":"w"},{"$f":"★個人成績表★!I42","v":"w"},{"$f":"★個人成績表★!K42","v":"w"},{"$f":"★個人成績表★!M42","v":60},null,{"$f":"★個人成績表★!L42","v":92},3,2,512,{"$f":"AK42*登録!$I$8/★対戦リーグ表★!AB42","v":512},"",512,{"$f":"AI42*100000+AL42","v":300512},{"$f":"IF(COUNTBLANK(AC42:AH42)=6,\"\",RANK(AO42,AO38:AO43))","v":3},{"$f":"IF(結果入力表!H146=\"\",\"\",結果入力表!H146)","v":""},{"$f":"IF(結果入力表!H118=\"\",\"\",結果入力表!H118)","v":""},{"$f":"IF(結果入力表!E160=\"\",\"\",結果入力表!E160)","v":""},{"$f":"IF(結果入力表!H195=\"\",\"\",結果入力表!H195)","v":""},null,{"$f":"IF(結果入力表!E174=\"\",\"\",結果入力表!E174)","v":""},null,7,null,"小原　嘉丈","ORC",{"$f":"IF(LEFT(S42,1)=\"A\",\"A\",IF(LEFT(S42,1)=\"B\",\"B\",S42))","v":""},{"$f":"IF(LEFT(T42,1)=\"A\",\"A\",IF(LEFT(T42,1)=\"B\",\"B\",T42))","v":""},{"$f":"IF(LEFT(U42,1)=\"A\",\"A\",IF(LEFT(U42,1)=\"B\",\"B\",U42))","v":""},{"$f":"IF(LEFT(V42,1)=\"A\",\"A\",IF(LEFT(V42,1)=\"B\",\"B\",V42))","v":116},{"$f":"IF(LEFT(X42,1)=\"A\",\"A\",IF(LEFT(X42,1)=\"B\",\"B\",X42))","v":""},{"$f":"IF(LEFT(AQ10,1)=\"A\",\"A\",IF(LEFT(AQ10,1)=\"B\",\"B\",AQ10))","v":""},{"$f":"IF(LEFT(AR10,1)=\"A\",\"A\",IF(LEFT(AR10,1)=\"B\",\"B\",AR10))","v":""},{"$f":"IF(LEFT(AS10,1)=\"A\",\"A\",IF(LEFT(AS10,1)=\"B\",\"B\",AS10))","v":""},{"$f":"IF(LEFT(AT10,1)=\"A\",\"A\",IF(LEFT(AT10,1)=\"B\",\"B\",AT10))","v":""},{"$f":"IF(LEFT(AV10,1)=\"A\",\"A\",IF(LEFT(AV10,1)=\"B\",\"B\",AV10))","v":""},{"$f":"IF(BM42>0,\"A\"&登録!$I$8,IF(BN42>0,\"B\"&登録!$I$8,BO42))","v":116},0,0,116,116,null,{"$f":"★個人成績表★!B41","v":"松居　勝巳"},{"$f":"VLOOKUP(BR42,$AZ$6:$BL$59,13,FALSE)","v":0}]
[6,"WRC",{"$f":"IF(B43=\"\",\"\",VLOOKUP(VALUE(A43&B37),登録!$AE$2:$AH$55,3,FALSE))","v":"山中　康介"},{"$f":"IF(B43=\"\",\"\",VLOOKUP(VALUE(A43&B37),登録!$AE$2:$AH$55,4,FALSE))","v":120},{"$f":"★個人成績表★!D54","v":"w"},{"$f":"★個人成績表★!F54","v":"w"},{"$f":"★個人成績表★!H54","v":"w"},{"$f":"★個人成績表★!E54","v":"w"},{"$f":"★個人成績表★!G54","v":"w"},null,5,0,600,{"$f":"M43*登録!$I$8/★対戦リーグ表★!D43","v":600},"",600,{"$f":"IF(D43=\"\",\"\",K43*100000+N43)","v":500600},{"$f":"IF(COUNTBLANK(E43:J43)=6,\"\",RANK(Q43,Q38:Q43))","v":1},{"$f":"IF(結果入力表!H20=\"\",\"\",結果入力表!H20)","v":""},{"$f":"IF(結果入力表!E48=\"\",\"\",結果入力表!E48)","v":105},{"$f":"IF(結果入力表!H97=\"\",\"\",結果入力表!H97)","v":""},{"$f":"IF(結果入力表!E34=\"\",\"\",結果入力表!E34)","v":""},{"$f":"IF(結果入力表!H69=\"\",\"\",結果入力表!H69)","v":""},null,63,"WRC",{"$f":"IF(Z43=\"\",\"\",VLOOKUP(Y43,登録!$AE$2:$AH$55,3,FALSE))","v":"杉本　博章"},{"$f":"IF(Z43=\"\",\"\",VLOOKUP(Y43,登録!$AE$2:$AH$55,4,FALSE))","v":120},{"$f":"★個人成績表★!I52","v":"w"},{"$f":"★個人成績表★!K52","v":"w"},{"$f":"★個人成績表★!M52","v":"w"},{"$f":"★個人成績表★!J52","v":80},{"$f":"★個人成績表★!L52","v":"w"},null,4,1,560,{"$f":"AK43*登録!$I$8/★対戦リーグ表★!AB43","v":560},"",560,{"$f":"IF(AB43=\"\",\"\",AI43*100000+AL43)","v":400560},{"$f":"IF(COUNTBLANK(AC43:AH43)=6,\"\",RANK(AO43,AO38:AO43))","v":1},{"$f":"IF(結果入力表!H125=\"\",\"\",結果入力表!H125)","v":""},{"$f":"IF(結果入力表!E153=\"\",\"\",結果入力表!E153)","v":""},{"$f":"IF(結果入力表!H202=\"\",\"\",結果入力表!H202)","v":""},{"$f":"IF(結果入力表!E139=\"\",\"\",結果入力表!E139)","v":""},{"$f":"IF(結果入力表!H174=\"\",\"\",結果入力表!H174)","v":""},null,null,13,null,"山中　康介","WRC",{"$f":"IF(LEFT(S43,1)=\"A\",\"A\",IF(LEFT(S43,1)=\"B\",\"B\",S43))","v":""},{"$f":"IF(LEFT(T43,1)=\"A\",\"A\",IF(LEFT(T43,1)=\"B\",\"B\",T43))","v":105},{"$f":"IF(LEFT(U43,1)=\"A\",\"A\",IF(LEFT(U43,1)=\"B\",\"B\",U43))","v":""},{"$f":"IF(LEFT(V43,1)=\"A\",\"A\",IF(LEFT(V43,1)=\"B\",\"B\",V43))","v":""},{"$f":"IF(LEFT(W43,1)=\"A\",\"A\",IF(LEFT(W43,1)=\"B\",\"B\",W43))","v":""},{"$f":"IF(LEFT(AQ59,1)=\"A\",\"A\",IF(LEFT(AQ59,1)=\"B\",\"B\",AQ59))","v":""},{"$f":"IF(LEFT(AR59,1)=\"A\",\"A\",IF(LEFT(AR59,1)=\"B\",\"B\",AR59))","v":""},{"$f":"IF(LEFT(AS59,1)=\"A\",\"A\",IF(LEFT(AS59,1)=\"B\",\"B\",AS59))","v":""},{"$f":"IF(LEFT(AT59,1)=\"A\",\"A\",IF(LEFT(AT59,1)=\"B\",\"B\",AT59))","v":""},{"$f":"IF(LEFT(AU59,1)=\"A\",\"A\",IF(LEFT(AU59,1)=\"B\",\"B\",AU59))","v":""},{"$f":"IF(BM43>0,\"A\"&登録!$I$8,IF(BN43>0,\"B\"&登録!$I$8,BO43))","v":105},0,0,105,105,null,{"$f":"★個人成績表★!B42","v":"藤明　宏樹"},0]
[null,null,null,null,null,null,null,null,null,null,null,null,null,null,null,null,null,null,null,null,null,null,null,null,null,null,null,null,null,null,null,null,null,null,null,null,null,null,null,null,null,null,null,null,null,null,null,null,null,null,null,null,null,null,null,null,null,null,null,null,null,null,null,{"$f":"IF(BM44>0,\"A\"&登録!$I$8,IF(BN44>0,\"B\"&登録!$I$8,BO44))","v":0},null,null,null,null,null,{"$f":"★個人成績表★!B43","v":"吉岡　保俊"},106]
[null,6,"Player","handy",{"$f":"B46","v":"KRC"},{"$f":"B47","v":"HRC"},{"$f":"B48","v":"SBC"},{"$f":"B49","v":"NRC"},{"$f":"B50","v":"ORC"},{"$f":"B51","v":"WRC"},"W","L","TP","(TP)","TP",null,"R_P","R",null,null,null,null,null,null,null,6,"Player","handy",{"$f":"$B$6","v":"KRC"},{"$f":"$B$7","v":"HRC"},{"$f":"$B$8","v":"SBC"},{"$f":"$B$9","v":"NRC"},{"$f":"$B$10","v":"ORC"},{"$f":"$B$11","v":"WRC"},"W","L","TP","(TP)","TP",null,"R_P","R",null,null,null,null,null,null,null,null,null,null,null,null,null,null,null,null,null,null,null,null,null,{"$f":"IF(BM45>0,\"A\"&登録!$I$8,IF(BN45>0,\"B\"&登録!$I$8,BO45))","v":0},null,null,null,null,null,{"$f":"★個人成績表★!B44","v":"村上　泰辰"},0]
[1,{"$f":"B38","v":"KRC"},{"$f":"VLOOKUP(VALUE(A46&B45),登録!$AE$2:$AH$55,3,FALSE)","v":"今村　哲也"},{"$f":"VLOOKUP(VALUE(A46&B45),登録!$AE$2:$AH$55,4,FALSE)","v":120},null,{"$f":"★個人成績表★!H10","v":"w"},{"$f":"★個人成績表★!G10","v":"w"},{"$f":"★個人成績表★!F10","v":4},{"$f":"★個人成績表★!E10","v":75},{"$f":"★個人成績表★!D10","v":20},{"$f":"IF(COUNTBLANK(E46:J46)=6,\"\",COUNTIF(E46:J46,\"w\"))","v":2},{"$f":"IF(COUNTBLANK(E46:J46)=6,\"\",6-COUNTBLANK(E46:J46)-K46)","v":3},{"$f":"K46*D46+SUM(E46:J46)","v":339},{"$f":"M46*登録!$I$8/★対戦リーグ表★!D46","v":339},{"$f":"IF(ISERROR(N46),\"\",IF(M46=N46,\"\",\"*\"))","v":""},{"$f":"IF(COUNTBLANK(E46:J46)=6,\"\",N46)","v":339},{"$f":"K46*100000+N46","v":200339},{"$f":"IF(COUNTBLANK(E46:J46)=6,\"\",RANK(Q46,Q46:Q51))","v":4},null,{"$f":"IF(結果入力表!E105=\"\",\"\",結果入力表!E105)","v":""},{"$f":"IF(結果入力表!E84=\"\",\"\",結果入力表!E84)","v":""},{"$f":"IF(結果入力表!E63=\"\",\"\",結果入力表!E63)","v":""},{"$f":"IF(結果入力表!E42=\"\",\"\",結果入力表!E42)","v":""},{"$f":"IF(結果入力表!E21=\"\",\"\",結果入力表!E21)","v":""},16,{"$f":"Z38","v":"KRC"},{"$f":"VLOOKUP(Y46,登録!$AE$2:$AH$55,3,FALSE)","v":"今村　哲也"},{"$f":"VLOOKUP(Y46,登録!$AE$2:$AH$55,4,FALSE)","v":120},null,{"$f":"★個人成績表★!M10","v":87},{"$f":"★個人成績表★!L10","v":"w"},{"$f":"★個人成績表★!K10","v":"w"},{"$f":"★個人成績表★!J10","v":44},{"$f":"★個人成績表★!I10","v":91},{"$f":"IF(COUNTBLANK(AC46:AH46)=6,\"\",COUNTIF(AC46:AH46,\"w\"))","v":2},{"$f":"IF(COUNTBLANK(AC46:AH46)=6,\"\",6-COUNTBLANK(AC46:AH46)-AI46)","v":3},{"$f":"AI46*AB46+SUM(AC46:AH46)","v":462},{"$f":"AK46*登録!$I$8/★対戦リーグ表★!AB46","v":462},{"$f":"IF(ISERROR(AL46),\"\",IF(AK46=AL46,\"\",\"*\"))","v":""},{"$f":"IF(COUNTBLANK(AC46:AH46)=6,\"\",AL46)","v":462},{"$f":"AI46*100000+AL46","v":200462},{"$f":"IF(COUNTBLANK(AC46:AH46)=6,\"\",RANK(AO46,AO46:AO51))","v":5},null,{"$f":"IF(結果入力表!E210=\"\",\"\",結果入力表!E210)","v":""},{"$f":"IF(結果入力表!E189=\"\",\"\",結果入力表!E189)","v":""},{"$f":"IF(結果入力表!E168=\"\",\"\",結果入力表!E168)","v":""},{"$f":"IF(結果入力表!E147=\"\",\"\",結果入力表!E147)","v":""},{"$f":"IF(結果入力表!E126=\"\",\"\",結果入力表!E126)","v":""},null,{"$f":"RANK(BP46,$BP$6:$BP$59)","v":16},null,{"$f":"C46","v":"今村　哲也"},{"$f":"B46","v":"KRC"},{"$f":"IF(LEFT(T46,1)=\"A\",\"A\",IF(LEFT(T46,1)=\"B\",\"B\",T46))","v":""},{"$f":"IF(LEFT(U46,1)=\"A\",\"A\",IF(LEFT(U46,1)=\"B\",\"B\",U46))","v":""},{"$f":"IF(LEFT(V46,1)=\"A\",\"A\",IF(LEFT(V46,1)=\"B\",\"B\",V46))","v":""},{"$f":"IF(LEFT(W46,1)=\"A\",\"A\",IF(LEFT(W46,1)=\"B\",\"B\",W46))","v":""},{"$f":"IF(LEFT(X46,1)=\"A\",\"A\",IF(LEFT(X46,1)=\"B\",\"B\",X46))","v":""},{"$f":"IF(LEFT(AR46,1)=\"A\",\"A\",IF(LEFT(AR46,1)=\"B\",\"B\",AR46))","v":""},{"$f":"IF(LEFT(AS46,1)=\"A\",\"A\",IF(LEFT(AS46,1)=\"B\",\"B\",AS46))","v":""},{"$f":"IF(LEFT(AT46,1)=\"A\",\"A\",IF(LEFT(AT46,1)=\"B\",\"B\",AT46))","v":""},{"$f":"IF(LEFT(AU46,1)=\"A\",\"A\",IF(LEFT(AU46,1)=\"B\",\"B\",AU46))","v":""},{"$f":"IF(LEFT(AV46,1)=\"A\",\"A\",IF(LEFT(AV46,1)=\"B\",\"B\",AV46))","v":""},{"$f":"IF(BM46>0,\"A\"&登録!$I$8,IF(BN46>0,\"B\"&登録!$I$8,BO46))","v":0},{"$f":"COUNTIF($BB46:$BK46,BM$5)","v":0},0,{"$f":"MAX(BB46:BK46)","v":0},{"$f":"BM46*10000+BN46*1000+BO46","v":0},null,{"$f":"★個人成績表★!B45","v":"小原　嘉丈"},116]
[2,"HRC",{"$f":"VLOOKUP(VALUE(A47&B45),登録!$AE$2:$AH$55,3,FALSE)","v":"白澤雄一郎"},{"$f":"VLOOKUP(VALUE(A47&B45),登録!$AE$2:$AH$55,4,FALSE)","v":120},{"$f":"★個人成績表★!H19","v":20},null,{"$f":"★個人成績表★!E19","v":13},{"$f":"★個人成績表★!G19","v":"w"},{"$f":"★個人成績表★!D19","v":18},{"$f":"★個人成績表★!F18","v":26},1,4,197,{"$f":"M47*登録!$I$8/★対戦リーグ表★!D47","v":197},"",197,{"$f":"K47*100000+N47","v":100197},{"$f":"IF(COUNTBLANK(E47:J47)=6,\"\",RANK(Q47,Q46:Q51))","v":6},{"$f":"IF(結果入力表!H105=\"\",\"\",結果入力表!H105)","v":""},null,{"$f":"IF(結果入力表!E28=\"\",\"\",結果入力表!E28)","v":""},{"$f":"IF(結果入力表!H77=\"\",\"\",結果入力表!H77)","v":107},{"$f":"IF(結果入力表!E14=\"\",\"\",結果入力表!E14)","v":""},{"$f":"IF(結果入力表!H49=\"\",\"\",結果入力表!H49)","v":""},27,"HRC",{"$f":"VLOOKUP(Y47,登録!$AE$2:$AH$55,3,FALSE)","v":"河地　恵里"},{"$f":"VLOOKUP(Y47,登録!$AE$2:$AH$55,4,FALSE)","v":100},{"$f":"★個人成績表★!M20","v":"w"},null,{"$f":"★個人成績表★!J20","v":30},{"$f":"★個人成績表★!L20","v":"w"},{"$f":"★個人成績表★!I20","v":22},{"$f":"★個人成績表★!K20","v":"w"},3,2,352,{"$f":"AK47*登録!$I$8/★対戦リーグ表★!AB47","v":422.4},"*",422.4,{"$f":"AI47*100000+AL47","v":300422.40000000002},{"$f":"IF(COUNTBLANK(AC47:AH47)=6,\"\",RANK(AO47,AO46:AO51))","v":3},{"$f":"IF(結果入力表!H210=\"\",\"\",結果入力表!H210)","v":""},null,{"$f":"IF(結果入力表!E133=\"\",\"\",結果入力表!E133)","v":""},{"$f":"IF(結果入力表!H182=\"\",\"\",結果入力表!H182)","v":""},{"$f":"IF(結果入力表!E119=\"\",\"\",結果入力表!E119)","v":""},{"$f":"IF(結果入力表!H154=\"\",\"\",結果入力表!H154)","v":""},null,8,null,"白澤雄一郎","HRC",{"$f":"IF(LEFT(S47,1)=\"A\",\"A\",IF(LEFT(S47,1)=\"B\",\"B\",S47))","v":""},{"$f":"IF(LEFT(U47,1)=\"A\",\"A\",IF(LEFT(U47,1)=\"B\",\"B\",U47))","v":""},{"$f":"IF(LEFT(V47,1)=\"A\",\"A\",IF(LEFT(V47,1)=\"B\",\"B\",V47))","v":107},{"$f":"IF(LEFT(W47,1)=\"A\",\"A\",IF(LEFT(W47,1)=\"B\",\"B\",W47))","v":""},{"$f":"IF(LEFT(X47,1)=\"A\",\"A\",IF(LEFT(X47,1)=\"B\",\"B\",X47))","v":""},{"$f":"IF(LEFT(AQ39,1)=\"A\",\"A\",IF(LEFT(AQ39,1)=\"B\",\"B\",AQ39))","v":""},{"$f":"IF(LEFT(AS39,1)=\"A\",\"A\",IF(LEFT(AS39,1)=\"B\",\"B\",AS39))","v":""},{"$f":"IF(LEFT(AT39,1)=\"A\",\"A\",IF(LEFT(AT39,1)=\"B\",\"B\",AT39))","v":""},{"$f":"IF(LEFT(AU39,1)=\"A\",\"A\",IF(LEFT(AU39,1)=\"B\",\"B\",AU39))","v":""},{"$f":"IF(LEFT(AV39,1)=\"A\",\"A\",IF(LEFT(AV39,1)=\"B\",\"B\",AV39))","v":""},{"$f":"IF(BM47>0,\"A\"&登録!$I$8,IF(BN47>0,\"B\"&登録!$I$8,BO47))","v":107},0,0,107,107,null,{"$f":"★個人成績表★!B46","v":"乾　伸綱"},0]
[3,"SBC",{"$f":"VLOOKUP(VALUE(A48&B45),登録!$AE$2:$AH$55,3,FALSE)","v":"秋田　倫央"},{"$f":"VLOOKUP(VALUE(A48&B45),登録!$AE$2:$AH$55,4,FALSE)","v":120},{"$f":"★個人成績表★!G28","v":24},{"$f":"★個人成績表★!E28","v":"w"},null,{"$f":"★個人成績表★!D28","v":98},{"$f":"★個人成績表★!F28","v":28},{"$f":"★個人成績表★!H28","v":"w"},2,3,390,{"$f":"M48*登録!$I$8/★対戦リーグ表★!D48","v":390},"",390,{"$f":"K48*100000+N48","v":200390},{"$f":"IF(COUNTBLANK(E48:J48)=6,\"\",RANK(Q48,Q46:Q51))","v":2},{"$f":"IF(結果入力表!H84=\"\",\"\",結果入力表!H84)","v":""},{"$f":"IF(結果入力表!H28=\"\",\"\",結果入力表!H28)","v":""},null,{"$f":"IF(結果入力表!E7=\"\",\"\",結果入力表!E7)","v":""},{"$f":"IF(結果入力表!H56=\"\",\"\",結果入力表!H56)","v":""},{"$f":"IF(結果入力表!E98=\"\",\"\",結果入力表!E98)","v":""},31,"SBC",{"$f":"VLOOKUP(Y48,登録!$AE$2:$AH$55,3,FALSE)","v":"林　秀忠"},{"$f":"VLOOKUP(Y48,登録!$AE$2:$AH$55,4,FALSE)","v":120},{"$f":"★個人成績表★!L23","v":85},{"$f":"★個人成績表★!J23","v":"w"},null,{"$f":"★個人成績表★!I23","v":"w"},{"$f":"★個人成績表★!K23","v":55},{"$f":"★個人成績表★!M23","v":"w"},3,2,500,{"$f":"AK48*登録!$I$8/★対戦リーグ表★!AB48","v":500},"",500,{"$f":"AI48*100000+AL48","v":300500},{"$f":"IF(COUNTBLANK(AC48:AH48)=6,\"\",RANK(AO48,AO46:AO51))","v":1},{"$f":"IF(結果入力表!H189=\"\",\"\",結果入力表!H189)","v":""},{"$f":"IF(結果入力表!H133=\"\",\"\",結果入力表!H133)","v":""},null,{"$f":"IF(結果入力表!E112=\"\",\"\",結果入力表!E112)","v":""},{"$f":"IF(結果入力表!H161=\"\",\"\",結果入力表!H161)","v":""},{"$f":"IF(結果入力表!E203=\"\",\"\",結果入力表!E203)","v":""},null,16,null,"秋田　倫央","SBC",{"$f":"IF(LEFT(S48,1)=\"A\",\"A\",IF(LEFT(S48,1)=\"B\",\"B\",S48))","v":""},{"$f":"IF(LEFT(T48,1)=\"A\",\"A\",IF(LEFT(T48,1)=\"B\",\"B\",T48))","v":""},{"$f":"IF(LEFT(V48,1)=\"A\",\"A\",IF(LEFT(V48,1)=\"B\",\"B\",V48))","v":""},{"$f":"IF(LEFT(W48,1)=\"A\",\"A\",IF(LEFT(W48,1)=\"B\",\"B\",W48))","v":""},{"$f":"IF(LEFT(X48,1)=\"A\",\"A\",IF(LEFT(X48,1)=\"B\",\"B\",X48))","v":""},{"$f":"IF(LEFT(AQ32,1)=\"A\",\"A\",IF(LEFT(AQ32,1)=\"B\",\"B\",AQ32))","v":""},{"$f":"IF(LEFT(AR32,1)=\"A\",\"A\",IF(LEFT(AR32,1)=\"B\",\"B\",AR32))","v":""},{"$f":"IF(LEFT(AT32,1)=\"A\",\"A\",IF(LEFT(AT32,1)=\"B\",\"B\",AT32))","v":""},{"$f":"IF(LEFT(AU32,1)=\"A\",\"A\",IF(LEFT(AU32,1)=\"B\",\"B\",AU32))","v":""},{"$f":"IF(LEFT(AV32,1)=\"A\",\"A\",IF(LEFT(AV32,1)=\"B\",\"B\",AV32))","v":""},{"$f":"IF(BM48>0,\"A\"&登録!$I$8,IF(BN48>0,\"B\"&登録!$I$8,BO48))","v":0},0,0,0,0,null,{"$f":"★個人成績表★!B47","v":"山崎真紀子"},0]
[4,"NRC",{"$f":"VLOOKUP(VALUE(A49&B45),登録!$AE$2:$AH$55,3,FALSE)","v":"長谷川　進"},{"$f":"VLOOKUP(VALUE(A49&B45),登録!$AE$2:$AH$55,4,FALSE)","v":120},{"$f":"★個人成績表★!F37","v":"w"},{"$f":"★個人成績表★!G37","v":21},{"$f":"★個人成績表★!D37","v":"w"},null,{"$f":"★個人成績表★!H37","v":23},{"$f":"★個人成績表★!E37","v":0},2,3,284,{"$f":"M49*登録!$I$8/★対戦リーグ表★!D49","v":284},"",284,{"$f":"K49*100000+N49","v":200284},{"$f":"IF(COUNTBLANK(E49:J49)=6,\"\",RANK(Q49,Q46:Q51))","v":5},{"$f":"IF(結果入力表!H63=\"\",\"\",結果入力表!H63)","v":""},{"$f":"IF(結果入力表!E77=\"\",\"\",結果入力表!E77)","v":""},{"$f":"IF(結果入力表!H7=\"\",\"\",結果入力表!H7)","v":""},null,{"$f":"IF(結果入力表!E91=\"\",\"\",結果入力表!E91)","v":""},{"$f":"IF(結果入力表!H35=\"\",\"\",結果入力表!H35)","v":""},42,"NRC",{"$f":"VLOOKUP(Y49,登録!$AE$2:$AH$55,3,FALSE)","v":"岩本　剛"},{"$f":"VLOOKUP(Y49,登録!$AE$2:$AH$55,4,FALSE)","v":120},{"$f":"★個人成績表★!K33","v":53},{"$f":"★個人成績表★!L33","v":79},{"$f":"★個人成績表★!I33","v":47},null,{"$f":"★個人成績表★!M33","v":"w"},{"$f":"★個人成績表★!J33","v":"w"},2,3,419,{"$f":"AK49*登録!$I$8/★対戦リーグ表★!AB49","v":419},"",419,{"$f":"AI49*100000+AL49","v":200419},{"$f":"IF(COUNTBLANK(AC49:AH49)=6,\"\",RANK(AO49,AO46:AO51))","v":6},{"$f":"IF(結果入力表!H168=\"\",\"\",結果入力表!H168)","v":""},{"$f":"IF(結果入力表!E182=\"\",\"\",結果入力表!E182)","v":""},{"$f":"IF(結果入力表!H112=\"\",\"\",結果入力表!H112)","v":""},null,{"$f":"IF(結果入力表!E196=\"\",\"\",結果入力表!E196)","v":""},{"$f":"IF(結果入力表!H140=\"\",\"\",結果入力表!H140)","v":""},null,16,null,"長谷川　進","NRC",{"$f":"IF(LEFT(S49,1)=\"A\",\"A\",IF(LEFT(S49,1)=\"B\",\"B\",S49))","v":""},{"$f":"IF(LEFT(T49,1)=\"A\",\"A\",IF(LEFT(T49,1)=\"B\",\"B\",T49))","v":""},{"$f":"IF(LEFT(U49,1)=\"A\",\"A\",IF(LEFT(U49,1)=\"B\",\"B\",U49))","v":""},{"$f":"IF(LEFT(W49,1)=\"A\",\"A\",IF(LEFT(W49,1)=\"B\",\"B\",W49))","v":""},{"$f":"IF(LEFT(X49,1)=\"A\",\"A\",IF(LEFT(X49,1)=\"B\",\"B\",X49))","v":""},{"$f":"IF(LEFT(AQ25,1)=\"A\",\"A\",IF(LEFT(AQ25,1)=\"B\",\"B\",AQ25))","v":""},{"$f":"IF(LEFT(AR25,1)=\"A\",\"A\",IF(LEFT(AR25,1)=\"B\",\"B\",AR25))","v":""},{"$f":"IF(LEFT(AS25,1)=\"A\",\"A\",IF(LEFT(AS25,1)=\"B\",\"B\",AS25))","v":""},{"$f":"IF(LEFT(AU25,1)=\"A\",\"A\",IF(LEFT(AU25,1)=\"B\",\"B\",AU25))","v":""},{"$f":"IF(LEFT(AV25,1)=\"A\",\"A\",IF(LEFT(AV25,1)=\"B\",\"B\",AV25))","v":""},{"$f":"IF(BM49>0,\"A\"&登録!$I$8,IF(BN49>0,\"B\"&登録!$I$8,BO49))","v":0},0,0,0,0]
[5,"ORC",{"$f":"VLOOKUP(VALUE(A50&B45),登録!$AE$2:$AH$55,3,FALSE)","v":"乾　伸綱"},{"$f":"VLOOKUP(VALUE(A50&B45),登録!$AE$2:$AH$55,4,FALSE)","v":120},{"$f":"★個人成績表★!E46","v":"w"},{"$f":"★個人成績表★!D46","v":"w"},{"$f":"★個人成績表★!F46","v":"w"},{"$f":"★個人成績表★!H46","v":"w"},null,{"$f":"★個人成績表★!G46","v":"w"},5,0,600,{"$f":"M50*登録!$I$8/★対戦リーグ表★!D50","v":600},"",600,{"$f":"K50*100000+N50","v":500600},{"$f":"IF(COUNTBLANK(E50:J50)=6,\"\",RANK(Q50,Q46:Q51))","v":1},{"$f":"IF(結果入力表!H42=\"\",\"\",結果入力表!H42)","v":""},{"$f":"IF(結果入力表!H14=\"\",\"\",結果入力表!H14)","v":""},{"$f":"IF(結果入力表!E56=\"\",\"\",結果入力表!E56)","v":""},{"$f":"IF(結果入力表!H91=\"\",\"\",結果入力表!H91)","v":""},null,{"$f":"IF(結果入力表!E70=\"\",\"\",結果入力表!E70)","v":""},53,"ORC",{"$f":"VLOOKUP(Y50,登録!$AE$2:$AH$55,3,FALSE)","v":"吉岡　保俊"},{"$f":"VLOOKUP(Y50,登録!$AE$2:$AH$55,4,FALSE)","v":120},{"$f":"★個人成績表★!J43","v":"w"},{"$f":"★個人成績表★!I43","v":"w"},{"$f":"★個人成績表★!K43","v":"w"},{"$f":"★個人成績表★!M43","v":18},null,{"$f":"★個人成績表★!L43","v":83},3,2,461,{"$f":"AK50*登録!$I$8/★対戦リーグ表★!AB50","v":461},"",461,{"$f":"AI50*100000+AL50","v":300461},{"$f":"IF(COUNTBLANK(AC50:AH50)=6,\"\",RANK(AO50,AO46:AO51))","v":2},{"$f":"IF(結果入力表!H147=\"\",\"\",結果入力表!H147)","v":""},{"$f":"IF(結果入力表!H119=\"\",\"\",結果入力表!H119)","v":""},{"$f":"IF(結果入力表!E161=\"\",\"\",結果入力表!E161)","v":""},{"$f":"IF(結果入力表!H196=\"\",\"\",結果入力表!H196)","v":""},null,{"$f":"IF(結果入力表!E175=\"\",\"\",結果入力表!E175)","v":""},null,16,null,"乾　伸綱","ORC",{"$f":"IF(LEFT(S50,1)=\"A\",\"A\",IF(LEFT(S50,1)=\"B\",\"B\",S50))","v":""},{"$f":"IF(LEFT(T50,1)=\"A\",\"A\",IF(LEFT(T50,1)=\"B\",\"B\",T50))","v":""},{"$f":"IF(LEFT(U50,1)=\"A\",\"A\",IF(LEFT(U50,1)=\"B\",\"B\",U50))","v":""},{"$f":"IF(LEFT(V50,1)=\"A\",\"A\",IF(LEFT(V50,1)=\"B\",\"B\",V50))","v":""},{"$f":"IF(LEFT(X50,1)=\"A\",\"A\",IF(LEFT(X50,1)=\"B\",\"B\",X50))","v":""},{"$f":"IF(LEFT(AQ18,1)=\"A\",\"A\",IF(LEFT(AQ18,1)=\"B\",\"B\",AQ18))","v":""},{"$f":"IF(LEFT(AR18,1)=\"A\",\"A\",IF(LEFT(AR18,1)=\"B\",\"B\",AR18))","v":""},{"$f":"IF(LEFT(AS18,1)=\"A\",\"A\",IF(LEFT(AS18,1)=\"B\",\"B\",AS18))","v":""},{"$f":"IF(LEFT(AT18,1)=\"A\",\"A\",IF(LEFT(AT18,1)=\"B\",\"B\",AT18))","v":""},{"$f":"IF(LEFT(AV18,1)=\"A\",\"A\",IF(LEFT(AV18,1)=\"B\",\"B\",AV18))","v":""},{"$f":"IF(BM50>0,\"A\"&登録!$I$8,IF(BN50>0,\"B\"&登録!$I$8,BO50))","v":0},0,0,0,0]
[6,"WRC",{"$f":"IF(B51=\"\",\"\",VLOOKUP(VALUE(A51&B45),登録!$AE$2:$AH$55,3,FALSE))","v":"芝先　泰生"},{"$f":"IF(B51=\"\",\"\",VLOOKUP(VALUE(A51&B45),登録!$AE$2:$AH$55,4,FALSE))","v":120},{"$f":"★個人成績表★!D55","v":"w"},{"$f":"★個人成績表★!F55","v":65},{"$f":"★個人成績表★!H55","v":29},{"$f":"★個人成績表★!E55","v":"w"},{"$f":"★個人成績表★!G55","v":48},null,2,3,382,{"$f":"M51*登録!$I$8/★対戦リーグ表★!D51","v":382},"",382,{"$f":"IF(D51=\"\",\"\",K51*100000+N51)","v":200382},{"$f":"IF(COUNTBLANK(E51:J51)=6,\"\",RANK(Q51,Q46:Q51))","v":3},{"$f":"IF(結果入力表!H21=\"\",\"\",結果入力表!H21)","v":110},{"$f":"IF(結果入力表!E49=\"\",\"\",結果入力表!E49)","v":""},{"$f":"IF(結果入力表!H98=\"\",\"\",結果入力表!H98)","v":""},{"$f":"IF(結果入力表!E35=\"\",\"\",結果入力表!E35)","v":"A120"},{"$f":"IF(結果入力表!H70=\"\",\"\",結果入力表!H70)","v":""},null,64,"WRC",{"$f":"IF(Z51=\"\",\"\",VLOOKUP(Y51,登録!$AE$2:$AH$55,3,FALSE))","v":"中本　雅大"},{"$f":"IF(Z51=\"\",\"\",VLOOKUP(Y51,登録!$AE$2:$AH$55,4,FALSE))","v":120},{"$f":"★個人成績表★!I53","v":"w"},{"$f":"★個人成績表★!K53","v":51},{"$f":"★個人成績表★!M53","v":105},{"$f":"★個人成績表★!J53","v":68},{"$f":"★個人成績表★!L53","v":"w"},null,2,3,464,{"$f":"AK51*登録!$I$8/★対戦リーグ表★!AB51","v":464},"",464,{"$f":"IF(AB51=\"\",\"\",AI51*100000+AL51)","v":200464},{"$f":"IF(COUNTBLANK(AC51:AH51)=6,\"\",RANK(AO51,AO46:AO51))","v":4},{"$f":"IF(結果入力表!H126=\"\",\"\",結果入力表!H126)","v":""},{"$f":"IF(結果入力表!E154=\"\",\"\",結果入力表!E154)","v":""},{"$f":"IF(結果入力表!H203=\"\",\"\",結果入力表!H203)","v":""},{"$f":"IF(結果入力表!E140=\"\",\"\",結果入力表!E140)","v":""},{"$f":"IF(結果入力表!H175=\"\",\"\",結果入力表!H175)","v":""},null,null,1,null,"芝先　泰生","WRC",{"$f":"IF(LEFT(S51,1)=\"A\",\"A\",IF(LEFT(S51,1)=\"B\",\"B\",S51))","v":110},{"$f":"IF(LEFT(T51,1)=\"A\",\"A\",IF(LEFT(T51,1)=\"B\",\"B\",T51))","v":""},{"$f":"IF(LEFT(U51,1)=\"A\",\"A\",IF(LEFT(U51,1)=\"B\",\"B\",U51))","v":""},{"$f":"IF(LEFT(V51,1)=\"A\",\"A\",IF(LEFT(V51,1)=\"B\",\"B\",V51))","v":"A"},{"$f":"IF(LEFT(W51,1)=\"A\",\"A\",IF(LEFT(W51,1)=\"B\",\"B\",W51))","v":""},{"$f":"IF(LEFT(AQ11,1)=\"A\",\"A\",IF(LEFT(AQ11,1)=\"B\",\"B\",AQ11))","v":""},{"$f":"IF(LEFT(AR11,1)=\"A\",\"A\",IF(LEFT(AR11,1)=\"B\",\"B\",AR11))","v":""},{"$f":"IF(LEFT(AS11,1)=\"A\",\"A\",IF(LEFT(AS11,1)=\"B\",\"B\",AS11))","v":""},{"$f":"IF(LEFT(AT11,1)=\"A\",\"A\",IF(LEFT(AT11,1)=\"B\",\"B\",AT11))","v":""},{"$f":"IF(LEFT(AU11,1)=\"A\",\"A\",IF(LEFT(AU11,1)=\"B\",\"B\",AU11))","v":""},{"$f":"IF(BM51>0,\"A\"&登録!$I$8,IF(BN51>0,\"B\"&登録!$I$8,BO51))","v":"A120"},1,0,110,10110,null,{"$f":"★個人成績表★!B50","v":"末岡　修"},{"$f":"VLOOKUP(BR51,$AZ$6:$BL$59,13,FALSE)","v":0}]
[null,null,null,null,null,null,null,null,null,null,null,null,null,null,null,null,null,null,null,null,null,null,null,null,null,null,null,null,null,null,null,null,null,null,null,null,null,null,null,null,null,null,null,null,null,null,null,null,null,null,null,null,null,null,null,null,null,null,null,null,null,null,null,{"$f":"IF(BM52>0,\"A\"&登録!$I$8,IF(BN52>0,\"B\"&登録!$I$8,BO52))","v":0},null,null,null,null,null,{"$f":"★個人成績表★!B51","v":"和田宗一郎"},0]
[null,7,"Player","handy",{"$f":"B54","v":"KRC"},{"$f":"B55","v":"HRC"},{"$f":"B56","v":"SBC"},{"$f":"B57","v":"NRC"},{"$f":"B58","v":"ORC"},{"$f":"B59","v":"WRC"},"W","L","TP","(TP)","TP",null,"R_P","R",null,null,null,null,null,null,null,7,"Player","handy",{"$f":"$B$6","v":"KRC"},{"$f":"$B$7","v":"HRC"},{"$f":"$B$8","v":"SBC"},{"$f":"$B$9","v":"NRC"},{"$f":"$B$10","v":"ORC"},{"$f":"$B$11","v":"WRC"},"W","L","TP","(TP)","TP",null,"R_P","R",null,null,null,null,null,null,null,null,null,null,null,null,null,null,null,null,null,null,null,null,null,{"$f":"IF(BM53>0,\"A\"&登録!$I$8,IF(BN53>0,\"B\"&登録!$I$8,BO53))","v":0},null,null,null,null,null,{"$f":"★個人成績表★!B52","v":"杉本　博章"},0]
[1,{"$f":"B46","v":"KRC"},{"$f":"VLOOKUP(VALUE(A54&B53),登録!$AE$2:$AH$55,3,FALSE)","v":"森田由佳里"},{"$f":"VLOOKUP(VALUE(A54&B53),登録!$AE$2:$AH$55,4,FALSE)","v":100},null,{"$f":"★個人成績表★!H11","v":"w"},{"$f":"★個人成績表★!G11","v":"w"},{"$f":"★個人成績表★!F11","v":36},{"$f":"★個人成績表★!E11","v":92},{"$f":"★個人成績表★!D11","v":2},{"$f":"IF(COUNTBLANK(E54:J54)=6,\"\",COUNTIF(E54:J54,\"w\"))","v":2},{"$f":"IF(COUNTBLANK(E54:J54)=6,\"\",6-COUNTBLANK(E54:J54)-K54)","v":3},{"$f":"K54*D54+SUM(E54:J54)","v":330},{"$f":"M54*登録!$I$8/★対戦リーグ表★!D54","v":396},{"$f":"IF(ISERROR(N54),\"\",IF(M54=N54,\"\",\"*\"))","v":"*"},{"$f":"IF(COUNTBLANK(E54:J54)=6,\"\",N54)","v":396},{"$f":"K54*100000+N54","v":200396},{"$f":"IF(COUNTBLANK(E54:J54)=6,\"\",RANK(Q54,Q54:Q59))","v":5},null,{"$f":"IF(結果入力表!E106=\"\",\"\",結果入力表!E106)","v":""},{"$f":"IF(結果入力表!E85=\"\",\"\",結果入力表!E85)","v":""},{"$f":"IF(結果入力表!E64=\"\",\"\",結果入力表!E64)","v":""},{"$f":"IF(結果入力表!E43=\"\",\"\",結果入力表!E43)","v":""},{"$f":"IF(結果入力表!E22=\"\",\"\",結果入力表!E22)","v":""},17,{"$f":"Z46","v":"KRC"},{"$f":"VLOOKUP(Y54,登録!$AE$2:$AH$55,3,FALSE)","v":"森田由佳里"},{"$f":"VLOOKUP(Y54,登録!$AE$2:$AH$55,4,FALSE)","v":100},null,{"$f":"★個人成績表★!M11","v":19},{"$f":"★個人成績表★!L11","v":"w"},{"$f":"★個人成績表★!K11","v":31},{"$f":"★個人成績表★!J11","v":35},{"$f":"★個人成績表★!I11","v":"w"},{"$f":"IF(COUNTBLANK(AC54:AH54)=6,\"\",COUNTIF(AC54:AH54,\"w\"))","v":2},{"$f":"IF(COUNTBLANK(AC54:AH54)=6,\"\",6-COUNTBLANK(AC54:AH54)-AI54)","v":3},{"$f":"AI54*AB54+SUM(AC54:AH54)","v":285},{"$f":"AK54*登録!$I$8/★対戦リーグ表★!AB54","v":342},{"$f":"IF(ISERROR(AL54),\"\",IF(AK54=AL54,\"\",\"*\"))","v":"*"},{"$f":"IF(COUNTBLANK(AC54:AH54)=6,\"\",AL54)","v":342},{"$f":"AI54*100000+AL54","v":200342},{"$f":"IF(COUNTBLANK(AC54:AH54)=6,\"\",RANK(AO54,AO54:AO59))","v":6},null,{"$f":"IF(結果入力表!E211=\"\",\"\",結果入力表!E211)","v":""},{"$f":"IF(結果入力表!E190=\"\",\"\",結果入力表!E190)","v":""},{"$f":"IF(結果入力表!E169=\"\",\"\",結果入力表!E169)","v":""},{"$f":"IF(結果入力表!E148=\"\",\"\",結果入力表!E148)","v":""},{"$f":"IF(結果入力表!E127=\"\",\"\",結果入力表!E127)","v":""},null,{"$f":"RANK(BP54,$BP$6:$BP$59)","v":16},null,{"$f":"C54","v":"森田由佳里"},{"$f":"B54","v":"KRC"},{"$f":"IF(LEFT(T54,1)=\"A\",\"A\",IF(LEFT(T54,1)=\"B\",\"B\",T54))","v":""},{"$f":"IF(LEFT(U54,1)=\"A\",\"A\",IF(LEFT(U54,1)=\"B\",\"B\",U54))","v":""},{"$f":"IF(LEFT(V54,1)=\"A\",\"A\",IF(LEFT(V54,1)=\"B\",\"B\",V54))","v":""},{"$f":"IF(LEFT(W54,1)=\"A\",\"A\",IF(LEFT(W54,1)=\"B\",\"B\",W54))","v":""},{"$f":"IF(LEFT(X54,1)=\"A\",\"A\",IF(LEFT(X54,1)=\"B\",\"B\",X54))","v":""},{"$f":"IF(LEFT(AR54,1)=\"A\",\"A\",IF(LEFT(AR54,1)=\"B\",\"B\",AR54))","v":""},{"$f":"IF(LEFT(AS54,1)=\"A\",\"A\",IF(LEFT(AS54,1)=\"B\",\"B\",AS54))","v":""},{"$f":"IF(LEFT(AT54,1)=\"A\",\"A\",IF(LEFT(AT54,1)=\"B\",\"B\",AT54))","v":""},{"$f":"IF(LEFT(AU54,1)=\"A\",\"A\",IF(LEFT(AU54,1)=\"B\",\"B\",AU54))","v":""},{"$f":"IF(LEFT(AV54,1)=\"A\",\"A\",IF(LEFT(AV54,1)=\"B\",\"B\",AV54))","v":""},{"$f":"IF(BM54>0,\"A\"&登録!$I$8,IF(BN54>0,\"B\"&登録!$I$8,BO54))","v":0},{"$f":"COUNTIF($BB54:$BK54,BM$5)","v":0},0,{"$f":"MAX(BB54:BK54)","v":0},{"$f":"BM54*10000+BN54*1000+BO54","v":0},null,{"$f":"★個人成績表★!B53","v":"中本　雅大"},0]
[2,"HRC",{"$f":"VLOOKUP(VALUE(A55&B53),登録!$AE$2:$AH$55,3,FALSE)","v":"河地　恵里"},{"$f":"VLOOKUP(VALUE(A55&B53),登録!$AE$2:$AH$55,4,FALSE)","v":100},{"$f":"★個人成績表★!H20","v":15},null,{"$f":"★個人成績表★!E20","v":"w"},{"$f":"★個人成績表★!G20","v":"w"},{"$f":"★個人成績表★!D20","v":26},{"$f":"★個人成績表★!F20","v":"w"},3,2,341,{"$f":"M55*登録!$I$8/★対戦リーグ表★!D55","v":409.2},"*",409.2,{"$f":"K55*100000+N55","v":300409.2},{"$f":"IF(COUNTBLANK(E55:J55)=6,\"\",RANK(Q55,Q54:Q59))","v":3},{"$f":"IF(結果入力表!H106=\"\",\"\",結果入力表!H106)","v":""},null,{"$f":"IF(結果入力表!E29=\"\",\"\",結果入力表!E29)","v":""},{"$f":"IF(結果入力表!H78=\"\",\"\",結果入力表!H78)","v":""},{"$f":"IF(結果入力表!E915=\"\",\"\",結果入力表!E15)","v":""},{"$f":"IF(結果入力表!H50=\"\",\"\",結果入力表!H50)","v":""},21,"HRC",{"$f":"VLOOKUP(Y55,登録!$AE$2:$AH$55,3,FALSE)","v":"鐵山　泰三"},{"$f":"VLOOKUP(Y55,登録!$AE$2:$AH$55,4,FALSE)","v":120},{"$f":"★個人成績表★!M14","v":"w"},null,{"$f":"★個人成績表★!J14","v":33},{"$f":"★個人成績表★!L14","v":"w"},{"$f":"★個人成績表★!I14","v":75},{"$f":"★個人成績表★!K14","v":114},2,3,462,{"$f":"AK55*登録!$I$8/★対戦リーグ表★!AB55","v":462},"",462,{"$f":"AI55*100000+AL55","v":200462},{"$f":"IF(COUNTBLANK(AC55:AH55)=6,\"\",RANK(AO55,AO54:AO59))","v":4},{"$f":"IF(結果入力表!H211=\"\",\"\",結果入力表!H211)","v":128},null,{"$f":"IF(結果入力表!E134=\"\",\"\",結果入力表!E134)","v":""},{"$f":"IF(結果入力表!H183=\"\",\"\",結果入力表!H183)","v":""},{"$f":"IF(結果入力表!E120=\"\",\"\",結果入力表!E120)","v":""},{"$f":"IF(結果入力表!H155=\"\",\"\",結果入力表!H155)","v":""},null,16,null,"河地　恵里","HRC",{"$f":"IF(LEFT(S55,1)=\"A\",\"A\",IF(LEFT(S55,1)=\"B\",\"B\",S55))","v":""},{"$f":"IF(LEFT(U55,1)=\"A\",\"A\",IF(LEFT(U55,1)=\"B\",\"B\",U55))","v":""},{"$f":"IF(LEFT(V55,1)=\"A\",\"A\",IF(LEFT(V55,1)=\"B\",\"B\",V55))","v":""},{"$f":"IF(LEFT(W55,1)=\"A\",\"A\",IF(LEFT(W55,1)=\"B\",\"B\",W55))","v":""},{"$f":"IF(LEFT(X55,1)=\"A\",\"A\",IF(LEFT(X55,1)=\"B\",\"B\",X55))","v":""},{"$f":"IF(LEFT(AQ47,1)=\"A\",\"A\",IF(LEFT(AQ47,1)=\"B\",\"B\",AQ47))","v":""},{"$f":"IF(LEFT(AS47,1)=\"A\",\"A\",IF(LEFT(AS47,1)=\"B\",\"B\",AS47))","v":""},{"$f":"IF(LEFT(AT47,1)=\"A\",\"A\",IF(LEFT(AT47,1)=\"B\",\"B\",AT47))","v":""},{"$f":"IF(LEFT(AU47,1)=\"A\",\"A\",IF(LEFT(AU47,1)=\"B\",\"B\",AU47))","v":""},{"$f":"IF(LEFT(AV47,1)=\"A\",\"A\",IF(LEFT(AV47,1)=\"B\",\"B\",AV47))","v":""},{"$f":"IF(BM55>0,\"A\"&登録!$I$8,IF(BN55>0,\"B\"&登録!$I$8,BO55))","v":0},0,0,0,0,null,{"$f":"★個人成績表★!B54","v":"山中　康介"},105]
[3,"SBC",{"$f":"VLOOKUP(VALUE(A56&B53),登録!$AE$2:$AH$55,3,FALSE)","v":"大橋　洋子"},{"$f":"VLOOKUP(VALUE(A56&B53),登録!$AE$2:$AH$55,4,FALSE)","v":100},{"$f":"★個人成績表★!G29","v":1},{"$f":"★個人成績表★!E29","v":6},null,{"$f":"★個人成績表★!D29","v":64},{"$f":"★個人成績表★!F29","v":"w"},{"$f":"★個人成績表★!H29","v":27},1,4,198,{"$f":"M56*登録!$I$8/★対戦リーグ表★!D56","v":237.6},"*",237.6,{"$f":"K56*100000+N56","v":100237.6},{"$f":"IF(COUNTBLANK(E56:J56)=6,\"\",RANK(Q56,Q54:Q59))","v":6},{"$f":"IF(結果入力表!H85=\"\",\"\",結果入力表!H85)","v":""},{"$f":"IF(結果入力表!H29=\"\",\"\",結果入力表!H29)","v":""},null,{"$f":"IF(結果入力表!E8=\"\",\"\",結果入力表!E8)","v":""},{"$f":"IF(結果入力表!H57=\"\",\"\",結果入力表!H57)","v":""},{"$f":"IF(結果入力表!E99=\"\",\"\",結果入力表!E99)","v":""},32,"SBC",{"$f":"VLOOKUP(Y56,登録!$AE$2:$AH$55,3,FALSE)","v":"大橋　義治"},{"$f":"VLOOKUP(Y56,登録!$AE$2:$AH$55,4,FALSE)","v":120},{"$f":"★個人成績表★!L24","v":84},{"$f":"★個人成績表★!J24","v":"w"},null,{"$f":"★個人成績表★!I24","v":101},{"$f":"★個人成績表★!K24","v":82},{"$f":"★個人成績表★!M24","v":"w"},2,3,507,{"$f":"AK56*登録!$I$8/★対戦リーグ表★!AB56","v":507},"",507,{"$f":"AI56*100000+AL56","v":200507},{"$f":"IF(COUNTBLANK(AC56:AH56)=6,\"\",RANK(AO56,AO54:AO59))","v":3},{"$f":"IF(結果入力表!H190=\"\",\"\",結果入力表!H190)","v":""},{"$f":"IF(結果入力表!H134=\"\",\"\",結果入力表!H134)","v":""},null,{"$f":"IF(結果入力表!E113=\"\",\"\",結果入力表!E113)","v":""},{"$f":"IF(結果入力表!H162=\"\",\"\",結果入力表!H162)","v":""},{"$f":"IF(結果入力表!E204=\"\",\"\",結果入力表!E204)","v":""},null,16,null,"大橋　洋子","SBC",{"$f":"IF(LEFT(S56,1)=\"A\",\"A\",IF(LEFT(S56,1)=\"B\",\"B\",S56))","v":""},{"$f":"IF(LEFT(T56,1)=\"A\",\"A\",IF(LEFT(T56,1)=\"B\",\"B\",T56))","v":""},{"$f":"IF(LEFT(V56,1)=\"A\",\"A\",IF(LEFT(V56,1)=\"B\",\"B\",V56))","v":""},{"$f":"IF(LEFT(W56,1)=\"A\",\"A\",IF(LEFT(W56,1)=\"B\",\"B\",W56))","v":""},{"$f":"IF(LEFT(X56,1)=\"A\",\"A\",IF(LEFT(X56,1)=\"B\",\"B\",X56))","v":""},{"$f":"IF(LEFT(AQ40,1)=\"A\",\"A\",IF(LEFT(AQ40,1)=\"B\",\"B\",AQ40))","v":""},{"$f":"IF(LEFT(AR40,1)=\"A\",\"A\",IF(LEFT(AR40,1)=\"B\",\"B\",AR40))","v":""},{"$f":"IF(LEFT(AT40,1)=\"A\",\"A\",IF(LEFT(AT40,1)=\"B\",\"B\",AT40))","v":""},{"$f":"IF(LEFT(AU40,1)=\"A\",\"A\",IF(LEFT(AU40,1)=\"B\",\"B\",AU40))","v":""},{"$f":"IF(LEFT(AV40,1)=\"A\",\"A\",IF(LEFT(AV40,1)=\"B\",\"B\",AV40))","v":""},{"$f":"IF(BM56>0,\"A\"&登録!$I$8,IF(BN56>0,\"B\"&登録!$I$8,BO56))","v":0},0,0,0,0,null,{"$f":"★個人成績表★!B55","v":"芝先　泰生"},"A120"]
[4,"NRC",{"$f":"VLOOKUP(VALUE(A57&B53),登録!$AE$2:$AH$55,3,FALSE)","v":"白戸　恭子"},{"$f":"VLOOKUP(VALUE(A57&B53),登録!$AE$2:$AH$55,4,FALSE)","v":100},{"$f":"★個人成績表★!F38","v":"w"},{"$f":"★個人成績表★!G38","v":41},{"$f":"★個人成績表★!D38","v":"w"},null,{"$f":"★個人成績表★!H38","v":"w"},{"$f":"★個人成績表★!E38","v":39},3,2,380,{"$f":"M57*登録!$I$8/★対戦リーグ表★!D57","v":456},"*",456,{"$f":"K57*100000+N57","v":300456},{"$f":"IF(COUNTBLANK(E57:J57)=6,\"\",RANK(Q57,Q54:Q59))","v":2},{"$f":"IF(結果入力表!H64=\"\",\"\",結果入力表!H64)","v":""},{"$f":"IF(結果入力表!E78=\"\",\"\",結果入力表!E78)","v":""},{"$f":"IF(結果入力表!H8=\"\",\"\",結果入力表!H8)","v":""},null,{"$f":"IF(結果入力表!E92=\"\",\"\",結果入力表!E92)","v":""},{"$f":"IF(結果入力表!H36=\"\",\"\",結果入力表!H36)","v":""},43,"NRC",{"$f":"VLOOKUP(Y57,登録!$AE$2:$AH$55,3,FALSE)","v":"白戸　玲人"},{"$f":"VLOOKUP(Y57,登録!$AE$2:$AH$55,4,FALSE)","v":120},{"$f":"★個人成績表★!K34","v":"w"},{"$f":"★個人成績表★!L34","v":0},{"$f":"★個人成績表★!I34","v":"w"},null,{"$f":"★個人成績表★!M34","v":"w"},{"$f":"★個人成績表★!J34","v":"w"},4,1,480,{"$f":"AK57*登録!$I$8/★対戦リーグ表★!AB57","v":480},"",480,{"$f":"AI57*100000+AL57","v":400480},{"$f":"IF(COUNTBLANK(AC57:AH57)=6,\"\",RANK(AO57,AO54:AO59))","v":1},{"$f":"IF(結果入力表!H169=\"\",\"\",結果入力表!H169)","v":""},{"$f":"IF(結果入力表!E183=\"\",\"\",結果入力表!E183)","v":""},{"$f":"IF(結果入力表!H113=\"\",\"\",結果入力表!H113)","v":""},null,{"$f":"IF(結果入力表!E197=\"\",\"\",結果入力表!E197)","v":""},{"$f":"IF(結果入力表!H141=\"\",\"\",結果入力表!H141)","v":107},null,2,null,"白戸　恭子","NRC",{"$f":"IF(LEFT(S57,1)=\"A\",\"A\",IF(LEFT(S57,1)=\"B\",\"B\",S57))","v":""},{"$f":"IF(LEFT(T57,1)=\"A\",\"A\",IF(LEFT(T57,1)=\"B\",\"B\",T57))","v":""},{"$f":"IF(LEFT(U57,1)=\"A\",\"A\",IF(LEFT(U57,1)=\"B\",\"B\",U57))","v":""},{"$f":"IF(LEFT(W57,1)=\"A\",\"A\",IF(LEFT(W57,1)=\"B\",\"B\",W57))","v":""},{"$f":"IF(LEFT(X57,1)=\"A\",\"A\",IF(LEFT(X57,1)=\"B\",\"B\",X57))","v":""},{"$f":"IF(LEFT(AQ33,1)=\"A\",\"A\",IF(LEFT(AQ33,1)=\"B\",\"B\",AQ33))","v":""},{"$f":"IF(LEFT(AR33,1)=\"A\",\"A\",IF(LEFT(AR33,1)=\"B\",\"B\",AR33))","v":""},{"$f":"IF(LEFT(AS33,1)=\"A\",\"A\",IF(LEFT(AS33,1)=\"B\",\"B\",AS33))","v":""},{"$f":"IF(LEFT(AU33,1)=\"A\",\"A\",IF(LEFT(AU33,1)=\"B\",\"B\",AU33))","v":""},{"$f":"IF(LEFT(AV33,1)=\"A\",\"A\",IF(LEFT(AV33,1)=\"B\",\"B\",AV33))","v":"A"},{"$f":"IF(BM57>0,\"A\"&登録!$I$8,IF(BN57>0,\"B\"&登録!$I$8,BO57))","v":"A120"},1,0,0,10000,null,{"$f":"★個人成績表★!B56","v":"松房ゆかり"},0]
[5,"ORC",{"$f":"VLOOKUP(VALUE(A58&B53),登録!$AE$2:$AH$55,3,FALSE)","v":"山崎真紀子"},{"$f":"VLOOKUP(VALUE(A58&B53),登録!$AE$2:$AH$55,4,FALSE)","v":100},{"$f":"★個人成績表★!E47","v":"w"},{"$f":"★個人成績表★!D47","v":"w"},{"$f":"★個人成績表★!F47","v":27},{"$f":"★個人成績表★!H47","v":88},null,{"$f":"★個人成績表★!G47","v":91},2,3,406,{"$f":"M58*登録!$I$8/★対戦リーグ表★!D58","v":487.2},"*",487.2,{"$f":"K58*100000+N58","v":200487.2},{"$f":"IF(COUNTBLANK(E58:J58)=6,\"\",RANK(Q58,Q54:Q59))","v":4},{"$f":"IF(結果入力表!H43=\"\",\"\",結果入力表!H43)","v":""},{"$f":"IF(結果入力表!H15=\"\",\"\",結果入力表!H15)","v":""},{"$f":"IF(結果入力表!E57=\"\",\"\",結果入力表!E57)","v":""},{"$f":"IF(結果入力表!H92=\"\",\"\",結果入力表!H92)","v":""},null,{"$f":"IF(結果入力表!E71=\"\",\"\",結果入力表!E71)","v":""},54,"ORC",{"$f":"VLOOKUP(Y58,登録!$AE$2:$AH$55,3,FALSE)","v":"村上　泰辰"},{"$f":"VLOOKUP(Y58,登録!$AE$2:$AH$55,4,FALSE)","v":120},{"$f":"★個人成績表★!J44","v":"w"},{"$f":"★個人成績表★!I44","v":"w"},{"$f":"★個人成績表★!K44","v":"w"},{"$f":"★個人成績表★!M44","v":11},null,{"$f":"★個人成績表★!L44","v":38},3,2,409,{"$f":"AK58*登録!$I$8/★対戦リーグ表★!AB58","v":409},"",409,{"$f":"AI58*100000+AL58","v":300409},{"$f":"IF(COUNTBLANK(AC58:AH58)=6,\"\",RANK(AO58,AO54:AO59))","v":2},{"$f":"IF(結果入力表!H148=\"\",\"\",結果入力表!H148)","v":""},{"$f":"IF(結果入力表!H120=\"\",\"\",結果入力表!H120)","v":""},{"$f":"IF(結果入力表!E162=\"\",\"\",結果入力表!E162)","v":""},{"$f":"IF(結果入力表!H197=\"\",\"\",結果入力表!H197)","v":""},null,{"$f":"IF(結果入力表!E176=\"\",\"\",結果入力表!E176)","v":""},null,16,null,"山崎真紀子","ORC",{"$f":"IF(LEFT(S58,1)=\"A\",\"A\",IF(LEFT(S58,1)=\"B\",\"B\",S58))","v":""},{"$f":"IF(LEFT(T58,1)=\"A\",\"A\",IF(LEFT(T58,1)=\"B\",\"B\",T58))","v":""},{"$f":"IF(LEFT(U58,1)=\"A\",\"A\",IF(LEFT(U58,1)=\"B\",\"B\",U58))","v":""},{"$f":"IF(LEFT(V58,1)=\"A\",\"A\",IF(LEFT(V58,1)=\"B\",\"B\",V58))","v":""},{"$f":"IF(LEFT(X58,1)=\"A\",\"A\",IF(LEFT(X58,1)=\"B\",\"B\",X58))","v":""},{"$f":"IF(LEFT(AQ26,1)=\"A\",\"A\",IF(LEFT(AQ26,1)=\"B\",\"B\",AQ26))","v":""},{"$f":"IF(LEFT(AR26,1)=\"A\",\"A\",IF(LEFT(AR26,1)=\"B\",\"B\",AR26))","v":""},{"$f":"IF(LEFT(AS26,1)=\"A\",\"A\",IF(LEFT(AS26,1)=\"B\",\"B\",AS26))","v":""},{"$f":"IF(LEFT(AT26,1)=\"A\",\"A\",IF(LEFT(AT26,1)=\"B\",\"B\",AT26))","v":""},{"$f":"IF(LEFT(AV26,1)=\"A\",\"A\",IF(LEFT(AV26,1)=\"B\",\"B\",AV26))","v":""},{"$f":"IF(BM58>0,\"A\"&登録!$I$8,IF(BN58>0,\"B\"&登録!$I$8,BO58))","v":0},0,0,0,0]
[6,"WRC",{"$f":"IF(B59=\"\",\"\",VLOOKUP(VALUE(A59&B53),登録!$AE$2:$AH$55,3,FALSE))","v":"松房ゆかり"},{"$f":"IF(B59=\"\",\"\",VLOOKUP(VALUE(A59&B53),登録!$AE$2:$AH$55,4,FALSE))","v":100},{"$f":"★個人成績表★!D56","v":"w"},{"$f":"★個人成績表★!F56","v":46},{"$f":"★個人成績表★!H56","v":"w"},{"$f":"★個人成績表★!E56","v":"w"},{"$f":"★個人成績表★!G56","v":"w"},null,4,1,446,{"$f":"M59*登録!$I$8/★対戦リーグ表★!D59","v":535.20000000000005},"*",535.20000000000005,{"$f":"IF(D59=\"\",\"\",K59*100000+N59)","v":400535.2},{"$f":"IF(COUNTBLANK(E59:J59)=6,\"\",RANK(Q59,Q54:Q59))","v":1},{"$f":"IF(結果入力表!H22=\"\",\"\",結果入力表!H22)","v":""},{"$f":"IF(結果入力表!E50=\"\",\"\",結果入力表!E50)","v":""},{"$f":"IF(結果入力表!H99=\"\",\"\",結果入力表!H99)","v":""},{"$f":"IF(結果入力表!E36=\"\",\"\",結果入力表!E36)","v":""},{"$f":"IF(結果入力表!H71=\"\",\"\",結果入力表!H71)","v":""},null,65,"WRC",{"$f":"IF(Z59=\"\",\"\",VLOOKUP(Y59,登録!$AE$2:$AH$55,3,FALSE))","v":"山中　康介"},{"$f":"IF(Z59=\"\",\"\",VLOOKUP(Y59,登録!$AE$2:$AH$55,4,FALSE))","v":120},{"$f":"★個人成績表★!I54","v":81},{"$f":"★個人成績表★!K54","v":"w"},{"$f":"★個人成績表★!M54","v":53},{"$f":"★個人成績表★!J54","v":0},{"$f":"★個人成績表★!L54","v":"w"},null,2,3,374,{"$f":"AK59*登録!$I$8/★対戦リーグ表★!AB59","v":374},"",374,{"$f":"IF(AB59=\"\",\"\",AI59*100000+AL59)","v":200374},{"$f":"IF(COUNTBLANK(AC59:AH59)=6,\"\",RANK(AO59,AO54:AO59))","v":5},{"$f":"IF(結果入力表!H127=\"\",\"\",結果入力表!H127)","v":""},{"$f":"IF(結果入力表!E155=\"\",\"\",結果入力表!E155)","v":""},{"$f":"IF(結果入力表!H204=\"\",\"\",結果入力表!H204)","v":""},{"$f":"IF(結果入力表!E141=\"\",\"\",結果入力表!E141)","v":""},{"$f":"IF(結果入力表!H176=\"\",\"\",結果入力表!H176)","v":""},null,null,16,null,"松房ゆかり","WRC",{"$f":"IF(LEFT(S59,1)=\"A\",\"A\",IF(LEFT(S59,1)=\"B\",\"B\",S59))","v":""},{"$f":"IF(LEFT(T59,1)=\"A\",\"A\",IF(LEFT(T59,1)=\"B\",\"B\",T59))","v":""},{"$f":"IF(LEFT(U59,1)=\"A\",\"A\",IF(LEFT(U59,1)=\"B\",\"B\",U59))","v":""},{"$f":"IF(LEFT(V59,1)=\"A\",\"A\",IF(LEFT(V59,1)=\"B\",\"B\",V59))","v":""},{"$f":"IF(LEFT(W59,1)=\"A\",\"A\",IF(LEFT(W59,1)=\"B\",\"B\",W59))","v":""},{"$f":"IF(LEFT(AQ19,1)=\"A\",\"A\",IF(LEFT(AQ19,1)=\"B\",\"B\",AQ19))","v":""},{"$f":"IF(LEFT(AR19,1)=\"A\",\"A\",IF(LEFT(AR19,1)=\"B\",\"B\",AR19))","v":""},{"$f":"IF(LEFT(AS19,1)=\"A\",\"A\",IF(LEFT(AS19,1)=\"B\",\"B\",AS19))","v":""},{"$f":"IF(LEFT(AT19,1)=\"A\",\"A\",IF(LEFT(AT19,1)=\"B\",\"B\",AT19))","v":""},{"$f":"IF(LEFT(AU19,1)=\"A\",\"A\",IF(LEFT(AU19,1)=\"B\",\"B\",AU19))","v":""},{"$f":"IF(BM59>0,\"A\"&登録!$I$8,IF(BN59>0,\"B\"&登録!$I$8,BO59))","v":0},0,0,0,0]

{"sheet":"結果入力表","index":4,"n_rows":211,"n_cols":12,"rows_kept":211,"cut":false,"hidden":false,"merged":[]}
["節","G-No","所属A","選手名A","HR","得点","得点","HR","選手名B","所属B"]
["第1節",{"$f":"登録!AN2","v":1},{"$f":"登録!AQ2","v":"SBC"},{"$f":"登録!AR2","v":"林　秀忠"},null,"w",55,null,{"$f":"登録!AS2","v":"吉向　翔平"},{"$f":"登録!AT2","v":"NRC"},null,"s"]
[null,{"$f":"登録!AN3","v":2},{"$f":"登録!AQ3","v":"SBC"},{"$f":"登録!AR3","v":"大橋　義治"},null,"w",112,null,{"$f":"登録!AS3","v":"岩本　剛"},{"$f":"登録!AT3","v":"NRC"},null,"s"]
[null,{"$f":"登録!AN4","v":3},{"$f":"登録!AQ4","v":"SBC"},{"$f":"登録!AR4","v":"山中　康寛"},null,0,"w",null,{"$f":"登録!AS4","v":"白戸　玲人"},{"$f":"登録!AT4","v":"NRC"},null,"s"]
[null,{"$f":"登録!AN5","v":4},{"$f":"登録!AQ5","v":"SBC"},{"$f":"登録!AR5","v":"西峰　久祐"},null,"w",72,null,{"$f":"登録!AS5","v":"植田　慎也"},{"$f":"登録!AT5","v":"NRC"},null,"s"]
[null,{"$f":"登録!AN6","v":5},{"$f":"登録!AQ6","v":"SBC"},{"$f":"登録!AR6","v":"大橋　正寛"},null,"w",19,null,{"$f":"登録!AS6","v":"近藤　拓馬"},{"$f":"登録!AT6","v":"NRC"},null,"s"]
[null,{"$f":"登録!AN7","v":6},{"$f":"登録!AQ7","v":"SBC"},{"$f":"登録!AR7","v":"秋田　倫央"},null,98,"w",null,{"$f":"登録!AS7","v":"長谷川　進"},{"$f":"登録!AT7","v":"NRC"},null,"s"]
[null,{"$f":"登録!AN8","v":7},{"$f":"登録!AQ8","v":"SBC"},{"$f":"登録!AR8","v":"大橋　洋子"},null,64,"w",null,{"$f":"登録!AS8","v":"白戸　恭子"},{"$f":"登録!AT8","v":"NRC"},null,"s"]
[null,{"$f":"登録!AN9","v":8},{"$f":"登録!AQ9","v":"HRC"},{"$f":"登録!AR9","v":"鐵山　泰三"},null,"w",104,null,{"$f":"登録!AS9","v":"松居　勝巳"},{"$f":"登録!AT9","v":"ORC"},null,"s"]
[null,{"$f":"登録!AN10","v":9},{"$f":"登録!AQ10","v":"HRC"},{"$f":"登録!AR10","v":"堂園　雅也"},null,"w",86,null,{"$f":"登録!AS10","v":"藤明　宏樹"},{"$f":"登録!AT10","v":"ORC"},null,"s"]
[null,{"$f":"登録!AN11","v":10},{"$f":"登録!AQ11","v":"HRC"},{"$f":"登録!AR11","v":"宮本　一"},null,"w",106,106,{"$f":"登録!AS11","v":"吉岡　保俊"},{"$f":"登録!AT11","v":"ORC"},null,"s"]
[null,{"$f":"登録!AN12","v":11},{"$f":"登録!AQ12","v":"HRC"},{"$f":"登録!AR12","v":"伊藤　登"},null,88,"w",null,{"$f":"登録!AS12","v":"村上　泰辰"},{"$f":"登録!AT12","v":"ORC"},null,"s"]
[null,{"$f":"登録!AN13","v":12},{"$f":"登録!AQ13","v":"HRC"},{"$f":"登録!AR13","v":"宮井健太郎"},null,7,"w",null,{"$f":"登録!AS13","v":"小原　嘉丈"},{"$f":"登録!AT13","v":"ORC"},null,"s"]
[null,{"$f":"登録!AN14","v":13},{"$f":"登録!AQ14","v":"HRC"},{"$f":"登録!AR14","v":"白澤雄一郎"},null,18,"w",null,{"$f":"登録!AS14","v":"乾　伸綱"},{"$f":"登録!AT14","v":"ORC"},null,"s"]
[null,{"$f":"登録!AN15","v":14},{"$f":"登録!AQ15","v":"HRC"},{"$f":"登録!AR15","v":"河地　恵里"},null,26,"w",null,{"$f":"登録!AS15","v":"山崎真紀子"},{"$f":"登録!AT15","v":"ORC"},null,"s"]
[null,{"$f":"登録!AN16","v":15},{"$f":"登録!AQ16","v":"KRC"},{"$f":"登録!AR16","v":"松好　太一"},null,"w",48,null,{"$f":"登録!AS16","v":"末岡　修"},{"$f":"登録!AT16","v":"WRC"},null,"s"]
[null,{"$f":"登録!AN17","v":16},{"$f":"登録!AQ17","v":"KRC"},{"$f":"登録!AR17","v":"清水　義晴"},null,"w",33,null,{"$f":"登録!AS17","v":"和田宗一郎"},{"$f":"登録!AT17","v":"WRC"},null,"s"]
[null,{"$f":"登録!AN18","v":17},{"$f":"登録!AQ18","v":"KRC"},{"$f":"登録!AR18","v":"鈴木　康文"},null,"w",38,null,{"$f":"登録!AS18","v":"杉本　博章"},{"$f":"登録!AT18","v":"WRC"},null,"s"]
[null,{"$f":"登録!AN19","v":18},{"$f":"登録!AQ19","v":"KRC"},{"$f":"登録!AR19","v":"早川　徹"},null,"w",64,null,{"$f":"登録!AS19","v":"中本　雅大"},{"$f":"登録!AT19","v":"WRC"},null,"s"]
[null,{"$f":"登録!AN20","v":19},{"$f":"登録!AQ20","v":"KRC"},{"$f":"登録!AR20","v":"井関　一成"},null,96,"w",null,{"$f":"登録!AS20","v":"山中　康介"},{"$f":"登録!AT20","v":"WRC"},null,"s"]
[null,{"$f":"登録!AN21","v":20},{"$f":"登録!AQ21","v":"KRC"},{"$f":"登録!AR21","v":"今村　哲也"},null,20,"w",110,{"$f":"登録!AS21","v":"芝先　泰生"},{"$f":"登録!AT21","v":"WRC"},null,"s"]
[null,{"$f":"登録!AN22","v":21},{"$f":"登録!AQ22","v":"KRC"},{"$f":"登録!AR22","v":"森田由佳里"},null,2,"w",null,{"$f":"登録!AS22","v":"松房ゆかり"},{"$f":"登録!AT22","v":"WRC"},null,"s"]
[null,{"$f":"登録!AN23","v":22},{"$f":"登録!AQ23","v":"HRC"},{"$f":"登録!AR23","v":"鐵山　泰三"},null,"w",31,null,{"$f":"登録!AS23","v":"林　秀忠"},{"$f":"登録!AT23","v":"SBC"},null,"s"]
[null,{"$f":"登録!AN24","v":23},{"$f":"登録!AQ24","v":"HRC"},{"$f":"登録!AR24","v":"堂園　雅也"},null,"w",61,null,{"$f":"登録!AS24","v":"大橋　義治"},{"$f":"登録!AT24","v":"SBC"},null,"s"]
[null,{"$f":"登録!AN25","v":24},{"$f":"登録!AQ25","v":"HRC"},{"$f":"登録!AR25","v":"宮本　一"},null,91,"w",null,{"$f":"登録!AS25","v":"山中　康寛"},{"$f":"登録!AT25","v":"SBC"},null,"s"]
[null,{"$f":"登録!AN26","v":25},{"$f":"登録!AQ26","v":"HRC"},{"$f":"登録!AR26","v":"伊藤　登"},null,"w",61,null,{"$f":"登録!AS26","v":"西峰　久祐"},{"$f":"登録!AT26","v":"SBC"},null,"s"]
[null,{"$f":"登録!AN27","v":26},{"$f":"登録!AQ27","v":"HRC"},{"$f":"登録!AR27","v":"宮井健太郎"},null,48,"w",null,{"$f":"登録!AS27","v":"大橋　正寛"},{"$f":"登録!AT27","v":"SBC"},null,"s"]
[null,{"$f":"登録!AN28","v":27},{"$f":"登録!AQ28","v":"HRC"},{"$f":"登録!AR28","v":"白澤雄一郎"},null,13,"w",null,{"$f":"登録!AS28","v":"秋田　倫央"},{"$f":"登録!AT28","v":"SBC"},null,"s"]
[null,{"$f":"登録!AN29","v":28},{"$f":"登録!AQ29","v":"HRC"},{"$f":"登録!AR29","v":"河地　恵里"},null,"w",6,null,{"$f":"登録!AS29","v":"大橋　洋子"},{"$f":"登録!AT29","v":"SBC"},null,"s"]
[null,{"$f":"登録!AN30","v":29},{"$f":"登録!AQ30","v":"WRC"},{"$f":"登録!AR30","v":"末岡　修"},null,"w",25,null,{"$f":"登録!AS30","v":"吉向　翔平"},{"$f":"登録!AT30","v":"NRC"},null,"s"]
[null,{"$f":"登録!AN31","v":30},{"$f":"登録!AQ31","v":"WRC"},{"$f":"登録!AR31","v":"和田宗一郎"},null,22,"w",null,{"$f":"登録!AS31","v":"岩本　剛"},{"$f":"登録!AT31","v":"NRC"},null,"s"]
[null,{"$f":"登録!AN32","v":31},{"$f":"登録!AQ32","v":"WRC"},{"$f":"登録!AR32","v":"杉本　博章"},null,71,"w",null,{"$f":"登録!AS32","v":"白戸　玲人"},{"$f":"登録!AT32","v":"NRC"},null,"s"]
[null,{"$f":"登録!AN33","v":32},{"$f":"登録!AQ33","v":"WRC"},{"$f":"登録!AR33","v":"中本　雅大"},null,"w",76,null,{"$f":"登録!AS33","v":"植田　慎也"},{"$f":"登録!AT33","v":"NRC"},null,"s"]
[null,{"$f":"登録!AN34","v":33},{"$f":"登録!AQ34","v":"WRC"},{"$f":"登録!AR34","v":"山中　康介"},null,"w",57,null,{"$f":"登録!AS34","v":"近藤　拓馬"},{"$f":"登録!AT34","v":"NRC"},null,"s"]
[null,{"$f":"登録!AN35","v":34},{"$f":"登録!AQ35","v":"WRC"},{"$f":"登録!AR35","v":"芝先　泰生"},"A120","w",0,null,{"$f":"登録!AS35","v":"長谷川　進"},{"$f":"登録!AT35","v":"NRC"},null,"s"]
[null,{"$f":"登録!AN36","v":35},{"$f":"登録!AQ36","v":"WRC"},{"$f":"登録!AR36","v":"松房ゆかり"},null,"w",39,null,{"$f":"登録!AS36","v":"白戸　恭子"},{"$f":"登録!AT36","v":"NRC"},null,"s"]
[null,{"$f":"登録!AN37","v":36},{"$f":"登録!AQ37","v":"KRC"},{"$f":"登録!AR37","v":"松好　太一"},null,105,"w",null,{"$f":"登録!AS37","v":"松居　勝巳"},{"$f":"登録!AT37","v":"ORC"},null,"s"]
[null,{"$f":"登録!AN38","v":37},{"$f":"登録!AQ38","v":"KRC"},{"$f":"登録!AR38","v":"清水　義晴"},null,"w",83,null,{"$f":"登録!AS38","v":"藤明　宏樹"},{"$f":"登録!AT38","v":"ORC"},null,"s"]
[null,{"$f":"登録!AN39","v":38},{"$f":"登録!AQ39","v":"KRC"},{"$f":"登録!AR39","v":"鈴木　康文"},null,"w",67,null,{"$f":"登録!AS39","v":"吉岡　保俊"},{"$f":"登録!AT39","v":"ORC"},null,"s"]
[null,{"$f":"登録!AN40","v":39},{"$f":"登録!AQ40","v":"KRC"},{"$f":"登録!AR40","v":"早川　徹"},null,"w",34,null,{"$f":"登録!AS40","v":"村上　泰辰"},{"$f":"登録!AT40","v":"ORC"},null,"s"]
[null,{"$f":"登録!AN41","v":40},{"$f":"登録!AQ41","v":"KRC"},{"$f":"登録!AR41","v":"井関　一成"},null,"w",0,null,{"$f":"登録!AS41","v":"小原　嘉丈"},{"$f":"登録!AT41","v":"ORC"},null,"s"]
[null,{"$f":"登録!AN42","v":41},{"$f":"登録!AQ42","v":"KRC"},{"$f":"登録!AR42","v":"今村　哲也"},null,75,"w",null,{"$f":"登録!AS42","v":"乾　伸綱"},{"$f":"登録!AT42","v":"ORC"},null,"s"]
[null,{"$f":"登録!AN43","v":42},{"$f":"登録!AQ43","v":"KRC"},{"$f":"登録!AR43","v":"森田由佳里"},null,92,"w",null,{"$f":"登録!AS43","v":"山崎真紀子"},{"$f":"登録!AT43","v":"ORC"},null,"s"]
[null,{"$f":"登録!AN44","v":43},{"$f":"登録!AQ44","v":"WRC"},{"$f":"登録!AR44","v":"末岡　修"},null,"w",13,null,{"$f":"登録!AS44","v":"鐵山　泰三"},{"$f":"登録!AT44","v":"HRC"},null,"s"]
[null,{"$f":"登録!AN45","v":44},{"$f":"登録!AQ45","v":"WRC"},{"$f":"登録!AR45","v":"和田宗一郎"},null,"w",8,null,{"$f":"登録!AS45","v":"堂園　雅也"},{"$f":"登録!AT45","v":"HRC"},null,"s"]
[null,{"$f":"登録!AN46","v":45},{"$f":"登録!AQ46","v":"WRC"},{"$f":"登録!AR46","v":"杉本　博章"},null,"w",115,null,{"$f":"登録!AS46","v":"宮本　一"},{"$f":"登録!AT46","v":"HRC"},null,"s"]
[null,{"$f":"登録!AN47","v":46},{"$f":"登録!AQ47","v":"WRC"},{"$f":"登録!AR47","v":"中本　雅大"},null,"w",6,null,{"$f":"登録!AS47","v":"伊藤　登"},{"$f":"登録!AT47","v":"HRC"},null,"s"]
[null,{"$f":"登録!AN48","v":47},{"$f":"登録!AQ48","v":"WRC"},{"$f":"登録!AR48","v":"山中　康介"},105,"w",26,null,{"$f":"登録!AS48","v":"宮井健太郎"},{"$f":"登録!AT48","v":"HRC"},null,"s"]
[null,{"$f":"登録!AN49","v":48},{"$f":"登録!AQ49","v":"WRC"},{"$f":"登録!AR49","v":"芝先　泰生"},null,65,"w",null,{"$f":"登録!AS49","v":"白澤雄一郎"},{"$f":"登録!AT49","v":"HRC"},null,"s"]
[null,{"$f":"登録!AN50","v":49},{"$f":"登録!AQ50","v":"WRC"},{"$f":"登録!AR50","v":"松房ゆかり"},null,46,"w",null,{"$f":"登録!AS50","v":"河地　恵里"},{"$f":"登録!AT50","v":"HRC"},null,"s"]
[null,{"$f":"登録!AN51","v":50},{"$f":"登録!AQ51","v":"ORC"},{"$f":"登録!AR51","v":"松居　勝巳"},null,0,"w","A120",{"$f":"登録!AS51","v":"林　秀忠"},{"$f":"登録!AT51","v":"SBC"},null,"s"]
[null,{"$f":"登録!AN52","v":51},{"$f":"登録!AQ52","v":"ORC"},{"$f":"登録!AR52","v":"藤明　宏樹"},null,67,"w",null,{"$f":"登録!AS52","v":"大橋　義治"},{"$f":"登録!AT52","v":"SBC"},null,"s"]
[null,{"$f":"登録!AN53","v":52},{"$f":"登録!AQ53","v":"ORC"},{"$f":"登録!AR53","v":"吉岡　保俊"},null,"w",63,null,{"$f":"登録!AS53","v":"山中　康寛"},{"$f":"登録!AT53","v":"SBC"},null,"s"]
[null,{"$f":"登録!AN54","v":53},{"$f":"登録!AQ54","v":"ORC"},{"$f":"登録!AR54","v":"村上　泰辰"},null,"w",3,null,{"$f":"登録!AS54","v":"西峰　久祐"},{"$f":"登録!AT54","v":"SBC"},null,"s"]
[null,{"$f":"登録!AN55","v":54},{"$f":"登録!AQ55","v":"ORC"},{"$f":"登録!AR55","v":"小原　嘉丈"},null,"w",20,null,{"$f":"登録!AS55","v":"大橋　正寛"},{"$f":"登録!AT55","v":"SBC"},null,"s"]
[null,{"$f":"登録!AN56","v":55},{"$f":"登録!AQ56","v":"ORC"},{"$f":"登録!AR56","v":"乾　伸綱"},null,"w",28,null,{"$f":"登録!AS56","v":"秋田　倫央"},{"$f":"登録!AT56","v":"SBC"},null,"s"]
[null,{"$f":"登録!AN57","v":56},{"$f":"登録!AQ57","v":"ORC"},{"$f":"登録!AR57","v":"山崎真紀子"},null,27,"w",null,{"$f":"登録!AS57","v":"大橋　洋子"},{"$f":"登録!AT57","v":"SBC"},null,"s"]
[null,{"$f":"登録!AN58","v":57},{"$f":"登録!AQ58","v":"KRC"},{"$f":"登録!AR58","v":"松好　太一"},null,83,"w",null,{"$f":"登録!AS58","v":"吉向　翔平"},{"$f":"登録!AT58","v":"NRC"},null,"s"]
[null,{"$f":"登録!AN59","v":58},{"$f":"登録!AQ59","v":"KRC"},{"$f":"登録!AR59","v":"清水　義晴"},null,58,"w",null,{"$f":"登録!AS59","v":"岩本　剛"},{"$f":"登録!AT59","v":"NRC"},null,"s"]
[null,{"$f":"登録!AN60","v":59},{"$f":"登録!AQ60","v":"KRC"},{"$f":"登録!AR60","v":"鈴木　康文"},null,"w",113,null,{"$f":"登録!AS60","v":"白戸　玲人"},{"$f":"登録!AT60","v":"NRC"},null,"s"]
[null,{"$f":"登録!AN61","v":60},{"$f":"登録!AQ61","v":"KRC"},{"$f":"登録!AR61","v":"早川　徹"},null,"w",86,null,{"$f":"登録!AS61","v":"植田　慎也"},{"$f":"登録!AT61","v":"NRC"},null,"s"]
[null,{"$f":"登録!AN62","v":61},{"$f":"登録!AQ62","v":"KRC"},{"$f":"登録!AR62","v":"井関　一成"},null,102,"w",null,{"$f":"登録!AS62","v":"近藤　拓馬"},{"$f":"登録!AT62","v":"NRC"},null,"s"]
[null,{"$f":"登録!AN63","v":62},{"$f":"登録!AQ63","v":"KRC"},{"$f":"登録!AR63","v":"今村　哲也"},null,4,"w",null,{"$f":"登録!AS63","v":"長谷川　進"},{"$f":"登録!AT63","v":"NRC"},null,"s"]
[null,{"$f":"登録!AN64","v":63},{"$f":"登録!AQ64","v":"KRC"},{"$f":"登録!AR64","v":"森田由佳里"},null,36,"w",null,{"$f":"登録!AS64","v":"白戸　恭子"},{"$f":"登録!AT64","v":"NRC"},null,"s"]
[null,{"$f":"登録!AN65","v":64},{"$f":"登録!AQ65","v":"ORC"},{"$f":"登録!AR65","v":"松居　勝巳"},null,58,"w",null,{"$f":"登録!AS65","v":"末岡　修"},{"$f":"登録!AT65","v":"WRC"},null,"s"]
[null,{"$f":"登録!AN66","v":65},{"$f":"登録!AQ66","v":"ORC"},{"$f":"登録!AR66","v":"藤明　宏樹"},null,48,"w",null,{"$f":"登録!AS66","v":"和田宗一郎"},{"$f":"登録!AT66","v":"WRC"},null,"s"]
[null,{"$f":"登録!AN67","v":66},{"$f":"登録!AQ67","v":"ORC"},{"$f":"登録!AR67","v":"吉岡　保俊"},null,98,"w",null,{"$f":"登録!AS67","v":"杉本　博章"},{"$f":"登録!AT67","v":"WRC"},null,"s"]
[null,{"$f":"登録!AN68","v":67},{"$f":"登録!AQ68","v":"ORC"},{"$f":"登録!AR68","v":"村上　泰辰"},null,"w",119,null,{"$f":"登録!AS68","v":"中本　雅大"},{"$f":"登録!AT68","v":"WRC"},null,"s"]
[null,{"$f":"登録!AN69","v":68},{"$f":"登録!AQ69","v":"ORC"},{"$f":"登録!AR69","v":"小原　嘉丈"},null,73,"w",null,{"$f":"登録!AS69","v":"山中　康介"},{"$f":"登録!AT69","v":"WRC"},null,"s"]
[null,{"$f":"登録!AN70","v":69},{"$f":"登録!AQ70","v":"ORC"},{"$f":"登録!AR70","v":"乾　伸綱"},null,"w",48,null,{"$f":"登録!AS70","v":"芝先　泰生"},{"$f":"登録!AT70","v":"WRC"},null,"s"]
[null,{"$f":"登録!AN71","v":70},{"$f":"登録!AQ71","v":"ORC"},{"$f":"登録!AR71","v":"山崎真紀子"},null,91,"w",null,{"$f":"登録!AS71","v":"松房ゆかり"},{"$f":"登録!AT71","v":"WRC"},null,"s"]
[null,{"$f":"登録!AN72","v":71},{"$f":"登録!AQ72","v":"NRC"},{"$f":"登録!AR72","v":"吉向　翔平"},null,56,"w",null,{"$f":"登録!AS72","v":"鐵山　泰三"},{"$f":"登録!AT72","v":"HRC"},null,"s"]
[null,{"$f":"登録!AN73","v":72},{"$f":"登録!AQ73","v":"NRC"},{"$f":"登録!AR73","v":"岩本　剛"},null,45,"w",null,{"$f":"登録!AS73","v":"堂園　雅也"},{"$f":"登録!AT73","v":"HRC"},null,"s"]
[null,{"$f":"登録!AN74","v":73},{"$f":"登録!AQ74","v":"NRC"},{"$f":"登録!AR74","v":"白戸　玲人"},null,0,"w","B120",{"$f":"登録!AS74","v":"宮本　一"},{"$f":"登録!AT74","v":"HRC"},null,"s"]
[null,{"$f":"登録!AN75","v":74},{"$f":"登録!AQ75","v":"NRC"},{"$f":"登録!AR75","v":"植田　慎也"},null,34,"w",null,{"$f":"登録!AS75","v":"伊藤　登"},{"$f":"登録!AT75","v":"HRC"},null,"s"]
[null,{"$f":"登録!AN76","v":75},{"$f":"登録!AQ76","v":"NRC"},{"$f":"登録!AR76","v":"近藤　拓馬"},null,21,"w",null,{"$f":"登録!AS76","v":"宮井健太郎"},{"$f":"登録!AT76","v":"HRC"},null,"s"]
[null,{"$f":"登録!AN77","v":76},{"$f":"登録!AQ77","v":"NRC"},{"$f":"登録!AR77","v":"長谷川　進"},null,21,"w",107,{"$f":"登録!AS77","v":"白澤雄一郎"},{"$f":"登録!AT77","v":"HRC"},null,"s"]
[null,{"$f":"登録!AN78","v":77},{"$f":"登録!AQ78","v":"NRC"},{"$f":"登録!AR78","v":"白戸　恭子"},null,41,"w",null,{"$f":"登録!AS78","v":"河地　恵里"},{"$f":"登録!AT78","v":"HRC"},null,"s"]
[null,{"$f":"登録!AN79","v":78},{"$f":"登録!AQ79","v":"KRC"},{"$f":"登録!AR79","v":"松好　太一"},null,83,"w",null,{"$f":"登録!AS79","v":"林　秀忠"},{"$f":"登録!AT79","v":"SBC"},null,"s"]
[null,{"$f":"登録!AN80","v":79},{"$f":"登録!AQ80","v":"KRC"},{"$f":"登録!AR80","v":"清水　義晴"},null,22,"w",null,{"$f":"登録!AS80","v":"大橋　義治"},{"$f":"登録!AT80","v":"SBC"},null,"s"]
[null,{"$f":"登録!AN81","v":80},{"$f":"登録!AQ81","v":"KRC"},{"$f":"登録!AR81","v":"鈴木　康文"},null,"w",51,null,{"$f":"登録!AS81","v":"山中　康寛"},{"$f":"登録!AT81","v":"SBC"},null,"s"]
[null,{"$f":"登録!AN82","v":81},{"$f":"登録!AQ82","v":"KRC"},{"$f":"登録!AR82","v":"早川　徹"},null,"w",57,null,{"$f":"登録!AS82","v":"西峰　久祐"},{"$f":"登録!AT82","v":"SBC"},null,"s"]
[null,{"$f":"登録!AN83","v":82},{"$f":"登録!AQ83","v":"KRC"},{"$f":"登録!AR83","v":"井関　一成"},null,50,"w",null,{"$f":"登録!AS83","v":"大橋　正寛"},{"$f":"登録!AT83","v":"SBC"},null,"s"]
[null,{"$f":"登録!AN84","v":83},{"$f":"登録!AQ84","v":"KRC"},{"$f":"登録!AR84","v":"今村　哲也"},null,"w",24,null,{"$f":"登録!AS84","v":"秋田　倫央"},{"$f":"登録!AT84","v":"SBC"},null,"s"]
[null,{"$f":"登録!AN85","v":84},{"$f":"登録!AQ85","v":"KRC"},{"$f":"登録!AR85","v":"森田由佳里"},null,"w",1,null,{"$f":"登録!AS85","v":"大橋　洋子"},{"$f":"登録!AT85","v":"SBC"},null,"s"]
[null,{"$f":"登録!AN86","v":85},{"$f":"登録!AQ86","v":"NRC"},{"$f":"登録!AR86","v":"吉向　翔平"},null,63,"w",null,{"$f":"登録!AS86","v":"松居　勝巳"},{"$f":"登録!AT86","v":"ORC"},null,"s"]
[null,{"$f":"登録!AN87","v":86},{"$f":"登録!AQ87","v":"NRC"},{"$f":"登録!AR87","v":"岩本　剛"},null,"w",5,null,{"$f":"登録!AS87","v":"藤明　宏樹"},{"$f":"登録!AT87","v":"ORC"},null,"s"]
[null,{"$f":"登録!AN88","v":87},{"$f":"登録!AQ88","v":"NRC"},{"$f":"登録!AR88","v":"白戸　玲人"},null,79,"w",null,{"$f":"登録!AS88","v":"吉岡　保俊"},{"$f":"登録!AT88","v":"ORC"},null,"s"]
[null,{"$f":"登録!AN89","v":88},{"$f":"登録!AQ89","v":"NRC"},{"$f":"登録!AR89","v":"植田　慎也"},null,106,"w",null,{"$f":"登録!AS89","v":"村上　泰辰"},{"$f":"登録!AT89","v":"ORC"},null,"s"]
[null,{"$f":"登録!AN90","v":89},{"$f":"登録!AQ90","v":"NRC"},{"$f":"登録!AR90","v":"近藤　拓馬"},null,1,"w",116,{"$f":"登録!AS90","v":"小原　嘉丈"},{"$f":"登録!AT90","v":"ORC"},null,"s"]
[null,{"$f":"登録!AN91","v":90},{"$f":"登録!AQ91","v":"NRC"},{"$f":"登録!AR91","v":"長谷川　進"},null,23,"w",null,{"$f":"登録!AS91","v":"乾　伸綱"},{"$f":"登録!AT91","v":"ORC"},null,"s"]
[null,{"$f":"登録!AN92","v":91},{"$f":"登録!AQ92","v":"NRC"},{"$f":"登録!AR92","v":"白戸　恭子"},null,"w",88,null,{"$f":"登録!AS92","v":"山崎真紀子"},{"$f":"登録!AT92","v":"ORC"},null,"s"]
[null,{"$f":"登録!AN93","v":92},{"$f":"登録!AQ93","v":"SBC"},{"$f":"登録!AR93","v":"林　秀忠"},null,"w",79,null,{"$f":"登録!AS93","v":"末岡　修"},{"$f":"登録!AT93","v":"WRC"},null,"s"]
[null,{"$f":"登録!AN94","v":93},{"$f":"登録!AQ94","v":"SBC"},{"$f":"登録!AR94","v":"大橋　義治"},null,"w",51,null,{"$f":"登録!AS94","v":"和田宗一郎"},{"$f":"登録!AT94","v":"WRC"},null,"s"]
[null,{"$f":"登録!AN95","v":94},{"$f":"登録!AQ95","v":"SBC"},{"$f":"登録!AR95","v":"山中　康寛"},null,"w",87,null,{"$f":"登録!AS95","v":"杉本　博章"},{"$f":"登録!AT95","v":"WRC"},null,"s"]
[null,{"$f":"登録!AN96","v":95},{"$f":"登録!AQ96","v":"SBC"},{"$f":"登録!AR96","v":"西峰　久祐"},null,28,"w",null,{"$f":"登録!AS96","v":"中本　雅大"},{"$f":"登録!AT96","v":"WRC"},null,"s"]
[null,{"$f":"登録!AN97","v":96},{"$f":"登録!AQ97","v":"SBC"},{"$f":"登録!AR97","v":"大橋　正寛"},null,39,"w",null,{"$f":"登録!AS97","v":"山中　康介"},{"$f":"登録!AT97","v":"WRC"},null,"s"]
[null,{"$f":"登録!AN98","v":97},{"$f":"登録!AQ98","v":"SBC"},{"$f":"登録!AR98","v":"秋田　倫央"},null,"w",29,null,{"$f":"登録!AS98","v":"芝先　泰生"},{"$f":"登録!AT98","v":"WRC"},null,"s"]
[null,{"$f":"登録!AN99","v":98},{"$f":"登録!AQ99","v":"SBC"},{"$f":"登録!AR99","v":"大橋　洋子"},null,27,"w",null,{"$f":"登録!AS99","v":"松房ゆかり"},{"$f":"登録!AT99","v":"WRC"},null,"s"]
[null,{"$f":"登録!AN100","v":99},{"$f":"登録!AQ100","v":"KRC"},{"$f":"登録!AR100","v":"松好　太一"},null,"w",100,null,{"$f":"登録!AS100","v":"鐵山　泰三"},{"$f":"登録!AT100","v":"HRC"},null,"s"]
[null,{"$f":"登録!AN101","v":100},{"$f":"登録!AQ101","v":"KRC"},{"$f":"登録!AR101","v":"清水　義晴"},null,"w",114,null,{"$f":"登録!AS101","v":"堂園　雅也"},{"$f":"登録!AT101","v":"HRC"},null,"s"]
[null,{"$f":"登録!AN102","v":101},{"$f":"登録!AQ102","v":"KRC"},{"$f":"登録!AR102","v":"鈴木　康文"},null,2,"w",105,{"$f":"登録!AS102","v":"宮本　一"},{"$f":"登録!AT102","v":"HRC"},null,"s"]
[null,{"$f":"登録!AN103","v":102},{"$f":"登録!AQ103","v":"KRC"},{"$f":"登録!AR103","v":"早川　徹"},null,"w",100,null,{"$f":"登録!AS103","v":"伊藤　登"},{"$f":"登録!AT103","v":"HRC"},null,"s"]
[null,{"$f":"登録!AN104","v":103},{"$f":"登録!AQ104","v":"KRC"},{"$f":"登録!AR104","v":"井関　一成"},null,"w",25,null,{"$f":"登録!AS104","v":"宮井健太郎"},{"$f":"登録!AT104","v":"HRC"},null,"s"]
[null,{"$f":"登録!AN105","v":104},{"$f":"登録!AQ105","v":"KRC"},{"$f":"登録!AR105","v":"今村　哲也"},null,"w",20,null,{"$f":"登録!AS105","v":"白澤雄一郎"},{"$f":"登録!AT105","v":"HRC"},null,"s"]
[null,{"$f":"登録!AN106","v":105},{"$f":"登録!AQ106","v":"KRC"},{"$f":"登録!AR106","v":"森田由佳里"},null,"w",15,null,{"$f":"登録!AS106","v":"河地　恵里"},{"$f":"登録!AT106","v":"HRC"},null,"s"]
[null,{"$f":"登録!AN107","v":106},{"$f":"登録!AQ107","v":"SBC"},{"$f":"登録!AR107","v":"山中　康寛"},null,"w",17,null,{"$f":"登録!AS107","v":"植田　慎也"},{"$f":"登録!AT107","v":"NRC"},null,"s"]
[null,{"$f":"登録!AN108","v":107},{"$f":"登録!AQ108","v":"SBC"},{"$f":"登録!AR108","v":"西峰　久祐"},null,"w",17,null,{"$f":"登録!AS108","v":"近藤　拓馬"},{"$f":"登録!AT108","v":"NRC"},null,"s"]
[null,{"$f":"登録!AN109","v":108},{"$f":"登録!AQ109","v":"SBC"},{"$f":"登録!AR109","v":"大橋　正寛"},"A120","w",0,null,{"$f":"登録!AS109","v":"長谷川　進"},{"$f":"登録!AT109","v":"NRC"},null,"s"]
[null,{"$f":"登録!AN110","v":109},{"$f":"登録!AQ110","v":"SBC"},{"$f":"登録!AR110","v":"秋田　倫央"},null,46,"w",null,{"$f":"登録!AS110","v":"白戸　恭子"},{"$f":"登録!AT110","v":"NRC"},null,"s"]
[null,{"$f":"登録!AN111","v":110},{"$f":"登録!AQ111","v":"SBC"},{"$f":"登録!AR111","v":"大橋　洋子"},null,32,"w",null,{"$f":"登録!AS111","v":"吉向　翔平"},{"$f":"登録!AT111","v":"NRC"},null,"s"]
[null,{"$f":"登録!AN112","v":111},{"$f":"登録!AQ112","v":"SBC"},{"$f":"登録!AR112","v":"林　秀忠"},null,"w",47,null,{"$f":"登録!AS112","v":"岩本　剛"},{"$f":"登録!AT112","v":"NRC"},null,"s"]
[null,{"$f":"登録!AN113","v":112},{"$f":"登録!AQ113","v":"SBC"},{"$f":"登録!AR113","v":"大橋　義治"},null,101,"w",null,{"$f":"登録!AS113","v":"白戸　玲人"},{"$f":"登録!AT113","v":"NRC"},null,"s"]
[null,{"$f":"登録!AN114","v":113},{"$f":"登録!AQ114","v":"HRC"},{"$f":"登録!AR114","v":"堂園　雅也"},null,114,"w",null,{"$f":"登録!AS114","v":"小原　嘉丈"},{"$f":"登録!AT114","v":"ORC"},null,"s"]
[null,{"$f":"登録!AN115","v":114},{"$f":"登録!AQ115","v":"HRC"},{"$f":"登録!AR115","v":"宮本　一"},null,"w",115,null,{"$f":"登録!AS115","v":"乾　伸綱"},{"$f":"登録!AT115","v":"ORC"},null,"s"]
[null,{"$f":"登録!AN116","v":115},{"$f":"登録!AQ116","v":"HRC"},{"$f":"登録!AR116","v":"伊藤　登"},null,"w",84,null,{"$f":"登録!AS116","v":"山崎真紀子"},{"$f":"登録!AT116","v":"ORC"},null,"s"]
[null,{"$f":"登録!AN117","v":116},{"$f":"登録!AQ117","v":"HRC"},{"$f":"登録!AR117","v":"宮井健太郎"},null,32,"w",null,{"$f":"登録!AS117","v":"松居　勝巳"},{"$f":"登録!AT117","v":"ORC"},null,"s"]
[null,{"$f":"登録!AN118","v":117},{"$f":"登録!AQ118","v":"HRC"},{"$f":"登録!AR118","v":"白澤雄一郎"},null,72,"w",null,{"$f":"登録!AS118","v":"藤明　宏樹"},{"$f":"登録!AT118","v":"ORC"},null,"s"]
[null,{"$f":"登録!AN119","v":118},{"$f":"登録!AQ119","v":"HRC"},{"$f":"登録!AR119","v":"河地　恵里"},null,22,"w",null,{"$f":"登録!AS119","v":"吉岡　保俊"},{"$f":"登録!AT119","v":"ORC"},null,"s"]
[null,{"$f":"登録!AN120","v":119},{"$f":"登録!AQ120","v":"HRC"},{"$f":"登録!AR120","v":"鐵山　泰三"},null,75,"w",null,{"$f":"登録!AS120","v":"村上　泰辰"},{"$f":"登録!AT120","v":"ORC"},null,"s"]
[null,{"$f":"登録!AN121","v":120},{"$f":"登録!AQ121","v":"KRC"},{"$f":"登録!AR121","v":"松好　太一"},null,97,"w",null,{"$f":"登録!AS121","v":"芝先　泰生"},{"$f":"登録!AT121","v":"WRC"},null,"s"]
[null,{"$f":"登録!AN122","v":121},{"$f":"登録!AQ122","v":"KRC"},{"$f":"登録!AR122","v":"清水　義晴"},null,5,"w",null,{"$f":"登録!AS122","v":"松房ゆかり"},{"$f":"登録!AT122","v":"WRC"},null,"s"]
[null,{"$f":"登録!AN123","v":122},{"$f":"登録!AQ123","v":"KRC"},{"$f":"登録!AR123","v":"鈴木　康文"},null,"w",117,null,{"$f":"登録!AS123","v":"末岡　修"},{"$f":"登録!AT123","v":"WRC"},null,"s"]
[null,{"$f":"登録!AN124","v":123},{"$f":"登録!AQ124","v":"KRC"},{"$f":"登録!AR124","v":"早川　徹"},null,"w",61,null,{"$f":"登録!AS124","v":"和田宗一郎"},{"$f":"登録!AT124","v":"WRC"},null,"s"]
[null,{"$f":"登録!AN125","v":124},{"$f":"登録!AQ125","v":"KRC"},{"$f":"登録!AR125","v":"井関　一成"},null,119,"w",null,{"$f":"登録!AS125","v":"杉本　博章"},{"$f":"登録!AT125","v":"WRC"},null,"s"]
[null,{"$f":"登録!AN126","v":125},{"$f":"登録!AQ126","v":"KRC"},{"$f":"登録!AR126","v":"今村　哲也"},null,91,"w",null,{"$f":"登録!AS126","v":"中本　雅大"},{"$f":"登録!AT126","v":"WRC"},null,"s"]
[null,{"$f":"登録!AN127","v":126},{"$f":"登録!AQ127","v":"KRC"},{"$f":"登録!AR127","v":"森田由佳里"},null,"w",81,null,{"$f":"登録!AS127","v":"山中　康介"},{"$f":"登録!AT127","v":"WRC"},null,"s"]
[null,{"$f":"登録!AN128","v":127},{"$f":"登録!AQ128","v":"HRC"},{"$f":"登録!AR128","v":"堂園　雅也"},104,"w",0,null,{"$f":"登録!AS128","v":"山中　康寛"},{"$f":"登録!AT128","v":"SBC"},null,"s"]
[null,{"$f":"登録!AN129","v":128},{"$f":"登録!AQ129","v":"HRC"},{"$f":"登録!AR129","v":"宮本　一"},null,76,"w",null,{"$f":"登録!AS129","v":"西峰　久祐"},{"$f":"登録!AT129","v":"SBC"},null,"s"]
[null,{"$f":"登録!AN130","v":129},{"$f":"登録!AQ130","v":"HRC"},{"$f":"登録!AR130","v":"伊藤　登"},null,72,"w",null,{"$f":"登録!AS130","v":"大橋　正寛"},{"$f":"登録!AT130","v":"SBC"},null,"s"]
[null,{"$f":"登録!AN131","v":130},{"$f":"登録!AQ131","v":"HRC"},{"$f":"登録!AR131","v":"宮井健太郎"},null,107,"w",null,{"$f":"登録!AS131","v":"秋田　倫央"},{"$f":"登録!AT131","v":"SBC"},null,"s"]
[null,{"$f":"登録!AN132","v":131},{"$f":"登録!AQ132","v":"HRC"},{"$f":"登録!AR132","v":"白澤雄一郎"},null,"w",3,null,{"$f":"登録!AS132","v":"大橋　洋子"},{"$f":"登録!AT132","v":"SBC"},null,"s"]
[null,{"$f":"登録!AN133","v":132},{"$f":"登録!AQ133","v":"HRC"},{"$f":"登録!AR133","v":"河地　恵里"},null,30,"w",null,{"$f":"登録!AS133","v":"林　秀忠"},{"$f":"登録!AT133","v":"SBC"},null,"s"]
[null,{"$f":"登録!AN134","v":133},{"$f":"登録!AQ134","v":"HRC"},{"$f":"登録!AR134","v":"鐵山　泰三"},null,33,"w",null,{"$f":"登録!AS134","v":"大橋　義治"},{"$f":"登録!AT134","v":"SBC"},null,"s"]
[null,{"$f":"登録!AN135","v":134},{"$f":"登録!AQ135","v":"WRC"},{"$f":"登録!AR135","v":"芝先　泰生"},null,25,"w",106,{"$f":"登録!AS135","v":"植田　慎也"},{"$f":"登録!AT135","v":"NRC"},null,"s"]
[null,{"$f":"登録!AN136","v":135},{"$f":"登録!AQ136","v":"WRC"},{"$f":"登録!AR136","v":"松房ゆかり"},null,"w",81,null,{"$f":"登録!AS136","v":"近藤　拓馬"},{"$f":"登録!AT136","v":"NRC"},null,"s"]
[null,{"$f":"登録!AN137","v":136},{"$f":"登録!AQ137","v":"WRC"},{"$f":"登録!AR137","v":"末岡　修"},null,"w",13,null,{"$f":"登録!AS137","v":"長谷川　進"},{"$f":"登録!AT137","v":"NRC"},null,"s"]
[null,{"$f":"登録!AN138","v":137},{"$f":"登録!AQ138","v":"WRC"},{"$f":"登録!AR138","v":"和田宗一郎"},null,0,"w","A105",{"$f":"登録!AS138","v":"白戸　恭子"},{"$f":"登録!AT138","v":"NRC"},null,"s"]
[null,{"$f":"登録!AN139","v":138},{"$f":"登録!AQ139","v":"WRC"},{"$f":"登録!AR139","v":"杉本　博章"},null,80,"w",null,{"$f":"登録!AS139","v":"吉向　翔平"},{"$f":"登録!AT139","v":"NRC"},null,"s"]
[null,{"$f":"登録!AN140","v":139},{"$f":"登録!AQ140","v":"WRC"},{"$f":"登録!AR140","v":"中本　雅大"},null,68,"w",null,{"$f":"登録!AS140","v":"岩本　剛"},{"$f":"登録!AT140","v":"NRC"},null,"s"]
[null,{"$f":"登録!AN141","v":140},{"$f":"登録!AQ141","v":"WRC"},{"$f":"登録!AR141","v":"山中　康介"},null,0,"w",107,{"$f":"登録!AS141","v":"白戸　玲人"},{"$f":"登録!AT141","v":"NRC"},null,"s"]
[null,{"$f":"登録!AN142","v":141},{"$f":"登録!AQ142","v":"KRC"},{"$f":"登録!AR142","v":"松好　太一"},null,57,"w",null,{"$f":"登録!AS142","v":"小原　嘉丈"},{"$f":"登録!AT142","v":"ORC"},null,"s"]
[null,{"$f":"登録!AN143","v":142},{"$f":"登録!AQ143","v":"KRC"},{"$f":"登録!AR143","v":"清水　義晴"},null,108,"w",null,{"$f":"登録!AS143","v":"乾　伸綱"},{"$f":"登録!AT143","v":"ORC"},null,"s"]
[null,{"$f":"登録!AN144","v":143},{"$f":"登録!AQ144","v":"KRC"},{"$f":"登録!AR144","v":"鈴木　康文"},107,"w",1,null,{"$f":"登録!AS144","v":"山崎真紀子"},{"$f":"登録!AT144","v":"ORC"},null,"s"]
[null,{"$f":"登録!AN145","v":144},{"$f":"登録!AQ145","v":"KRC"},{"$f":"登録!AR145","v":"早川　徹"},null,38,"w",null,{"$f":"登録!AS145","v":"松居　勝巳"},{"$f":"登録!AT145","v":"ORC"},null,"s"]
[null,{"$f":"登録!AN146","v":145},{"$f":"登録!AQ146","v":"KRC"},{"$f":"登録!AR146","v":"井関　一成"},null,63,"w",null,{"$f":"登録!AS146","v":"藤明　宏樹"},{"$f":"登録!AT146","v":"ORC"},null,"s"]
[null,{"$f":"登録!AN147","v":146},{"$f":"登録!AQ147","v":"KRC"},{"$f":"登録!AR147","v":"今村　哲也"},null,44,"w",null,{"$f":"登録!AS147","v":"吉岡　保俊"},{"$f":"登録!AT147","v":"ORC"},null,"s"]
[null,{"$f":"登録!AN148","v":147},{"$f":"登録!AQ148","v":"KRC"},{"$f":"登録!AR148","v":"森田由佳里"},null,35,"w",null,{"$f":"登録!AS148","v":"村上　泰辰"},{"$f":"登録!AT148","v":"ORC"},null,"s"]
[null,{"$f":"登録!AN149","v":148},{"$f":"登録!AQ149","v":"WRC"},{"$f":"登録!AR149","v":"芝先　泰生"},null,30,"w",null,{"$f":"登録!AS149","v":"堂園　雅也"},{"$f":"登録!AT149","v":"HRC"},null,"s"]
[null,{"$f":"登録!AN150","v":149},{"$f":"登録!AQ150","v":"WRC"},{"$f":"登録!AR150","v":"松房ゆかり"},null,58,"w",null,{"$f":"登録!AS150","v":"宮本　一"},{"$f":"登録!AT150","v":"HRC"},null,"s"]
[null,{"$f":"登録!AN151","v":150},{"$f":"登録!AQ151","v":"WRC"},{"$f":"登録!AR151","v":"末岡　修"},null,"w",42,null,{"$f":"登録!AS151","v":"伊藤　登"},{"$f":"登録!AT151","v":"HRC"},null,"s"]
[null,{"$f":"登録!AN152","v":151},{"$f":"登録!AQ152","v":"WRC"},{"$f":"登録!AR152","v":"和田宗一郎"},null,37,"w",null,{"$f":"登録!AS152","v":"宮井健太郎"},{"$f":"登録!AT152","v":"HRC"},null,"s"]
[null,{"$f":"登録!AN153","v":152},{"$f":"登録!AQ153","v":"WRC"},{"$f":"登録!AR153","v":"杉本　博章"},null,"w",0,null,{"$f":"登録!AS153","v":"白澤雄一郎"},{"$f":"登録!AT153","v":"HRC"},null,"s"]
[null,{"$f":"登録!AN154","v":153},{"$f":"登録!AQ154","v":"WRC"},{"$f":"登録!AR154","v":"中本　雅大"},null,51,"w",null,{"$f":"登録!AS154","v":"河地　恵里"},{"$f":"登録!AT154","v":"HRC"},null,"s"]
[null,{"$f":"登録!AN155","v":154},{"$f":"登録!AQ155","v":"WRC"},{"$f":"登録!AR155","v":"山中　康介"},null,"w",114,null,{"$f":"登録!AS155","v":"鐵山　泰三"},{"$f":"登録!AT155","v":"HRC"},null,"s"]
[null,{"$f":"登録!AN156","v":155},{"$f":"登録!AQ156","v":"ORC"},{"$f":"登録!AR156","v":"小原　嘉丈"},null,"w",90,null,{"$f":"登録!AS156","v":"山中　康寛"},{"$f":"登録!AT156","v":"SBC"},null,"s"]
[null,{"$f":"登録!AN157","v":156},{"$f":"登録!AQ157","v":"ORC"},{"$f":"登録!AR157","v":"乾　伸綱"},null,85,"w",101,{"$f":"登録!AS157","v":"西峰　久祐"},{"$f":"登録!AT157","v":"SBC"},null,"s"]
[null,{"$f":"登録!AN158","v":157},{"$f":"登録!AQ158","v":"ORC"},{"$f":"登録!AR158","v":"山崎真紀子"},null,61,"w",null,{"$f":"登録!AS158","v":"大橋　正寛"},{"$f":"登録!AT158","v":"SBC"},null,"s"]
[null,{"$f":"登録!AN159","v":158},{"$f":"登録!AQ159","v":"ORC"},{"$f":"登録!AR159","v":"松居　勝巳"},null,"w",109,null,{"$f":"登録!AS159","v":"秋田　倫央"},{"$f":"登録!AT159","v":"SBC"},null,"s"]
[null,{"$f":"登録!AN160","v":159},{"$f":"登録!AQ160","v":"ORC"},{"$f":"登録!AR160","v":"藤明　宏樹"},null,"w",16,null,{"$f":"登録!AS160","v":"大橋　洋子"},{"$f":"登録!AT160","v":"SBC"},null,"s"]
[null,{"$f":"登録!AN161","v":160},{"$f":"登録!AQ161","v":"ORC"},{"$f":"登録!AR161","v":"吉岡　保俊"},null,"w",55,null,{"$f":"登録!AS161","v":"林　秀忠"},{"$f":"登録!AT161","v":"SBC"},null,"s"]
[null,{"$f":"登録!AN162","v":161},{"$f":"登録!AQ162","v":"ORC"},{"$f":"登録!AR162","v":"村上　泰辰"},null,"w",82,null,{"$f":"登録!AS162","v":"大橋　義治"},{"$f":"登録!AT162","v":"SBC"},null,"s"]
[null,{"$f":"登録!AN163","v":162},{"$f":"登録!AQ163","v":"KRC"},{"$f":"登録!AR163","v":"松好　太一"},null,"w",24,null,{"$f":"登録!AS163","v":"植田　慎也"},{"$f":"登録!AT163","v":"NRC"},null,"s"]
[null,{"$f":"登録!AN164","v":163},{"$f":"登録!AQ164","v":"KRC"},{"$f":"登録!AR164","v":"清水　義晴"},null,"w",8,null,{"$f":"登録!AS164","v":"近藤　拓馬"},{"$f":"登録!AT164","v":"NRC"},null,"s"]
[null,{"$f":"登録!AN165","v":164},{"$f":"登録!AQ165","v":"KRC"},{"$f":"登録!AR165","v":"鈴木　康文"},null,119,"w",null,{"$f":"登録!AS165","v":"長谷川　進"},{"$f":"登録!AT165","v":"NRC"},null,"s"]
[null,{"$f":"登録!AN166","v":165},{"$f":"登録!AQ166","v":"KRC"},{"$f":"登録!AR166","v":"早川　徹"},null,"w",66,null,{"$f":"登録!AS166","v":"白戸　恭子"},{"$f":"登録!AT166","v":"NRC"},null,"s"]
[null,{"$f":"登録!AN167","v":166},{"$f":"登録!AQ167","v":"KRC"},{"$f":"登録!AR167","v":"井関　一成"},null,76,"w",null,{"$f":"登録!AS167","v":"吉向　翔平"},{"$f":"登録!AT167","v":"NRC"},null,"s"]
[null,{"$f":"登録!AN168","v":167},{"$f":"登録!AQ168","v":"KRC"},{"$f":"登録!AR168","v":"今村　哲也"},null,"w",53,null,{"$f":"登録!AS168","v":"岩本　剛"},{"$f":"登録!AT168","v":"NRC"},null,"s"]
[null,{"$f":"登録!AN169","v":168},{"$f":"登録!AQ169","v":"KRC"},{"$f":"登録!AR169","v":"森田由佳里"},null,31,"w",null,{"$f":"登録!AS169","v":"白戸　玲人"},{"$f":"登録!AT169","v":"NRC"},null,"s"]
[null,{"$f":"登録!AN170","v":169},{"$f":"登録!AQ170","v":"ORC"},{"$f":"登録!AR170","v":"小原　嘉丈"},null,"w",20,null,{"$f":"登録!AS170","v":"芝先　泰生"},{"$f":"登録!AT170","v":"WRC"},null,"s"]
[null,{"$f":"登録!AN171","v":170},{"$f":"登録!AQ171","v":"ORC"},{"$f":"登録!AR171","v":"乾　伸綱"},null,"w",0,null,{"$f":"登録!AS171","v":"松房ゆかり"},{"$f":"登録!AT171","v":"WRC"},null,"s"]
[null,{"$f":"登録!AN172","v":171},{"$f":"登録!AQ172","v":"ORC"},{"$f":"登録!AR172","v":"山崎真紀子"},null,52,"w",null,{"$f":"登録!AS172","v":"末岡　修"},{"$f":"登録!AT172","v":"WRC"},null,"s"]
[null,{"$f":"登録!AN173","v":172},{"$f":"登録!AQ173","v":"ORC"},{"$f":"登録!AR173","v":"松居　勝巳"},null,"w",83,null,{"$f":"登録!AS173","v":"和田宗一郎"},{"$f":"登録!AT173","v":"WRC"},null,"s"]
[null,{"$f":"登録!AN174","v":173},{"$f":"登録!AQ174","v":"ORC"},{"$f":"登録!AR174","v":"藤明　宏樹"},null,92,"w",null,{"$f":"登録!AS174","v":"杉本　博章"},{"$f":"登録!AT174","v":"WRC"},null,"s"]
[null,{"$f":"登録!AN175","v":174},{"$f":"登録!AQ175","v":"ORC"},{"$f":"登録!AR175","v":"吉岡　保俊"},null,83,"w",null,{"$f":"登録!AS175","v":"中本　雅大"},{"$f":"登録!AT175","v":"WRC"},null,"s"]
[null,{"$f":"登録!AN176","v":175},{"$f":"登録!AQ176","v":"ORC"},{"$f":"登録!AR176","v":"村上　泰辰"},null,38,"w",null,{"$f":"登録!AS176","v":"山中　康介"},{"$f":"登録!AT176","v":"WRC"},null,"s"]
[null,{"$f":"登録!AN177","v":176},{"$f":"登録!AQ177","v":"NRC"},{"$f":"登録!AR177","v":"植田　慎也"},null,29,"w",null,{"$f":"登録!AS177","v":"堂園　雅也"},{"$f":"登録!AT177","v":"HRC"},null,"s"]
[null,{"$f":"登録!AN178","v":177},{"$f":"登録!AQ178","v":"NRC"},{"$f":"登録!AR178","v":"近藤　拓馬"},null,0,"w",112,{"$f":"登録!AS178","v":"宮本　一"},{"$f":"登録!AT178","v":"HRC"},null,"s"]
[null,{"$f":"登録!AN179","v":178},{"$f":"登録!AQ179","v":"NRC"},{"$f":"登録!AR179","v":"長谷川　進"},null,32,"w",null,{"$f":"登録!AS179","v":"伊藤　登"},{"$f":"登録!AT179","v":"HRC"},null,"s"]
[null,{"$f":"登録!AN180","v":179},{"$f":"登録!AQ180","v":"NRC"},{"$f":"登録!AR180","v":"白戸　恭子"},null,"w",92,null,{"$f":"登録!AS180","v":"宮井健太郎"},{"$f":"登録!AT180","v":"HRC"},null,"s"]
[null,{"$f":"登録!AN181","v":180},{"$f":"登録!AQ181","v":"NRC"},{"$f":"登録!AR181","v":"吉向　翔平"},null,26,"w",null,{"$f":"登録!AS181","v":"白澤雄一郎"},{"$f":"登録!AT181","v":"HRC"},null,"s"]
[null,{"$f":"登録!AN182","v":181},{"$f":"登録!AQ182","v":"NRC"},{"$f":"登録!AR182","v":"岩本　剛"},null,79,"w",null,{"$f":"登録!AS182","v":"河地　恵里"},{"$f":"登録!AT182","v":"HRC"},null,"s"]
[null,{"$f":"登録!AN183","v":182},{"$f":"登録!AQ183","v":"NRC"},{"$f":"登録!AR183","v":"白戸　玲人"},null,0,"w",null,{"$f":"登録!AS183","v":"鐵山　泰三"},{"$f":"登録!AT183","v":"HRC"},null,"s"]
[null,{"$f":"登録!AN184","v":183},{"$f":"登録!AQ184","v":"KRC"},{"$f":"登録!AR184","v":"松好　太一"},null,"w",71,null,{"$f":"登録!AS184","v":"山中　康寛"},{"$f":"登録!AT184","v":"SBC"},null,"s"]
[null,{"$f":"登録!AN185","v":184},{"$f":"登録!AQ185","v":"KRC"},{"$f":"登録!AR185","v":"清水　義晴"},null,"w",116,null,{"$f":"登録!AS185","v":"西峰　久祐"},{"$f":"登録!AT185","v":"SBC"},null,"s"]
[null,{"$f":"登録!AN186","v":185},{"$f":"登録!AQ186","v":"KRC"},{"$f":"登録!AR186","v":"鈴木　康文"},null,"w",44,null,{"$f":"登録!AS186","v":"大橋　正寛"},{"$f":"登録!AT186","v":"SBC"},null,"s"]
[null,{"$f":"登録!AN187","v":186},{"$f":"登録!AQ187","v":"KRC"},{"$f":"登録!AR187","v":"早川　徹"},null,"w",11,null,{"$f":"登録!AS187","v":"秋田　倫央"},{"$f":"登録!AT187","v":"SBC"},null,"s"]
[null,{"$f":"登録!AN188","v":187},{"$f":"登録!AQ188","v":"KRC"},{"$f":"登録!AR188","v":"井関　一成"},null,"w",23,null,{"$f":"登録!AS188","v":"大橋　洋子"},{"$f":"登録!AT188","v":"SBC"},null,"s"]
[null,{"$f":"登録!AN189","v":188},{"$f":"登録!AQ189","v":"KRC"},{"$f":"登録!AR189","v":"今村　哲也"},null,"w",85,null,{"$f":"登録!AS189","v":"林　秀忠"},{"$f":"登録!AT189","v":"SBC"},null,"s"]
[null,{"$f":"登録!AN190","v":189},{"$f":"登録!AQ190","v":"KRC"},{"$f":"登録!AR190","v":"森田由佳里"},null,"w",84,null,{"$f":"登録!AS190","v":"大橋　義治"},{"$f":"登録!AT190","v":"SBC"},null,"s"]
[null,{"$f":"登録!AN191","v":190},{"$f":"登録!AQ191","v":"NRC"},{"$f":"登録!AR191","v":"植田　慎也"},null,118,"w",null,{"$f":"登録!AS191","v":"小原　嘉丈"},{"$f":"登録!AT191","v":"ORC"},null,"s"]
[null,{"$f":"登録!AN192","v":191},{"$f":"登録!AQ192","v":"NRC"},{"$f":"登録!AR192","v":"近藤　拓馬"},null,33,"w",null,{"$f":"登録!AS192","v":"乾　伸綱"},{"$f":"登録!AT192","v":"ORC"},null,"s"]
[null,{"$f":"登録!AN193","v":192},{"$f":"登録!AQ193","v":"NRC"},{"$f":"登録!AR193","v":"長谷川　進"},null,55,"w",null,{"$f":"登録!AS193","v":"山崎真紀子"},{"$f":"登録!AT193","v":"ORC"},null,"s"]
[null,{"$f":"登録!AN194","v":193},{"$f":"登録!AQ194","v":"NRC"},{"$f":"登録!AR194","v":"白戸　恭子"},null,25,"w",null,{"$f":"登録!AS194","v":"松居　勝巳"},{"$f":"登録!AT194","v":"ORC"},null,"s"]
[null,{"$f":"登録!AN195","v":194},{"$f":"登録!AQ195","v":"NRC"},{"$f":"登録!AR195","v":"吉向　翔平"},null,"w",60,null,{"$f":"登録!AS195","v":"藤明　宏樹"},{"$f":"登録!AT195","v":"ORC"},null,"s"]
[null,{"$f":"登録!AN196","v":195},{"$f":"登録!AQ196","v":"NRC"},{"$f":"登録!AR196","v":"岩本　剛"},null,"w",18,null,{"$f":"登録!AS196","v":"吉岡　保俊"},{"$f":"登録!AT196","v":"ORC"},null,"s"]
[null,{"$f":"登録!AN197","v":196},{"$f":"登録!AQ197","v":"NRC"},{"$f":"登録!AR197","v":"白戸　玲人"},null,"w",11,null,{"$f":"登録!AS197","v":"村上　泰辰"},{"$f":"登録!AT197","v":"ORC"},null,"s"]
[null,{"$f":"登録!AN198","v":197},{"$f":"登録!AQ198","v":"SBC"},{"$f":"登録!AR198","v":"山中　康寛"},null,"w",4,null,{"$f":"登録!AS198","v":"芝先　泰生"},{"$f":"登録!AT198","v":"WRC"},null,"s"]
[null,{"$f":"登録!AN199","v":198},{"$f":"登録!AQ199","v":"SBC"},{"$f":"登録!AR199","v":"西峰　久祐"},null,81,"w",null,{"$f":"登録!AS199","v":"松房ゆかり"},{"$f":"登録!AT199","v":"WRC"},null,"s"]
[null,{"$f":"登録!AN200","v":199},{"$f":"登録!AQ200","v":"SBC"},{"$f":"登録!AR200","v":"大橋　正寛"},null,"w",87,null,{"$f":"登録!AS200","v":"末岡　修"},{"$f":"登録!AT200","v":"WRC"},null,"s"]
[null,{"$f":"登録!AN201","v":200},{"$f":"登録!AQ201","v":"SBC"},{"$f":"登録!AR201","v":"秋田　倫央"},null,31,"w",null,{"$f":"登録!AS201","v":"和田宗一郎"},{"$f":"登録!AT201","v":"WRC"},null,"s"]
[null,{"$f":"登録!AN202","v":201},{"$f":"登録!AQ202","v":"SBC"},{"$f":"登録!AR202","v":"大橋　洋子"},null,70,"w",null,{"$f":"登録!AS202","v":"杉本　博章"},{"$f":"登録!AT202","v":"WRC"},null,"s"]
[null,{"$f":"登録!AN203","v":202},{"$f":"登録!AQ203","v":"SBC"},{"$f":"登録!AR203","v":"林　秀忠"},null,"w",105,null,{"$f":"登録!AS203","v":"中本　雅大"},{"$f":"登録!AT203","v":"WRC"},null,"s"]
[null,{"$f":"登録!AN204","v":203},{"$f":"登録!AQ204","v":"SBC"},{"$f":"登録!AR204","v":"大橋　義治"},null,"w",53,null,{"$f":"登録!AS204","v":"山中　康介"},{"$f":"登録!AT204","v":"WRC"},null,"s"]
[null,{"$f":"登録!AN205","v":204},{"$f":"登録!AQ205","v":"KRC"},{"$f":"登録!AR205","v":"松好　太一"},null,"w",41,null,{"$f":"登録!AS205","v":"堂園　雅也"},{"$f":"登録!AT205","v":"HRC"},null,"s"]
[null,{"$f":"登録!AN206","v":205},{"$f":"登録!AQ206","v":"KRC"},{"$f":"登録!AR206","v":"清水　義晴"},null,117,"w",null,{"$f":"登録!AS206","v":"宮本　一"},{"$f":"登録!AT206","v":"HRC"},null,"s"]
[null,{"$f":"登録!AN207","v":206},{"$f":"登録!AQ207","v":"KRC"},{"$f":"登録!AR207","v":"鈴木　康文"},null,53,"w",null,{"$f":"登録!AS207","v":"伊藤　登"},{"$f":"登録!AT207","v":"HRC"},null,"s"]
[null,{"$f":"登録!AN208","v":207},{"$f":"登録!AQ208","v":"KRC"},{"$f":"登録!AR208","v":"早川　徹"},null,"w",45,null,{"$f":"登録!AS208","v":"宮井健太郎"},{"$f":"登録!AT208","v":"HRC"},null,"s"]
[null,{"$f":"登録!AN209","v":208},{"$f":"登録!AQ209","v":"KRC"},{"$f":"登録!AR209","v":"井関　一成"},null,99,"w",null,{"$f":"登録!AS209","v":"白澤雄一郎"},{"$f":"登録!AT209","v":"HRC"},null,"s"]
[null,{"$f":"登録!AN210","v":209},{"$f":"登録!AQ210","v":"KRC"},{"$f":"登録!AR210","v":"今村　哲也"},null,87,"w",null,{"$f":"登録!AS210","v":"河地　恵里"},{"$f":"登録!AT210","v":"HRC"},null,"s"]
[null,{"$f":"登録!AN211","v":210},{"$f":"登録!AQ211","v":"KRC"},{"$f":"登録!AR211","v":"森田由佳里"},null,19,"w",128,{"$f":"登録!AS211","v":"鐵山　泰三"},{"$f":"登録!AT211","v":"HRC"},null,"s"]

{"sheet":"★総合結果表★","index":5,"n_rows":21,"n_cols":23,"rows_kept":21,"cut":false,"hidden":false,"merged":[[17,18,18,18],[19,18,20,18],[19,16,20,16],[19,15,20,15],[17,15,18,15],[17,16,18,16],[15,18,16,18],[15,16,16,16],[15,15,16,15],[13,15,14,15],[13,16,14,16],[7,15,8,15],[7,16,8,16],[7,17,8,17],[7,18,8,18],[13,18,14,18],[11,15,12,15],[11,16,12,16],[9,18,10,18],[11,18,12,18],[9,15,10,15],[9,16,10,16],[0,0,1,18],[3,15,3,18],[4,15,4,18],[3,3,3,7],[4,3,4,7],[3,9,3,13],[4,9,4,13],[5,3,5,13],[19,13,20,14],[9,3,10,4],[11,5,12,6],[13,7,14,8],[15,9,16,10],[17,11,18,12]]}
[{"$f":"★個人成績表★!A1","v":"第31回　京阪神和奈滋対抗戦　　　(奈良；玉出エース)"}]
[]
[]
["MVP",null,null,{"$f":"IF(ISERROR(★個人成績表★!AE12),\"\",★個人成績表★!AJ12)","v":"早川　徹(KRC)　9勝1敗"},null,null,null,null,"VP",{"$f":"IF(ISERROR(★個人成績表★!$AD$12),\"\",VLOOKUP(3,★個人成績表★!$AC$15:$AJ$20,8,FALSE))","v":"宮本　一(HRC)　7勝3敗"},null,null,null,null,"VP",{"$f":"IF(ISERROR(★個人成績表★!$AD$12),\"\",VLOOKUP(5,★個人成績表★!$AC$15:$AJ$20,8,FALSE))","v":"山中　康介(WRC)　7勝3敗"}]
["VP",null,null,{"$f":"IF(ISERROR(★個人成績表★!$AD$12),\"\",VLOOKUP(2,★個人成績表★!$AC$15:$AJ$20,8,FALSE))","v":"乾　伸綱(ORC)　8勝2敗"},null,null,null,null,"VP",{"$f":"IF(ISERROR(★個人成績表★!$AD$12),\"\",VLOOKUP(4,★個人成績表★!$AC$15:$AJ$20,8,FALSE))","v":"林　秀忠(SBC)　7勝3敗"},null,null,null,null,"VP",{"$f":"IF(ISERROR(VLOOKUP(6,★個人成績表★!$AC$15:$AJ$20,8,FALSE)),\"\",VLOOKUP(6,★個人成績表★!$AC$15:$AJ$20,8,FALSE))","v":"白戸　恭子(NRC)　6勝4敗"}]
["H　R",null,null,"芝先　泰生(WRC)　A120　、　110"]
[]
[null,null,null,{"$f":"A10","v":"KRC"},null,{"$f":"A12","v":"HRC"},null,{"$f":"A14","v":"SBC"},null,{"$f":"A16","v":"NRC"},null,{"$f":"A18","v":"ORC"},null,{"$f":"A20","v":"WRC"},null,"W","L","TP","RK"]
[null,null,null,"W","L","W","L","W","L","W","L","W","L","W","L"]
[{"$f":"IF(登録!B17=\"\",\"\",登録!B17)","v":"KRC"},null,null,null,null,{"$f":"IF(COUNTBLANK(★個人成績表★!H5:H11)=7,\"\",COUNTIF(★個人成績表★!H5:H11,\"w\"))","v":6},{"$f":"IF(COUNTBLANK(★個人成績表★!H5:H11)=7,\"\",7-COUNTBLANK(★個人成績表★!H5:H11)-COUNTIF(★個人成績表★!H5:H11,\"w\"))","v":1},{"$f":"IF(COUNTBLANK(★個人成績表★!G5:G11)=7,\"\",COUNTIF(★個人成績表★!G5:G11,\"w\"))","v":4},{"$f":"IF(COUNTBLANK(★個人成績表★!G5:G11)=7,\"\",7-COUNTBLANK(★個人成績表★!G5:G11)-COUNTIF(★個人成績表★!G5:G11,\"w\"))","v":3},{"$f":"IF(COUNTBLANK(★個人成績表★!F5:F11)=7,\"\",COUNTIF(★個人成績表★!F5:F11,\"w\"))","v":2},{"$f":"IF(COUNTBLANK(★個人成績表★!F5:F11)=7,\"\",7-COUNTBLANK(★個人成績表★!F5:F11)-COUNTIF(★個人成績表★!F5:F11,\"w\"))","v":5},{"$f":"IF(COUNTBLANK(★個人成績表★!E5:E11)=7,\"\",COUNTIF(★個人成績表★!E5:E11,\"w\"))","v":4},{"$f":"IF(COUNTBLANK(★個人成績表★!E5:E11)=7,\"\",7-COUNTBLANK(★個人成績表★!E5:E11)-COUNTIF(★個人成績表★!E5:E11,\"w\"))","v":3},{"$f":"IF(COUNTBLANK(★個人成績表★!D5:D11)=7,\"\",COUNTIF(★個人成績表★!D5:D11,\"w\"))","v":4},{"$f":"IF(COUNTBLANK(★個人成績表★!D5:D11)=7,\"\",7-COUNTBLANK(★個人成績表★!D5:D11)-COUNTIF(★個人成績表★!D5:D11,\"w\"))","v":3},{"$f":"IF(COUNTBLANK($D10:$O11)=24,\"\",SUM(D10,F10,H10,J10,L10,N10,D11,F11,H11,J11,L11,N11))","v":37},{"$f":"IF(COUNTBLANK($D10:$O11)=24,\"\",SUM(E10,G10,I10,K10,M10,O10,E11,G11,I11,K11,M11,O11))","v":33},{"$f":"IF(ISERROR(★個人成績表★!P12),\"\",\"(\"&★個人成績表★!P12&\")\")","v":"(6448)"},{"$f":"IF(ISERROR(W11),\"\",RANK(W11,$W$10:$W$21))","v":2}]
[null,null,null,null,null,{"$f":"IF(COUNTBLANK(★個人成績表★!M5:M11)=7,\"\",COUNTIF(★個人成績表★!M5:M11,\"w\"))","v":2},{"$f":"IF(COUNTBLANK(★個人成績表★!M5:M11)=7,\"\",7-COUNTBLANK(★個人成績表★!M5:M11)-COUNTIF(★個人成績表★!M5:M11,\"w\"))","v":5},{"$f":"IF(COUNTBLANK(★個人成績表★!L5:L11)=7,\"\",COUNTIF(★個人成績表★!L5:L11,\"w\"))","v":7},{"$f":"IF(COUNTBLANK(★個人成績表★!L5:L11)=7,\"\",7-COUNTBLANK(★個人成績表★!L5:L11)-COUNTIF(★個人成績表★!L5:L11,\"w\"))","v":0},{"$f":"IF(COUNTBLANK(★個人成績表★!K5:K11)=7,\"\",COUNTIF(★個人成績表★!K5:K11,\"w\"))","v":4},{"$f":"IF(COUNTBLANK(★個人成績表★!K5:K11)=7,\"\",7-COUNTBLANK(★個人成績表★!K5:K11)-COUNTIF(★個人成績表★!K5:K11,\"w\"))","v":3},{"$f":"IF(COUNTBLANK(★個人成績表★!J5:J11)=7,\"\",COUNTIF(★個人成績表★!J5:J11,\"w\"))","v":1},{"$f":"IF(COUNTBLANK(★個人成績表★!J5:J11)=7,\"\",7-COUNTBLANK(★個人成績表★!J5:J11)-COUNTIF(★個人成績表★!J5:J11,\"w\"))","v":6},{"$f":"IF(COUNTBLANK(★個人成績表★!I5:I11)=7,\"\",COUNTIF(★個人成績表★!I5:I11,\"w\"))","v":3},{"$f":"IF(COUNTBLANK(★個人成績表★!I5:I11)=7,\"\",7-COUNTBLANK(★個人成績表★!I5:I11)-COUNTIF(★個人成績表★!I5:I11,\"w\"))","v":4},null,null,{"$f":"IF(★個人成績表★!S12=R10,\"\",★個人成績表★!S12)","v":6571},null,null,null,null,{"$f":"P10*100000+★個人成績表★!Q12","v":3706571}]
[{"$f":"IF(登録!B18=\"\",\"\",登録!B18)","v":"HRC"},null,null,{"$f":"IF(COUNTBLANK(★個人成績表★!H14:H20)=7,\"\",COUNTIF(★個人成績表★!H14:H20,\"w\"))","v":1},{"$f":"IF(COUNTBLANK(★個人成績表★!H14:H20)=7,\"\",7-COUNTBLANK(★個人成績表★!H14:H20)-COUNTIF(★個人成績表★!H14:H20,\"w\"))","v":6},null,null,{"$f":"IF(COUNTBLANK(★個人成績表★!E14:E20)=7,\"\",COUNTIF(★個人成績表★!E14:E20,\"w\"))","v":4},{"$f":"IF(COUNTBLANK(★個人成績表★!E14:E20)=7,\"\",7-COUNTBLANK(★個人成績表★!E14:E20)-COUNTIF(★個人成績表★!E14:E20,\"w\"))","v":3},{"$f":"IF(COUNTBLANK(★個人成績表★!G14:G20)=7,\"\",COUNTIF(★個人成績表★!G14:G20,\"w\"))","v":7},{"$f":"IF(COUNTBLANK(★個人成績表★!G14:G20)=7,\"\",7-COUNTBLANK(★個人成績表★!G14:G20)-COUNTIF(★個人成績表★!G14:G20,\"w\"))","v":0},{"$f":"IF(COUNTBLANK(★個人成績表★!D14:D20)=7,\"\",COUNTIF(★個人成績表★!D14:D20,\"w\"))","v":3},{"$f":"IF(COUNTBLANK(★個人成績表★!D14:D20)=7,\"\",7-COUNTBLANK(★個人成績表★!D14:D20)-COUNTIF(★個人成績表★!D14:D20,\"w\"))","v":4},{"$f":"IF(COUNTBLANK(★個人成績表★!F14:F20)=7,\"\",COUNTIF(★個人成績表★!F14:F20,\"w\"))","v":2},{"$f":"IF(COUNTBLANK(★個人成績表★!F14:F20)=7,\"\",7-COUNTBLANK(★個人成績表★!F14:F20)-COUNTIF(★個人成績表★!F14:F20,\"w\"))","v":5},{"$f":"IF(COUNTBLANK($D12:$O13)=24,\"\",SUM(D12,F12,H12,J12,L12,N12,D13,F13,H13,J13,L13,N13))","v":36},{"$f":"IF(COUNTBLANK($D12:$O13)=24,\"\",SUM(E12,G12,I12,K12,M12,O12,E13,G13,I13,K13,M13,O13))","v":34},{"$f":"IF(ISERROR(★個人成績表★!P21),\"\",\"(\"&★個人成績表★!P21&\")\")","v":"(6000)"},{"$f":"IF(ISERROR(W13),\"\",RANK(W13,$W$10:$W$21))","v":4}]
[null,null,null,{"$f":"IF(COUNTBLANK(★個人成績表★!M14:M20)=7,\"\",COUNTIF(★個人成績表★!M14:M20,\"w\"))","v":5},{"$f":"IF(COUNTBLANK(★個人成績表★!M14:M20)=7,\"\",7-COUNTBLANK(★個人成績表★!M14:M20)-COUNTIF(★個人成績表★!M14:M20,\"w\"))","v":2},null,null,{"$f":"IF(COUNTBLANK(★個人成績表★!J14:J20)=7,\"\",COUNTIF(★個人成績表★!J14:J20,\"w\"))","v":2},{"$f":"IF(COUNTBLANK(★個人成績表★!J14:J20)=7,\"\",7-COUNTBLANK(★個人成績表★!J14:J20)-COUNTIF(★個人成績表★!J14:J20,\"w\"))","v":5},{"$f":"IF(COUNTBLANK(★個人成績表★!L14:L20)=7,\"\",COUNTIF(★個人成績表★!L14:L20,\"w\"))","v":6},{"$f":"IF(COUNTBLANK(★個人成績表★!L14:L20)=7,\"\",7-COUNTBLANK(★個人成績表★!L14:L20)-COUNTIF(★個人成績表★!L14:L20,\"w\"))","v":1},{"$f":"IF(COUNTBLANK(★個人成績表★!I14:I20)=7,\"\",COUNTIF(★個人成績表★!I14:I20,\"w\"))","v":2},{"$f":"IF(COUNTBLANK(★個人成績表★!I14:I20)=7,\"\",7-COUNTBLANK(★個人成績表★!I14:I20)-COUNTIF(★個人成績表★!I14:I20,\"w\"))","v":5},{"$f":"IF(COUNTBLANK(★個人成績表★!K14:K20)=7,\"\",COUNTIF(★個人成績表★!K14:K20,\"w\"))","v":4},{"$f":"IF(COUNTBLANK(★個人成績表★!K14:K20)=7,\"\",7-COUNTBLANK(★個人成績表★!K14:K20)-COUNTIF(★個人成績表★!K14:K20,\"w\"))","v":3},null,null,{"$f":"IF(★個人成績表★!S21=R19,\"\",★個人成績表★!S21)","v":6138.6},null,null,null,null,{"$f":"P12*100000+★個人成績表★!Q21","v":3606138.6}]
[{"$f":"IF(登録!B19=\"\",\"\",登録!B19)","v":"SBC"},null,null,{"$f":"IF(COUNTBLANK(★個人成績表★!G23:G29)=7,\"\",COUNTIF(★個人成績表★!G23:G29,\"w\"))","v":3},{"$f":"IF(COUNTBLANK(★個人成績表★!G23:G29)=7,\"\",7-COUNTBLANK(★個人成績表★!G23:G29)-COUNTIF(★個人成績表★!G23:G29,\"w\"))","v":4},{"$f":"IF(COUNTBLANK(★個人成績表★!E23:E29)=7,\"\",COUNTIF(★個人成績表★!E23:E29,\"w\"))","v":3},{"$f":"IF(COUNTBLANK(★個人成績表★!E23:E29)=7,\"\",7-COUNTBLANK(★個人成績表★!E23:E29)-COUNTIF(★個人成績表★!E23:E29,\"w\"))","v":4},null,null,{"$f":"IF(COUNTBLANK(★個人成績表★!D23:D29)=7,\"\",COUNTIF(★個人成績表★!D23:D29,\"w\"))","v":4},{"$f":"IF(COUNTBLANK(★個人成績表★!D23:D29)=7,\"\",7-COUNTBLANK(★個人成績表★!D23:D29)-COUNTIF(★個人成績表★!D23:D29,\"w\"))","v":3},{"$f":"IF(COUNTBLANK(★個人成績表★!F23:F29)=7,\"\",COUNTIF(★個人成績表★!F23:F29,\"w\"))","v":3},{"$f":"IF(COUNTBLANK(★個人成績表★!F23:F29)=7,\"\",7-COUNTBLANK(★個人成績表★!F23:F29)-COUNTIF(★個人成績表★!F23:F29,\"w\"))","v":4},{"$f":"IF(COUNTBLANK(★個人成績表★!H23:H29)=7,\"\",COUNTIF(★個人成績表★!H23:H29,\"w\"))","v":4},{"$f":"IF(COUNTBLANK(★個人成績表★!H23:H29)=7,\"\",7-COUNTBLANK(★個人成績表★!H23:H29)-COUNTIF(★個人成績表★!H23:H29,\"w\"))","v":3},{"$f":"IF(COUNTBLANK($D14:$O15)=24,\"\",SUM(D14,F14,H14,J14,L14,N14,D15,F15,H15,J15,L15,N15))","v":32},{"$f":"IF(COUNTBLANK($D14:$O15)=24,\"\",SUM(E14,G14,I14,K14,M14,O14,E15,G15,I15,K15,M15,O15))","v":38},{"$f":"IF(ISERROR(★個人成績表★!P30),\"\",\"(\"&★個人成績表★!P30&\")\")","v":"(5632)"},{"$f":"IF(ISERROR(W15),\"\",RANK(W15,$W$10:$W$21))","v":5}]
[null,null,null,{"$f":"IF(COUNTBLANK(★個人成績表★!L23:L29)=7,\"\",COUNTIF(★個人成績表★!L23:L29,\"w\"))","v":0},{"$f":"IF(COUNTBLANK(★個人成績表★!L23:L29)=7,\"\",7-COUNTBLANK(★個人成績表★!L23:L29)-COUNTIF(★個人成績表★!L23:L29,\"w\"))","v":7},{"$f":"IF(COUNTBLANK(★個人成績表★!J23:J29)=7,\"\",COUNTIF(★個人成績表★!J23:J29,\"w\"))","v":5},{"$f":"IF(COUNTBLANK(★個人成績表★!J23:J29)=7,\"\",7-COUNTBLANK(★個人成績表★!J23:J29)-COUNTIF(★個人成績表★!J23:J29,\"w\"))","v":2},null,null,{"$f":"IF(COUNTBLANK(★個人成績表★!I23:I29)=7,\"\",COUNTIF(★個人成績表★!I23:I29,\"w\"))","v":4},{"$f":"IF(COUNTBLANK(★個人成績表★!I23:I29)=7,\"\",7-COUNTBLANK(★個人成績表★!I23:I29)-COUNTIF(★個人成績表★!I23:I29,\"w\"))","v":3},{"$f":"IF(COUNTBLANK(★個人成績表★!K23:K29)=7,\"\",COUNTIF(★個人成績表★!K23:K29,\"w\"))","v":2},{"$f":"IF(COUNTBLANK(★個人成績表★!K23:K29)=7,\"\",7-COUNTBLANK(★個人成績表★!K23:K29)-COUNTIF(★個人成績表★!K23:K29,\"w\"))","v":5},{"$f":"IF(COUNTBLANK(★個人成績表★!M23:M29)=7,\"\",COUNTIF(★個人成績表★!M23:M29,\"w\"))","v":4},{"$f":"IF(COUNTBLANK(★個人成績表★!M23:M29)=7,\"\",7-COUNTBLANK(★個人成績表★!M23:M29)-COUNTIF(★個人成績表★!M23:M29,\"w\"))","v":3},null,null,{"$f":"IF(★個人成績表★!S30=R28,\"\",★個人成績表★!S30)","v":5700.4},null,null,null,null,{"$f":"P14*100000+★個人成績表★!Q30","v":3205700.4}]
[{"$f":"IF(登録!B20=\"\",\"\",登録!B20)","v":"NRC"},null,null,{"$f":"IF(COUNTBLANK(★個人成績表★!F32:F38)=7,\"\",COUNTIF(★個人成績表★!F32:F38,\"w\"))","v":5},{"$f":"IF(COUNTBLANK(★個人成績表★!F32:F38)=7,\"\",7-COUNTBLANK(★個人成績表★!F32:F38)-COUNTIF(★個人成績表★!F32:F38,\"w\"))","v":2},{"$f":"IF(COUNTBLANK(★個人成績表★!G32:G38)=7,\"\",COUNTIF(★個人成績表★!G32:G38,\"w\"))","v":0},{"$f":"IF(COUNTBLANK(★個人成績表★!G32:G38)=7,\"\",7-COUNTBLANK(★個人成績表★!G32:G38)-COUNTIF(★個人成績表★!G32:G38,\"w\"))","v":7},{"$f":"IF(COUNTBLANK(★個人成績表★!D32:D38)=7,\"\",COUNTIF(★個人成績表★!D32:D38,\"w\"))","v":3},{"$f":"IF(COUNTBLANK(★個人成績表★!D32:D38)=7,\"\",7-COUNTBLANK(★個人成績表★!D32:D38)-COUNTIF(★個人成績表★!D32:D38,\"w\"))","v":4},null,null,{"$f":"IF(COUNTBLANK(★個人成績表★!H32:H38)=7,\"\",COUNTIF(★個人成績表★!H32:H38,\"w\"))","v":2},{"$f":"IF(COUNTBLANK(★個人成績表★!H32:H38)=7,\"\",7-COUNTBLANK(★個人成績表★!H32:H38)-COUNTIF(★個人成績表★!H32:H38,\"w\"))","v":5},{"$f":"IF(COUNTBLANK(★個人成績表★!E32:E38)=7,\"\",COUNTIF(★個人成績表★!E32:E38,\"w\"))","v":2},{"$f":"IF(COUNTBLANK(★個人成績表★!E32:E38)=7,\"\",7-COUNTBLANK(★個人成績表★!E32:E38)-COUNTIF(★個人成績表★!E32:E38,\"w\"))","v":5},{"$f":"IF(COUNTBLANK($D16:$O17)=24,\"\",SUM(D16,F16,H16,J16,L16,N16,D17,F17,H17,J17,L17,N17))","v":27},{"$f":"IF(COUNTBLANK($D16:$O17)=24,\"\",SUM(E16,G16,I16,K16,M16,O16,E17,G17,I17,K17,M17,O17))","v":43},{"$f":"IF(ISERROR(★個人成績表★!P39),\"\",\"(\"&★個人成績表★!P39&\")\")","v":"(4987)"},{"$f":"IF(ISERROR(W17),\"\",RANK(W17,$W$10:$W$21))","v":6}]
[null,null,null,{"$f":"IF(COUNTBLANK(★個人成績表★!K32:K38)=7,\"\",COUNTIF(★個人成績表★!K32:K38,\"w\"))","v":3},{"$f":"IF(COUNTBLANK(★個人成績表★!K32:K38)=7,\"\",7-COUNTBLANK(★個人成績表★!K32:K38)-COUNTIF(★個人成績表★!K32:K38,\"w\"))","v":4},{"$f":"IF(COUNTBLANK(★個人成績表★!L32:L38)=7,\"\",COUNTIF(★個人成績表★!L32:L38,\"w\"))","v":1},{"$f":"IF(COUNTBLANK(★個人成績表★!L32:L38)=7,\"\",7-COUNTBLANK(★個人成績表★!L32:L38)-COUNTIF(★個人成績表★!L32:L38,\"w\"))","v":6},{"$f":"IF(COUNTBLANK(★個人成績表★!I32:I38)=7,\"\",COUNTIF(★個人成績表★!I32:I38,\"w\"))","v":3},{"$f":"IF(COUNTBLANK(★個人成績表★!I32:I38)=7,\"\",7-COUNTBLANK(★個人成績表★!I32:I38)-COUNTIF(★個人成績表★!I32:I38,\"w\"))","v":4},null,null,{"$f":"IF(COUNTBLANK(★個人成績表★!M32:M38)=7,\"\",COUNTIF(★個人成績表★!M32:M38,\"w\"))","v":3},{"$f":"IF(COUNTBLANK(★個人成績表★!M32:M38)=7,\"\",7-COUNTBLANK(★個人成績表★!M32:M38)-COUNTIF(★個人成績表★!M32:M38,\"w\"))","v":4},{"$f":"IF(COUNTBLANK(★個人成績表★!J32:J38)=7,\"\",COUNTIF(★個人成績表★!J32:J38,\"w\"))","v":5},{"$f":"IF(COUNTBLANK(★個人成績表★!J32:J38)=7,\"\",7-COUNTBLANK(★個人成績表★!J32:J38)-COUNTIF(★個人成績表★!J32:J38,\"w\"))","v":2},null,null,{"$f":"IF(★個人成績表★!S39=R37,\"\",★個人成績表★!S39)","v":5141.2},null,null,null,null,{"$f":"P16*100000+★個人成績表★!Q39","v":2705141.2}]
[{"$f":"IF(登録!B21=\"\",\"\",登録!B21)","v":"ORC"},null,null,{"$f":"IF(COUNTBLANK(★個人成績表★!E41:E47)=7,\"\",COUNTIF(★個人成績表★!E41:E47,\"w\"))","v":3},{"$f":"IF(COUNTBLANK(★個人成績表★!E41:E47)=7,\"\",7-COUNTBLANK(★個人成績表★!E41:E47)-COUNTIF(★個人成績表★!E41:E47,\"w\"))","v":4},{"$f":"IF(COUNTBLANK(★個人成績表★!D41:D47)=7,\"\",COUNTIF(★個人成績表★!D41:D47,\"w\"))","v":4},{"$f":"IF(COUNTBLANK(★個人成績表★!D41:D47)=7,\"\",7-COUNTBLANK(★個人成績表★!D41:D47)-COUNTIF(★個人成績表★!D41:D47,\"w\"))","v":3},{"$f":"IF(COUNTBLANK(★個人成績表★!F41:F47)=7,\"\",COUNTIF(★個人成績表★!F41:F47,\"w\"))","v":4},{"$f":"IF(COUNTBLANK(★個人成績表★!F41:F47)=7,\"\",7-COUNTBLANK(★個人成績表★!F41:F47)-COUNTIF(★個人成績表★!F41:F47,\"w\"))","v":3},{"$f":"IF(COUNTBLANK(★個人成績表★!H41:H47)=7,\"\",COUNTIF(★個人成績表★!H41:H47,\"w\"))","v":5},{"$f":"IF(COUNTBLANK(★個人成績表★!H41:H47)=7,\"\",7-COUNTBLANK(★個人成績表★!H41:H47)-COUNTIF(★個人成績表★!H41:H47,\"w\"))","v":2},null,null,{"$f":"IF(COUNTBLANK(★個人成績表★!G41:G47)=7,\"\",COUNTIF(★個人成績表★!G41:G47,\"w\"))","v":2},{"$f":"IF(COUNTBLANK(★個人成績表★!G41:G47)=7,\"\",7-COUNTBLANK(★個人成績表★!G41:G47)-COUNTIF(★個人成績表★!G41:G47,\"w\"))","v":5},{"$f":"IF(COUNTBLANK($D18:$O19)=24,\"\",SUM(D18,F18,H18,J18,L18,N18,D19,F19,H19,J19,L19,N19))","v":41},{"$f":"IF(COUNTBLANK($D18:$O19)=24,\"\",SUM(E18,G18,I18,K18,M18,O18,E19,G19,I19,K19,M19,O19))","v":29},{"$f":"IF(ISERROR(★個人成績表★!P48),\"\",\"(\"&★個人成績表★!P48&\")\")","v":"(6595)"},{"$f":"IF(ISERROR(W19),\"\",RANK(W19,$W$10:$W$21))","v":1}]
[null,null,null,{"$f":"IF(COUNTBLANK(★個人成績表★!J41:J47)=7,\"\",COUNTIF(★個人成績表★!J41:J47,\"w\"))","v":6},{"$f":"IF(COUNTBLANK(★個人成績表★!J41:J47)=7,\"\",7-COUNTBLANK(★個人成績表★!J41:J47)-COUNTIF(★個人成績表★!J41:J47,\"w\"))","v":1},{"$f":"IF(COUNTBLANK(★個人成績表★!I41:I47)=7,\"\",COUNTIF(★個人成績表★!I41:I47,\"w\"))","v":5},{"$f":"IF(COUNTBLANK(★個人成績表★!I41:I47)=7,\"\",7-COUNTBLANK(★個人成績表★!I41:I47)-COUNTIF(★個人成績表★!I41:I47,\"w\"))","v":2},{"$f":"IF(COUNTBLANK(★個人成績表★!K41:K47)=7,\"\",COUNTIF(★個人成績表★!K41:K47,\"w\"))","v":5},{"$f":"IF(COUNTBLANK(★個人成績表★!K41:K47)=7,\"\",7-COUNTBLANK(★個人成績表★!K41:K47)-COUNTIF(★個人成績表★!K41:K47,\"w\"))","v":2},{"$f":"IF(COUNTBLANK(★個人成績表★!M41:M47)=7,\"\",COUNTIF(★個人成績表★!M41:M47,\"w\"))","v":4},{"$f":"IF(COUNTBLANK(★個人成績表★!M41:M47)=7,\"\",7-COUNTBLANK(★個人成績表★!M41:M47)-COUNTIF(★個人成績表★!M41:M47,\"w\"))","v":3},null,null,{"$f":"IF(COUNTBLANK(★個人成績表★!L41:L47)=7,\"\",COUNTIF(★個人成績表★!L41:L47,\"w\"))","v":3},{"$f":"IF(COUNTBLANK(★個人成績表★!L41:L47)=7,\"\",7-COUNTBLANK(★個人成績表★!L41:L47)-COUNTIF(★個人成績表★!L41:L47,\"w\"))","v":4},null,null,{"$f":"IF(★個人成績表★!S48=R46,\"\",★個人成績表★!S48)","v":6735.8},null,null,null,null,{"$f":"P18*100000+★個人成績表★!Q48","v":4106735.8}]
[{"$f":"IF(登録!B22=\"\",\"\",登録!B22)","v":"WRC"},null,null,{"$f":"IF(COUNTBLANK(★個人成績表★!D50:D56)=7,\"\",COUNTIF(★個人成績表★!D50:D56,\"w\"))","v":3},{"$f":"IF(COUNTBLANK(★個人成績表★!D50:D56)=7,\"\",7-COUNTBLANK(★個人成績表★!D50:D56)-COUNTIF(★個人成績表★!D50:D56,\"w\"))","v":4},{"$f":"IF(COUNTBLANK(★個人成績表★!F50:F56)=7,\"\",COUNTIF(★個人成績表★!F50:F56,\"w\"))","v":5},{"$f":"IF(COUNTBLANK(★個人成績表★!F50:F56)=7,\"\",7-COUNTBLANK(★個人成績表★!F50:F56)-COUNTIF(★個人成績表★!F50:F56,\"w\"))","v":2},{"$f":"IF(COUNTBLANK(★個人成績表★!H50:H56)=7,\"\",COUNTIF(★個人成績表★!H50:H56,\"w\"))","v":3},{"$f":"IF(COUNTBLANK(★個人成績表★!H50:H56)=7,\"\",7-COUNTBLANK(★個人成績表★!H50:H56)-COUNTIF(★個人成績表★!H50:H56,\"w\"))","v":4},{"$f":"IF(COUNTBLANK(★個人成績表★!E50:E56)=7,\"\",COUNTIF(★個人成績表★!E50:E56,\"w\"))","v":5},{"$f":"IF(COUNTBLANK(★個人成績表★!E50:E56)=7,\"\",7-COUNTBLANK(★個人成績表★!E50:E56)-COUNTIF(★個人成績表★!E50:E56,\"w\"))","v":2},{"$f":"IF(COUNTBLANK(★個人成績表★!G50:G56)=7,\"\",COUNTIF(★個人成績表★!G50:G56,\"w\"))","v":5},{"$f":"IF(COUNTBLANK(★個人成績表★!G50:G56)=7,\"\",7-COUNTBLANK(★個人成績表★!G50:G56)-COUNTIF(★個人成績表★!G50:G56,\"w\"))","v":2},null,null,{"$f":"IF(COUNTBLANK($D20:$O21)=24,\"\",SUM(D20,F20,H20,J20,L20,N20,D21,F21,H21,J21,L21,N21))","v":37},{"$f":"IF(COUNTBLANK($D20:$O21)=24,\"\",SUM(E20,G20,I20,K20,M20,O20,E21,G21,I21,K21,M21,O21))","v":33},{"$f":"IF(ISERROR(★個人成績表★!P57),\"\",\"(\"&★個人成績表★!P57&\")\")","v":"(6060)"},{"$f":"IF(W21=\"\",\"\",RANK(W21,$W$10:$W$21))","v":3}]
[null,null,null,{"$f":"IF(COUNTBLANK(★個人成績表★!I50:I56)=7,\"\",COUNTIF(★個人成績表★!I50:I56,\"w\"))","v":4},{"$f":"IF(COUNTBLANK(★個人成績表★!I50:I56)=7,\"\",7-COUNTBLANK(★個人成績表★!I50:I56)-COUNTIF(★個人成績表★!I50:I56,\"w\"))","v":3},{"$f":"IF(COUNTBLANK(★個人成績表★!K50:K56)=7,\"\",COUNTIF(★個人成績表★!K50:K56,\"w\"))","v":3},{"$f":"IF(COUNTBLANK(★個人成績表★!K50:K56)=7,\"\",7-COUNTBLANK(★個人成績表★!K50:K56)-COUNTIF(★個人成績表★!K50:K56,\"w\"))","v":4},{"$f":"IF(COUNTBLANK(★個人成績表★!M50:M56)=7,\"\",COUNTIF(★個人成績表★!M50:M56,\"w\"))","v":3},{"$f":"IF(COUNTBLANK(★個人成績表★!M50:M56)=7,\"\",7-COUNTBLANK(★個人成績表★!M50:M56)-COUNTIF(★個人成績表★!M50:M56,\"w\"))","v":4},{"$f":"IF(COUNTBLANK(★個人成績表★!J50:J56)=7,\"\",COUNTIF(★個人成績表★!J50:J56,\"w\"))","v":2},{"$f":"IF(COUNTBLANK(★個人成績表★!J50:J56)=7,\"\",7-COUNTBLANK(★個人成績表★!J50:J56)-COUNTIF(★個人成績表★!J50:J56,\"w\"))","v":5},{"$f":"IF(COUNTBLANK(★個人成績表★!L50:L56)=7,\"\",COUNTIF(★個人成績表★!L50:L56,\"w\"))","v":4},{"$f":"IF(COUNTBLANK(★個人成績表★!L50:L56)=7,\"\",7-COUNTBLANK(★個人成績表★!L50:L56)-COUNTIF(★個人成績表★!L50:L56,\"w\"))","v":3},null,null,null,null,{"$f":"IF(★個人成績表★!S57=R55,\"\",★個人成績表★!S57)","v":6220.8},null,null,null,null,{"$f":"IF(ISERROR(P20*100000+★個人成績表★!Q57),\"\",P20*100000+★個人成績表★!Q57)","v":3706220.8}]