{"text_format":"1","workbook":"xlsx","n_sheets":6,"sheets":["登録","対戦カード","★個人成績表★","★対戦リーグ表★","結果入力表","★総合結果表★"],"not_rendered":{"charts":0,"images":3,"macros":1,"external_links":0,"defined_names":7,"comments":0,"pivot_tables":0},"unopened":[],"bounds":{"document_bytes":16777216,"sheet_cells":100000,"rows_first":2000,"rows_last":500,"rows_between":2000,"halvings":0,"cell_chars":16384,"cell_head_chars":4096},"cells_cut":0,"cells_raw":0,"read":"whole","date_system":"1900"}

{"sheet":"登録","index":0,"n_rows":211,"n_cols":70,"rows_kept":211,"cut":false,"hidden":false,"merged":[[18,1,18,2],[17,3,17,4],[18,3,18,4],[17,1,17,2],[16,6,16,7],[18,6,18,7],[16,18,16,19],[16,21,16,22],[4,4,4,6],[4,8,4,9],[17,18,17,19],[17,21,17,22],[16,15,16,16],[7,10,7,13],[8,10,8,13],[9,10,9,13],[10,10,10,13],[16,12,16,13],[16,9,16,10],[17,6,17,7],[18,9,18,10],[18,15,18,16],[17,15,17,16],[18,18,18,19],[18,21,18,22],[17,9,17,10],[21,18,21,19],[21,21,21,22],[20,15,20,16],[0,8,0,11],[19,1,19,2],[19,3,19,4],[19,6,19,7],[19,9,19,10],[16,1,16,2],[2,4,2,7],[14,1,15,2],[16,3,16,4],[11,10,11,13],[21,12,21,13],[20,12,20,13],[18,12,18,13],[21,1,21,2],[21,3,21,4],[21,6,21,7],[21,9,21,10],[21,15,21,16],[20,18,20,19],[20,21,20,22],[20,1,20,2],[20,3,20,4],[20,6,20,7],[20,9,20,10],[19,18,19,19],[19,21,19,22],[17,12,17,13],[19,12,19,13],[19,15,19,16]]}
["対抗戦名称",null,null,null,"第",31,"回",null,"京阪神和奈滋",null,null,null,"対抗戦",null,null,null,null,null,null,null,null,null,null,null,null,null,null,null,null,null,"選手ID","チーム","選手名","持点",null,null,null,null,null,"G-No",{"$f":"Q5","v":6},"クラブ",null,null,null,null,null,null,null,null,null,null,null,null,"対戦順クラブID",null,null,null,null,null,"対抗戦順クラブ名"]
[null,null,null,null,null,null,null,null,null,null,null,null,null,null,null,null,null,null,null,null,null,null,null,null,null,null,null,null,null,null,11,{"$f":"B$17","v":"KRC"},{"$f":"D17","v":"松好　太一"},{"$f":"F17","v":120},1,"第1節",null,null,null,1,3,1,{"$f":"VLOOKUP(AO2,$AZ$3:$BA$8,2,FALSE)","v":"SBC"},{"$f":"VLOOKUP(VALUE(AO2&AP2),$AE$2:$AG$55,3,FALSE)","v":"林　秀忠"},{"$f":"VLOOKUP(VALUE(AU2&AV2),$AE$2:$AG$55,3,FALSE)","v":"吉向　翔平"},{"$f":"VLOOKUP(AU2,$AZ$3:$BA$8,2,FALSE)","v":"NRC"},4,1,null,null,null,"クラブID","クラブ名",null,"6クラブ",null,null,null,null,null,"6クラブ",null,null,null,null,null,"5クラブ"]
["開催日",null,null,null,"2019-01-13",null,null,null,null,null,null,null,null,null,null,null,null,null,null,null,null,null,null,null,null,null,null,null,null,null,12,"KRC",{"$f":"G17","v":"清水　義晴"},{"$f":"I17","v":120},2,null,null,null,null,2,{"$f":"AO2","v":3},2,"SBC","大橋　義治","岩本　剛",{"$f":"VLOOKUP(AU3,$AZ$3:$BA$8,2,FALSE)","v":"NRC"},{"$f":"AU2","v":4},2,null,null,null,1,{"$f":"B17","v":"KRC"},null,6,5,4,3,2,null,{"$f":"IF(VLOOKUP(BC3,$AZ$3:$BA$8,2,TRUE)=0,\"\",VLOOKUP(BC3,$AZ$3:$BA$8,2,TRUE))","v":"WRC"},"ORC","NRC","SBC","HRC",null,{"$f":"BJ3","v":"ORC"},{"$f":"BK3","v":"NRC"},{"$f":"BL3","v":"SBC"},{"$f":"BM3","v":"HRC"}]
[null,null,null,null,null,null,null,null,null,null,null,null,null,null,null,null,null,null,null,null,null,null,null,null,null,null,null,null,null,null,13,"KRC",{"$f":"J17","v":"鈴木　康文"},{"$f":"L17","v":120},3,null,null,null,null,3,3,3,"SBC","山中　康寛","白戸　玲人","NRC",4,3,null,null,null,2,"HRC",null,5,3,6,4,1,null,"ORC","SBC","WRC","NRC","KRC",null,{"$f":"BI4","v":"ORC"},{"$f":"BJ4","v":"SBC"},{"$f":"BL4","v":"NRC"},{"$f":"BM4","v":"KRC"}]
["会場",null,null,null,"玉出エース",null,null,"（","奈良",null,"）",null,null,null,null,null,{"$f":"COUNTA(D17:E22)","v":6},"クラブ",null,{"$f":"COUNTA(D17,G17,J17,M17,P17,S17,V17,Y17)","v":7},"名対抗",null,null,null,null,null,null,null,null,null,14,"KRC",{"$f":"M17","v":"早川　徹"},{"$f":"O17","v":120},4,null,null,null,null,4,3,4,"SBC","西峰　久祐","植田　慎也","NRC",4,4,null,null,null,3,"SBC",null,4,2,5,1,6,null,"NRC","HRC","ORC","KRC","WRC",null,{"$f":"BI5","v":"NRC"},{"$f":"BJ5","v":"HRC"},{"$f":"BK5","v":"ORC"},{"$f":"BL5","v":"KRC"}]
[null,null,null,null,null,null,null,null,null,null,null,null,null,null,null,null,null,null,null,null,null,null,null,null,null,null,null,null,null,null,15,"KRC",{"$f":"P17","v":"井関　一成"},{"$f":"R17","v":120},5,null,null,null,null,5,3,5,"SBC","大橋　正寛","近藤　拓馬","NRC",4,5,null,null,null,4,"NRC",null,3,6,1,2,5,null,"SBC","WRC","KRC","HRC","ORC",null,{"$f":"BI6","v":"SBC"},{"$f":"BK6","v":"KRC"},{"$f":"BL6","v":"HRC"},{"$f":"BM6","v":"ORC"}]
["【持点の設定】",null,null,null,"C","：","クラス",null,"点数",null,"備考",null,null,null,null,null,null,null,null,null,null,null,null,null,null,null,null,null,null,null,16,"KRC",{"$f":"S17","v":"今村　哲也"},{"$f":"U17","v":120},6,null,null,null,null,6,3,6,"SBC","秋田　倫央","長谷川　進","NRC",4,6,null,null,null,5,"ORC",null,2,1,3,6,4,null,"HRC","KRC","SBC","WRC","NRC",null,{"$f":"BI7","v":"HRC"},{"$f":"BJ7","v":"KRC"},{"$f":"BK7","v":"SBC"},{"$f":"BM7","v":"NRC"}]
[null,null,null,null,"M","：","男性",null,120,"点",null,null,null,null,null,null,null,null,null,null,null,null,null,null,null,null,null,null,null,null,17,"KRC",{"$f":"V17","v":"森田由佳里"},{"$f":"X17","v":100},7,null,null,null,null,7,3,7,"SBC","大橋　洋子","白戸　恭子","NRC",4,7,null,null,null,6,"WRC",null,1,4,2,5,3,null,"KRC","NRC","HRC","ORC","SBC"]
{"$rows_left_out":204}
{"sheet":"対戦カード","index":1,"n_rows":310,"n_cols":64,"rows_kept":310,"cut":false,"hidden":false,"merged":[]}
[null,null,null,null,null,null,null,null,null," ",{"$f":"★個人成績表★!$A$1","v":"第31回　京阪神和奈滋対抗戦　　　(奈良；玉出エース)"}]
[]
[null,"印刷範囲の設定",null,null,null,null,null,null,null,null,"G-No",null,null,null,"T-No"]
[]
[null,null,null,null,null,null,null,null,null,null,null,null,null,"所属"]
[null,null,null,null,null,null,null,null,null,null,null,null,null,"氏名"]
[null,null,null,null,null,null,null,null,null,null,null,null,null,"得点"]
[null,null,null,null,null,null,null,null,null,null,null,null,null,"HR"]
{"$rows_left_out":303}
{"sheet":"★個人成績表★","index":2,"n_rows":59,"n_cols":36,"rows_kept":59,"cut":false,"hidden":false,"merged":[[48,0,56,0],[39,0,47,0],[3,0,11,0],[12,0,20,0],[21,0,29,0],[30,0,38,0]]}
[{"$f":"登録!E1&登録!F1&登録!G1&\"　\"&登録!I1&登録!M1&\"　　　\"&\"(\"&登録!I5&\"；\"&登録!E5&\")\"","v":"第31回　京阪神和奈滋対抗戦　　　(奈良；玉出エース)"}]
[]
[null,null,null,"1st　Section",null,null,null,null,"2nd　Section",null,null,null,null,"RESULT",null,null,null,null,null,"R","MAX",null,null,"途中経過"]
[{"$f":"IF(登録!B17=\"\",\"\",登録!B17)","v":"KRC"},"Player＼VS","持点",{"$f":"登録!BI3","v":"WRC"},{"$f":"登録!BJ3","v":"ORC"},{"$f":"登録!BK3","v":"NRC"},{"$f":"登録!BL3","v":"SBC"},{"$f":"登録!BM3","v":"HRC"},{"$f":"D4","v":"WRC"},{"$f":"E4","v":"ORC"},{"$f":"F4","v":"NRC"},{"$f":"G4","v":"SBC"},{"$f":"H4","v":"HRC"},"W","L","TP","(TP)","TP",null,"K","HR",null,"Player","W","L","TP","R_P"]
[null,{"$f":"IF(登録!AG2=0,\"\",登録!AG2)","v":"松好　太一"},{"$f":"登録!F17","v":120},{"$f":"IF(結果入力表!F16=\"\",\"\",結果入力表!F16)","v":"w"},{"$f":"IF(結果入力表!F37=\"\",\"\",結果入力表!F37)","v":105},{"$f":"IF(結果入力表!F58=\"\",\"\",結果入力表!F58)","v":83},{"$f":"IF(結果入力表!F79=\"\",\"\",結果入力表!F79)","v":83},{"$f":"IF(結果入力表!F100=\"\",\"\",結果入力表!F100)","v":"w"},{"$f":"IF(結果入力表!F121=\"\",\"\",結果入力表!F121)","v":97},{"$f":"IF(結果入力表!F142=\"\",\"\",結果入力表!F142)","v":57},{"$f":"IF(結果入力表!F163=\"\",\"\",結果入力表!F163)","v":"w"},{"$f":"IF(結果入力表!F184=\"\",\"\",結果入力表!F184)","v":"w"},{"$f":"IF(結果入力表!F205=\"\",\"\",結果入力表!F205)","v":"w"},{"$f":"IF(COUNTBLANK(D5:M5)=10,\"\",COUNTIF(D5:M5,\"w\"))","v":5},{"$f":"IF(COUNTBLANK(D5:M5)=10,\"\",10-COUNTBLANK(D5:M5)-N5)","v":5},{"$f":"IF(N5=\"\",\"\",N5*C5+SUM(D5:M5))","v":1025},{"$f":"IF(N5=\"\",\"\",IF(C5=登録!$I$8,P5,N5*登録!$I$8+SUM(D5:M5)/★個人成績表★!C5*登録!$I$8))","v":1025},{"$f":"IF(P5=Q5,\"\",\"*\")","v":""},{"$f":"IF(COUNTBLANK(D5:M5)=10,\"\",Q5)","v":1025},{"$f":"IF(COUNTBLANK(D5:M5)=10,\"\",RANK(AA5,$AA5:$AA11))","v":3},{"$f":"IF(★対戦リーグ表★!BS6=0,\"\",★対戦リーグ表★!BS6)","v":""},null,{"$f":"B5","v":"松好　太一"},{"$f":"N5","v":5},{"$f":"O5","v":5},{"$f":"Q5","v":1025},{"$f":"X5*1000000+Z5","v":5001025}]
[null,{"$f":"IF(登録!AG3=0,\"\",登録!AG3)","v":"清水　義晴"},{"$f":"登録!I17","v":120},{"$f":"IF(結果入力表!F17=\"\",\"\",結果入力表!F17)","v":"w"},{"$f":"IF(結果入力表!F38=\"\",\"\",結果入力表!F38)","v":"w"},{"$f":"IF(結果入力表!F59=\"\",\"\",結果入力表!F59)","v":58},{"$f":"IF(結果入力表!F80=\"\",\"\",結果入力表!F80)","v":22},{"$f":"IF(結果入力表!F101=\"\",\"\",結果入力表!F101)","v":"w"},{"$f":"IF(結果入力表!F122=\"\",\"\",結果入力表!F122)","v":5},{"$f":"IF(結果入力表!F143=\"\",\"\",結果入力表!F143)","v":108},{"$f":"IF(結果入力表!F164=\"\",\"\",結果入力表!F164)","v":"w"},{"$f":"IF(結果入力表!F185=\"\",\"\",結果入力表!F185)","v":"w"},{"$f":"IF(結果入力表!F206=\"\",\"\",結果入力表!F206)","v":117},{"$f":"IF(COUNTBLANK(D6:M6)=10,\"\",COUNTIF(D6:M6,\"w\"))","v":5},{"$f":"IF(COUNTBLANK(D6:M6)=10,\"\",10-COUNTBLANK(D6:M6)-N6)","v":5},{"$f":"IF(N6=\"\",\"\",N6*C6+SUM(D6:M6))","v":910},{"$f":"IF(N6=\"\",\"\",IF(C6=登録!$I$8,P6,N6*登録!$I$8+SUM(D6:M6)/★個人成績表★!C6*登録!$I$8))","v":910},{"$f":"IF(P6=Q6,\"\",\"*\")","v":""},{"$f":"IF(COUNTBLANK(D6:M6)=10,\"\",Q6)","v":910},{"$f":"IF(COUNTBLANK(D6:M6)=10,\"\",RANK(AA6,$AA5:$AA11))","v":4},{"$f":"IF(★対戦リーグ表★!BS7=0,\"\",★対戦リーグ表★!BS7)","v":""},null,{"$f":"B6","v":"清水　義晴"},{"$f":"N6","v":5},{"$f":"O6","v":5},{"$f":"Q6","v":910},{"$f":"X6*1000000+Z6","v":5000910}]
[null,{"$f":"IF(登録!AG4=0,\"\",登録!AG4)","v":"鈴木　康文"},{"$f":"登録!L17","v":120},{"$f":"IF(結果入力表!F18=\"\",\"\",結果入力表!F18)","v":"w"},{"$f":"IF(結果入力表!F39=\"\",\"\",結果入力表!F39)","v":"w"},{"$f":"IF(結果入力表!F60=\"\",\"\",結果入力表!F60)","v":"w"},{"$f":"IF(結果入力表!F81=\"\",\"\",結果入力表!F81)","v":"w"},{"$f":"IF(結果入力表!F102=\"\",\"\",結果入力表!F102)","v":2},{"$f":"IF(結果入力表!F123=\"\",\"\",結果入力表!F123)","v":"w"},{"$f":"IF(結果入力表!F144=\"\",\"\",結果入力表!F144)","v":"w"},{"$f":"IF(結果入力表!F165=\"\",\"\",結果入力表!F165)","v":119},{"$f":"IF(結果入力表!F186=\"\",\"\",結果入力表!F186)","v":"w"},{"$f":"IF(結果入力表!F207=\"\",\"\",結果入力表!F207)","v":53},7,3,1014,{"$f":"IF(N7=\"\",\"\",IF(C7=登録!$I$8,P7,N7*登録!$I$8+SUM(D7:M7)/★個人成績表★!C7*登録!$I$8))","v":1014},"",1014,{"$f":"IF(COUNTBLANK(D7:M7)=10,\"\",RANK(AA7,$AA5:$AA11))","v":2},{"$f":"IF(★対戦リーグ表★!BS8=0,\"\",★対戦リーグ表★!BS8)","v":107},null,"鈴木　康文",7,3,1014,7001014]
[null,{"$f":"IF(登録!AG5=0,\"\",登録!AG5)","v":"早川　徹"},{"$f":"登録!O17","v":120},{"$f":"IF(結果入力表!F19=\"\",\"\",結果入力表!F19)","v":"w"},{"$f":"IF(結果入力表!F40=\"\",\"\",結果入力表!F40)","v":"w"},{"$f":"IF(結果入力表!F61=\"\",\"\",結果入力表!F61)","v":"w"},{"$f":"IF(結果入力表!F82=\"\",\"\",結果入力表!F82)","v":"w"},{"$f":"IF(結果入力表!F103=\"\",\"\",結果入力表!F103)","v":"w"},{"$f":"IF(結果入力表!F124=\"\",\"\",結果入力表!F124)","v":"w"},{"$f":"IF(結果入力表!F145=\"\",\"\",結果入力表!F145)","v":38},{"$f":"IF(結果入力表!F166=\"\",\"\",結果入力表!F166)","v":"w"},{"$f":"IF(結果入力表!F187=\"\",\"\",結果入力表!F187)","v":"w"},{"$f":"IF(結果入力表!F208=\"\",\"\",結果入力表!F208)","v":"w"},9,1,1118,{"$f":"IF(N8=\"\",\"\",IF(C8=登録!$I$8,P8,N8*登録!$I$8+SUM(D8:M8)/★個人成績表★!C8*登録!$I$8))","v":1118},"",1118,{"$f":"IF(COUNTBLANK(D8:M8)=10,\"\",RANK(AA8,$AA5:$AA11))","v":1},{"$f":"IF(★対戦リーグ表★!BS9=0,\"\",★対戦リーグ表★!BS9)","v":""},null,"早川　徹",9,1,1118,9001118]
{"$rows_left_out":52}
{"sheet":"★対戦リーグ表★","index":3,"n_rows":59,"n_cols":71,"rows_kept":59,"cut":false,"hidden":false,"merged":[[1,19,1,21],[1,43,1,45]]}
[null,{"$f":"★個人成績表★!A1&\"  (1/2)\"","v":"第31回　京阪神和奈滋対抗戦　　　(奈良；玉出エース)  (1/2)"},null,null,null,null,null,null,null,null,null,null,null,null,null,null,null,null,null,null,null,null,null,null,null,{"$f":"★個人成績表★!A1&\"  (2/2)\"","v":"第31回　京阪神和奈滋対抗戦　　　(奈良；玉出エース)  (2/2)"},null,null,null,null,null,null,null,null,null,null,null,null,null,null,null,null,null,null,null,null,null,null,null,"HR"]
[null,null,null,null,null,null,null,null,null,null,null,null,null,null,null,null,null,null,null,{"$f":"登録!E3","v":"2019-01-13"},null,null,null,null,null,null,null,null,null,null,null,null,null,null,null,null,null,null,null,null,null,null,null,{"$f":"登録!E3","v":"2019-01-13"},null,null,null,null,null,1,null,{"$f":"VLOOKUP(AX2,$AX$6:$BP$59,3,FALSE)","v":"芝先　泰生"},{"$f":"VLOOKUP(AX2,$AX$6:$BP$59,4,FALSE)","v":"WRC"},{"$f":"VLOOKUP(AX2,$AX$6:$BP$59,15,FALSE)","v":"A120"}]
[null,"1st","Section",null,null,null,null,null,null,null,null,null,null,null,null,null,null,null,null,null,null,null,null,null,null,"2nd","Section",null,null,null,null,null,null,null,null,null,null,null,null,null,null,null,null,null,null,null,null,null,null,null,null,null,null,null,null,null,null,null,null,null,null,null,null,null,null,null,null,null,null,null,"max"]
[]
[null,1,"Player","handy",{"$f":"B6","v":"KRC"},{"$f":"B7","v":"HRC"},{"$f":"B8","v":"SBC"},{"$f":"B9","v":"NRC"},{"$f":"B10","v":"ORC"},{"$f":"B11","v":"WRC"},"W","L","TP","(TP)","TP",null,"R_P","R","HR",null,null,null,null,null,null,1,"Player","handy",{"$f":"$B$6","v":"KRC"},{"$f":"$B$7","v":"HRC"},{"$f":"$B$8","v":"SBC"},{"$f":"$B$9","v":"NRC"},{"$f":"$B$10","v":"ORC"},{"$f":"$B$11","v":"WRC"},"W","L","TP","(TP)","TP",null,"R_P","R","HR",null,null,null,null,null,null,"R",null,null,null,"1G","2G","3G","4G","5G","6G","7G","8G","9G","10G","max","A","B","Ｎ","HR_PT"]
[1,{"$f":"IF(登録!$AF17=\"\",\"\",登録!$B17)","v":"KRC"},{"$f":"VLOOKUP(VALUE(A6&B5),登録!$AE$2:$AH$55,3,FALSE)","v":"松好　太一"},{"$f":"VLOOKUP(VALUE(A6&B5),登録!$AE$2:$AH$55,4,FALSE)","v":120},null,{"$f":"★個人成績表★!H5","v":"w"},{"$f":"★個人成績表★!G5","v":83},{"$f":"★個人成績表★!F5","v":83},{"$f":"★個人成績表★!E5","v":105},{"$f":"★個人成績表★!D5","v":"w"},{"$f":"IF(COUNTBLANK(E6:J6)=6,\"\",COUNTIF(E6:J6,\"w\"))","v":2},{"$f":"IF(COUNTBLANK(E6:J6)=6,\"\",6-COUNTBLANK(E6:J6)-K6)","v":3},{"$f":"K6*D6+SUM(E6:J6)","v":511},{"$f":"M6*登録!$I$8/★対戦リーグ表★!D6","v":511},{"$f":"IF(ISERROR(N6),\"\",IF(M6=N6,\"\",\"*\"))","v":""},{"$f":"IF(COUNTBLANK(E6:J6)=6,\"\",N6)","v":511},{"$f":"K6*100000+N6","v":200511},{"$f":"IF(COUNTBLANK(E6:J6)=6,\"\",RANK(Q6,Q6:Q11))","v":4},null,{"$f":"IF(結果入力表!E100=\"\",\"\",結果入力表!E100)","v":""},{"$f":"IF(結果入力表!E79=\"\",\"\",結果入力表!E79)","v":""},{"$f":"IF(結果入力表!E58=\"\",\"\",結果入力表!E58)","v":""},{"$f":"IF(結果入力表!E37=\"\",\"\",結果入力表!E37)","v":""},{"$f":"IF(結果入力表!E16=\"\",\"\",結果入力表!E16)","v":""},11,{"$f":"IF(登録!$AF17=\"\",\"\",登録!$B17)","v":"KRC"},{"$f":"VLOOKUP(Y6,登録!$AE$2:$AH$55,3,FALSE)","v":"松好　太一"},{"$f":"VLOOKUP(Y6,登録!$AE$2:$AH$55,4,FALSE)","v":120},null,{"$f":"★個人成績表★!M5","v":"w"},{"$f":"★個人成績表★!L5","v":"w"},{"$f":"★個人成績表★!K5","v":"w"},{"$f":"★個人成績表★!J5","v":57},{"$f":"★個人成績表★!I5","v":97},{"$f":"IF(COUNTBLANK(AC6:AH6)=6,\"\",COUNTIF(AC6:AH6,\"w\"))","v":3},{"$f":"IF(COUNTBLANK(AC6:AH6)=6,\"\",6-COUNTBLANK(AC6:AH6)-AI6)","v":2},{"$f":"AI6*AB6+SUM(AC6:AH6)","v":514},{"$f":"AK6*登録!$I$8/★対戦リーグ表★!AB6","v":514},{"$f":"IF(ISERROR(AL6),\"\",IF(AK6=AL6,\"\",\"*\"))","v":""},{"$f":"IF(COUNTBLANK(AC6:AH6)=6,\"\",AL6)","v":514},{"$f":"AI6*100000+AL6","v":300514},{"$f":"IF(COUNTBLANK(AC6:AH6)=6,\"\",RANK(AO6,AO6:AO11))","v":3},null,{"$f":"IF(結果入力表!E205=\"\",\"\",結果入力表!E205)","v":""},{"$f":"IF(結果入力表!E184=\"\",\"\",結果入力表!E184)","v":""},{"$f":"IF(結果入力表!E163=\"\",\"\",結果入力表!E163)","v":""},{"$f":"IF(結果入力表!E142=\"\",\"\",結果入力表!E142)","v":""},{"$f":"IF(結果入力表!E121=\"\",\"\",結果入力表!E121)","v":""},null,{"$f":"RANK(BP6,$BP$6:$BP$59)","v":16},null,{"$f":"C6","v":"松好　太一"},{"$f":"B6","v":"KRC"},{"$f":"IF(LEFT(T6,1)=\"A\",\"A\",IF(LEFT(T6,1)=\"B\",\"B\",T6))","v":""},{"$f":"IF(LEFT(U6,1)=\"A\",\"A\",IF(LEFT(U6,1)=\"B\",\"B\",U6))","v":""},{"$f":"IF(LEFT(V6,1)=\"A\",\"A\",IF(LEFT(V6,1)=\"B\",\"B\",V6))","v":""},{"$f":"IF(LEFT(W6,1)=\"A\",\"A\",IF(LEFT(W6,1)=\"B\",\"B\",W6))","v":""},{"$f":"IF(LEFT(X6,1)=\"A\",\"A\",IF(LEFT(X6,1)=\"B\",\"B\",X6))","v":""},{"$f":"IF(LEFT(AR6,1)=\"A\",\"A\",IF(LEFT(AR6,1)=\"B\",\"B\",AR6))","v":""},{"$f":"IF(LEFT(AS6,1)=\"A\",\"A\",IF(LEFT(AS6,1)=\"B\",\"B\",AS6))","v":""},{"$f":"IF(LEFT(AT6,1)=\"A\",\"A\",IF(LEFT(AT6,1)=\"B\",\"B\",AT6))","v":""},{"$f":"IF(LEFT(AU6,1)=\"A\",\"A\",IF(LEFT(AU6,1)=\"B\",\"B\",AU6))","v":""},{"$f":"IF(LEFT(AV6,1)=\"A\",\"A\",IF(LEFT(AV6,1)=\"B\",\"B\",AV6))","v":""},{"$f":"IF(BM6>0,\"A\"&登録!$I$8,IF(BN6>0,\"B\"&登録!$I$8,BO6))","v":0},{"$f":"COUNTIF($BB6:$BK6,BM$5)","v":0},0,{"$f":"MAX(BB6:BK6)","v":0},{"$f":"BM6*10000+BN6*1000+BO6","v":0},null,{"$f":"★個人成績表★!B5","v":"松好　太一"},{"$f":"VLOOKUP(BR6,$AZ$6:$BL$59,13,FALSE)","v":0}]
[2,{"$f":"IF(登録!$B18=\"\",\"\",登録!$B18)","v":"HRC"},{"$f":"VLOOKUP(VALUE(A7&B5),登録!$AE$2:$AH$55,3,FALSE)","v":"鐵山　泰三"},{"$f":"VLOOKUP(VALUE(A7&B5),登録!$AE$2:$AH$55,4,FALSE)","v":120},{"$f":"★個人成績表★!H14","v":100},null,{"$f":"★個人成績表★!E14","v":"w"},{"$f":"★個人成績表★!G14","v":"w"},{"$f":"★個人成績表★!D14","v":"w"},{"$f":"★個人成績表★!F14","v":13},3,2,473,{"$f":"M7*登録!$I$8/★対戦リーグ表★!D7","v":473},"",473,{"$f":"K7*100000+N7","v":300473},{"$f":"IF(COUNTBLANK(E7:J7)=6,\"\",RANK(Q7,Q6:Q11))","v":3},{"$f":"IF(結果入力表!H100=\"\",\"\",結果入力表!H100)","v":""},null,{"$f":"IF(結果入力表!E23=\"\",\"\",結果入力表!E23)","v":""},{"$f":"IF(結果入力表!H72=\"\",\"\",結果入力表!H72)","v":""},{"$f":"IF(結果入力表!E9=\"\",\"\",結果入力表!E9)","v":""},{"$f":"IF(結果入力表!H44=\"\",\"\",結果入力表!H44)","v":""},22,{"$f":"IF(登録!$B18=\"\",\"\",登録!$B18)","v":"HRC"},{"$f":"VLOOKUP(Y7,登録!$AE$2:$AH$55,3,FALSE)","v":"堂園　雅也"},{"$f":"VLOOKUP(Y7,登録!$AE$2:$AH$55,4,FALSE)","v":120},{"$f":"★個人成績表★!M15","v":41},null,{"$f":"★個人成績表★!J15","v":"w"},{"$f":"★個人成績表★!L15","v":"w"},{"$f":"★個人成績表★!I15","v":114},{"$f":"★個人成績表★!K15","v":"w"},3,2,515,{"$f":"AK7*登録!$I$8/★対戦リーグ表★!AB7","v":515},"",515,{"$f":"AI7*100000+AL7","v":300515},{"$f":"IF(COUNTBLANK(AC7:AH7)=6,\"\",RANK(AO7,AO6:AO11))","v":2},{"$f":"IF(結果入力表!H205=\"\",\"\",結果入力表!H205)","v":""},null,{"$f":"IF(結果入力表!E128=\"\",\"\",結果入力表!E128)","v":104},{"$f":"IF(結果入力表!H177=\"\",\"\",結果入力表!H177)","v":""},{"$f":"IF(結果入力表!E114=\"\",\"\",結果入力表!E114)","v":""},{"$f":"IF(結果入力表!H149=\"\",\"\",結果入力表!H149)","v":""},null,6,null,"鐵山　泰三","HRC",{"$f":"IF(LEFT(S7,1)=\"A\",\"A\",IF(LEFT(S7,1)=\"B\",\"B\",S7))","v":""},{"$f":"IF(LEFT(U7,1)=\"A\",\"A\",IF(LEFT(U7,1)=\"B\",\"B\",U7))","v":""},{"$f":"IF(LEFT(V7,1)=\"A\",\"A\",IF(LEFT(V7,1)=\"B\",\"B\",V7))","v":""},{"$f":"IF(LEFT(W7,1)=\"A\",\"A\",IF(LEFT(W7,1)=\"B\",\"B\",W7))","v":""},{"$f":"IF(LEFT(X7,1)=\"A\",\"A\",IF(LEFT(X7,1)=\"B\",\"B\",X7))","v":""},{"$f":"IF(LEFT(AQ55,1)=\"A\",\"A\",IF(LEFT(AQ55,1)=\"B\",\"B\",AQ55))","v":128},{"$f":"IF(LEFT(AS55,1)=\"A\",\"A\",IF(LEFT(AS55,1)=\"B\",\"B\",AS55))","v":""},{"$f":"IF(LEFT(AT55,1)=\"A\",\"A\",IF(LEFT(AT55,1)=\"B\",\"B\",AT55))","v":""},{"$f":"IF(LEFT(AU55,1)=\"A\",\"A\",IF(LEFT(AU55,1)=\"B\",\"B\",AU55))","v":""},{"$f":"IF(LEFT(AV55,1)=\"A\",\"A\",IF(LEFT(AV55,1)=\"B\",\"B\",AV55))","v":""},{"$f":"IF(BM7>0,\"A\"&登録!$I$8,IF(BN7>0,\"B\"&登録!$I$8,BO7))","v":128},0,0,128,128,null,{"$f":"★個人成績表★!B6","v":"清水　義晴"},0]
[3,{"$f":"IF(登録!$B19=\"\",\"\",登録!$B19)","v":"SBC"},{"$f":"VLOOKUP(VALUE(A8&B5),登録!$AE$2:$AH$55,3,FALSE)","v":"林　秀忠"},{"$f":"VLOOKUP(VALUE(A8&B5),登録!$AE$2:$AH$55,4,FALSE)","v":120},{"$f":"★個人成績表★!G23","v":"w"},{"$f":"★個人成績表★!E23","v":31},null,{"$f":"★個人成績表★!D23","v":"w"},{"$f":"★個人成績表★!F23","v":"w"},{"$f":"★個人成績表★!H23","v":"w"},4,1,511,{"$f":"M8*登録!$I$8/★対戦リーグ表★!D8","v":511},"",511,{"$f":"K8*100000+N8","v":400511},{"$f":"IF(COUNTBLANK(E8:J8)=6,\"\",RANK(Q8,Q6:Q11))","v":1},{"$f":"IF(結果入力表!H79=\"\",\"\",結果入力表!H79)","v":""},{"$f":"IF(結果入力表!H23=\"\",\"\",結果入力表!H23)","v":""},null,{"$f":"IF(結果入力表!E2=\"\",\"\",結果入力表!E2)","v":""},{"$f":"IF(結果入力表!H51=\"\",\"\",結果入力表!H51)","v":"A120"},{"$f":"IF(結果入力表!E93=\"\",\"\",結果入力表!E93)","v":""},33,{"$f":"IF(登録!$B19=\"\",\"\",登録!$B19)","v":"SBC"},{"$f":"VLOOKUP(Y8,登録!$AE$2:$AH$55,3,FALSE)","v":"山中　康寛"},{"$f":"VLOOKUP(Y8,登録!$AE$2:$AH$55,4,FALSE)","v":120},{"$f":"★個人成績表★!L25","v":71},{"$f":"★個人成績表★!J25","v":0},null,{"$f":"★個人成績表★!I25","v":"w"},{"$f":"★個人成績表★!K25","v":90},{"$f":"★個人成績表★!M25","v":"w"},2,3,401,{"$f":"AK8*登録!$I$8/★対戦リーグ表★!AB8","v":401},"",401,{"$f":"AI8*100000+AL8","v":200401},{"$f":"IF(COUNTBLANK(AC8:AH8)=6,\"\",RANK(AO8,AO6:AO11))","v":4},{"$f":"IF(結果入力表!H184=\"\",\"\",結果入力表!H184)","v":""},{"$f":"IF(結果入力表!H128=\"\",\"\",結果入力表!H128)","v":""},null,{"$f":"IF(結果入力表!E107=\"\",\"\",結果入力表!E107)","v":""},{"$f":"IF(結果入力表!H156=\"\",\"\",結果入力表!H156)","v":""},{"$f":"IF(結果入力表!E198=\"\",\"\",結果入力表!E198)","v":""},null,2,null,"林　秀忠","SBC","","",{"$f":"IF(LEFT(V8,1)=\"A\",\"A\",IF(LEFT(V8,1)=\"B\",\"B\",V8))","v":""},{"$f":"IF(LEFT(W8,1)=\"A\",\"A\",IF(LEFT(W8,1)=\"B\",\"B\",W8))","v":"A"},{"$f":"IF(LEFT(X8,1)=\"A\",\"A\",IF(LEFT(X8,1)=\"B\",\"B\",X8))","v":""},{"$f":"IF(LEFT(AQ48,1)=\"A\",\"A\",IF(LEFT(AQ48,1)=\"B\",\"B\",AQ48))","v":""},{"$f":"IF(LEFT(AR48,1)=\"A\",\"A\",IF(LEFT(AR48,1)=\"B\",\"B\",AR48))","v":""},{"$f":"IF(LEFT(AT48,1)=\"A\",\"A\",IF(LEFT(AT48,1)=\"B\",\"B\",AT48))","v":""},{"$f":"IF(LEFT(AU48,1)=\"A\",\"A\",IF(LEFT(AU48,1)=\"B\",\"B\",AU48))","v":""},{"$f":"IF(LEFT(AV48,1)=\"A\",\"A\",IF(LEFT(AV48,1)=\"B\",\"B\",AV48))","v":""},{"$f":"IF(BM8>0,\"A\"&登録!$I$8,IF(BN8>0,\"B\"&登録!$I$8,BO8))","v":"A120"},1,0,0,10000,null,{"$f":"★個人成績表★!B7","v":"鈴木　康文"},107]
{"$rows_left_out":52}
{"sheet":"結果入力表","index":4,"n_rows":211,"n_cols":12,"rows_kept":211,"cut":false,"hidden":false,"merged":[]}
["節","G-No","所属A","選手名A","HR","得点","得点","HR","選手名B","所属B"]
["第1節",{"$f":"登録!AN2","v":1},{"$f":"登録!AQ2","v":"SBC"},{"$f":"登録!AR2","v":"林　秀忠"},null,"w",55,null,{"$f":"登録!AS2","v":"吉向　翔平"},{"$f":"登録!AT2","v":"NRC"},null,"s"]
[null,{"$f":"登録!AN3","v":2},{"$f":"登録!AQ3","v":"SBC"},{"$f":"登録!AR3","v":"大橋　義治"},null,"w",112,null,{"$f":"登録!AS3","v":"岩本　剛"},{"$f":"登録!AT3","v":"NRC"},null,"s"]
[null,{"$f":"登録!AN4","v":3},{"$f":"登録!AQ4","v":"SBC"},{"$f":"登録!AR4","v":"山中　康寛"},null,0,"w",null,{"$f":"登録!AS4","v":"白戸　玲人"},{"$f":"登録!AT4","v":"NRC"},null,"s"]
[null,{"$f":"登録!AN5","v":4},{"$f":"登録!AQ5","v":"SBC"},{"$f":"登録!AR5","v":"西峰　久祐"},null,"w",72,null,{"$f":"登録!AS5","v":"植田　慎也"},{"$f":"登録!AT5","v":"NRC"},null,"s"]
[null,{"$f":"登録!AN6","v":5},{"$f":"登録!AQ6","v":"SBC"},{"$f":"登録!AR6","v":"大橋　正寛"},null,"w",19,null,{"$f":"登録!AS6","v":"近藤　拓馬"},{"$f":"登録!AT6","v":"NRC"},null,"s"]
[null,{"$f":"登録!AN7","v":6},{"$f":"登録!AQ7","v":"SBC"},{"$f":"登録!AR7","v":"秋田　倫央"},null,98,"w",null,{"$f":"登録!AS7","v":"長谷川　進"},{"$f":"登録!AT7","v":"NRC"},null,"s"]
[null,{"$f":"登録!AN8","v":7},{"$f":"登録!AQ8","v":"SBC"},{"$f":"登録!AR8","v":"大橋　洋子"},null,64,"w",null,{"$f":"登録!AS8","v":"白戸　恭子"},{"$f":"登録!AT8","v":"NRC"},null,"s"]
{"$rows_left_out":204}
{"sheet":"★総合結果表★","index":5,"n_rows":21,"n_cols":23,"rows_kept":21,"cut":false,"hidden":false,"merged":[[17,18,18,18],[19,18,20,18],[19,16,20,16],[19,15,20,15],[17,15,18,15],[17,16,18,16],[15,18,16,18],[15,16,16,16],[15,15,16,15],[13,15,14,15],[13,16,14,16],[7,15,8,15],[7,16,8,16],[7,17,8,17],[7,18,8,18],[13,18,14,18],[11,15,12,15],[11,16,12,16],[9,18,10,18],[11,18,12,18],[9,15,10,15],[9,16,10,16],[0,0,1,18],[3,15,3,18],[4,15,4,18],[3,3,3,7],[4,3,4,7],[3,9,3,13],[4,9,4,13],[5,3,5,13],[19,13,20,14],[9,3,10,4],[11,5,12,6],[13,7,14,8],[15,9,16,10],[17,11,18,12]]}
[{"$f":"★個人成績表★!A1","v":"第31回　京阪神和奈滋対抗戦　　　(奈良；玉出エース)"}]
[]
[]
["MVP",null,null,{"$f":"IF(ISERROR(★個人成績表★!AE12),\"\",★個人成績表★!AJ12)","v":"早川　徹(KRC)　9勝1敗"},null,null,null,null,"VP",{"$f":"IF(ISERROR(★個人成績表★!$AD$12),\"\",VLOOKUP(3,★個人成績表★!$AC$15:$AJ$20,8,FALSE))","v":"宮本　一(HRC)　7勝3敗"},null,null,null,null,"VP",{"$f":"IF(ISERROR(★個人成績表★!$AD$12),\"\",VLOOKUP(5,★個人成績表★!$AC$15:$AJ$20,8,FALSE))","v":"山中　康介(WRC)　7勝3敗"}]
["VP",null,null,{"$f":"IF(ISERROR(★個人成績表★!$AD$12),\"\",VLOOKUP(2,★個人成績表★!$AC$15:$AJ$20,8,FALSE))","v":"乾　伸綱(ORC)　8勝2敗"},null,null,null,null,"VP",{"$f":"IF(ISERROR(★個人成績表★!$AD$12),\"\",VLOOKUP(4,★個人成績表★!$AC$15:$AJ$20,8,FALSE))","v":"林　秀忠(SBC)　7勝3敗"},null,null,null,null,"VP",{"$f":"IF(ISERROR(VLOOKUP(6,★個人成績表★!$AC$15:$AJ$20,8,FALSE)),\"\",VLOOKUP(6,★個人成績表★!$AC$15:$AJ$20,8,FALSE))","v":"白戸　恭子(NRC)　6勝4敗"}]
["H　R",null,null,"芝先　泰生(WRC)　A120　、　110"]
[]
[null,null,null,{"$f":"A10","v":"KRC"},null,{"$f":"A12","v":"HRC"},null,{"$f":"A14","v":"SBC"},null,{"$f":"A16","v":"NRC"},null,{"$f":"A18","v":"ORC"},null,{"$f":"A20","v":"WRC"},null,"W","L","TP","RK"]
{"$rows_left_out":13}