{"text_format":"1","workbook":"xlsx","n_sheets":8,"sheets":["【準備】登録","●【進行】結果入力表","●【結果】総合結果表","●【結果】個人成績表","【結果】リーグ成績表","結果リスト","【準備】対戦カード","Sheet1"],"not_rendered":{"charts":0,"images":3,"macros":1,"external_links":0,"defined_names":7,"comments":0,"pivot_tables":0},"unopened":[],"bounds":{"document_bytes":16777216,"sheet_cells":100000,"rows_first":2000,"rows_last":500,"rows_between":2000,"halvings":0,"cell_chars":16384,"cell_head_chars":4096},"cells_cut":0,"cells_raw":0,"read":"whole","date_system":"1900"}

{"sheet":"【準備】登録","index":0,"n_rows":59,"n_cols":40,"rows_kept":59,"cut":false,"hidden":false,"merged":[[58,8,58,9],[55,2,55,3],[56,2,56,3],[57,2,57,3],[58,2,58,3],[58,5,58,6],[55,5,55,6],[56,5,56,6],[57,5,57,6],[55,8,55,9],[56,8,56,9],[57,8,57,9],[53,2,53,3],[54,2,54,3],[53,8,53,9],[54,8,54,9],[20,8,20,9],[21,8,21,9],[21,2,21,3],[22,2,22,3],[23,2,23,3],[24,2,24,3],[25,2,25,3],[26,8,26,9],[24,5,24,6],[53,5,53,6],[54,5,54,6],[22,8,22,9],[1,6,1,7],[3,3,3,6],[5,3,5,8],[19,2,19,3],[7,3,7,4],[17,8,17,9],[16,8,16,10],[5,10,5,11],[19,5,19,6],[19,8,19,9],[8,3,8,4],[17,2,17,3],[17,5,17,6],[15,2,15,4],[15,5,15,7],[15,8,15,10],[16,2,16,4],[16,5,16,7],[20,2,20,3],[20,5,20,6],[21,5,21,6],[24,8,24,9],[25,8,25,9],[26,2,26,3],[23,8,23,9],[22,5,22,6],[23,5,23,6],[26,5,26,6],[25,5,25,6]]}
[]
["対抗戦名称",null,null,"第",8,"回","神奈滋",null,"対抗戦",null,"(",{"$f":"COUNTA(C20:D27)","v":6},"名","対抗　）"]
[]
["開催日",null,null,"2017-10-22",null,null,null,null,null,null,null,null,null,null,null,null,null,null,null,null,null,null,null,null,null,null,null,null,null,null,null,null,"固定","第1節",null,"第2節",null,"第3節"]
[null,null,null,null,null,null,null,null,null,null,null,null,null,null,null,null,null,null,null,null,null,null,null,null,null,null,null,null,null,null,null,null,1,2,3,2,3,2,3]
["会場",null,null,"キングスポット",null,null,null,null,null,"（","奈良",null,"）",null,null,null,null,null,null,null,null,null,null,null,null,null,null,null,null,null,null,null,{"$f":"C17","v":"兵庫"},{"$f":"F17","v":"滋賀"},{"$f":"I17","v":"奈良"},{"$f":"F17","v":"滋賀"},{"$f":"I17","v":"奈良"},{"$f":"F17","v":"滋賀"},{"$f":"I17","v":"奈良"}]
[null,null,null,null,null,null,null,null,null,null,null,null,null,null,null,null,null,null,null,null,null,null,null,null,null,null,null,null,null,null,null,null,1,1,1,7,5,6,3,"←対戦順の変更をする場合"]
["点数",null,null,"男性",null,"：","M",null,180,"点",null,null,null,null,null,null,null,null,null,null,null,null,null,null,null,null,null,null,null,null,null,null,2,2,2,1,6,7,4]
[null,null,null,"女性",null,"：","W",null,140,"点",null,null,null,null,null,null,null,null,null,null,null,null,null,null,null,null,null,null,null,null,null,null,3,3,3,2,7,1,5]
[]
[]
[]
[]
[null,null,null,null,null,null,null,null,null,null,null,null,null,null,null,null,null,null,null,null,null,null,null,null,null,null,null,null,null,null,null,null,4,4,4,3,1,2,6]
["出場選手",null,null,null,null,null,null,null,null,null,null,null,null,null,null,null,null,null,null,null,null,null,null,null,null,null,null,null,null,null,null,null,5,5,5,4,2,3,7]
["前回順位",null,null,null,null,null,null,null,null,null,null,null,null,null,null,null,null,null,null,null,null,null,null,null,null,null,null,null,null,null,null,null,6,6,6,5,3,4,1]
["クラブ名",null,"兵庫",null,null,"滋賀",null,null,"奈良",null,null,null,null,null,null,null,null,null,null,null,null,null,null,null,null,null,null,null,null,null,null,null,7,7,7,6,4,5,2]
["番手",null,"選手名",null,"点数","選手名",null,"点数","選手名",null,"点数",null,null,null,null,null,null,null,null,null,null,null,null,null,null,null,null,null,null,null,null,null,{"$f":"IF(C27=\"\",\"\",AG17+1)","v":""},{"$f":"AG18","v":""},{"$f":"AG18","v":""},{"$f":"IF(F27=\"\",\"\",1)","v":""},{"$f":"IF(I27=\"\",\"\",AK17+1)","v":""},{"$f":"IF(F27=\"\",\"\",AL17+1)","v":""},{"$f":"IF(I27=\"\",\"\",AM17+1)","v":""}]
[null,null,2,null,null,1,null,null,3]
[1,null,"宮本　一",null,180,"大橋　義治",null,180,"田尻　哲司",null,180,null,null,null,null,null,null,null,null,null,null,null,null,null,null,null,null,null,null,null,null,null,1,1,1,2,3,3,5]
[2,null,"鐵山　泰三",null,180,"大橋　正寛",null,180,"吉向　翔平",null,180,null,null,null,null,null,null,null,null,null,null,null,null,null,null,null,null,null,null,null,null,null,2,2,2,3,4,4,6]
[3,null,"中尾　亮太",null,180,"西峰　久祐",null,180,"巽　大地",null,180,null,null,null,null,null,null,null,null,null,null,null,null,null,null,null,null,null,null,null,null,null,3,3,3,4,5,5,7]
[4,null,"平井　洸志",null,180,"山中　康寛",null,180,"山田　晃司",null,180,null,null,null,null,null,null,null,null,null,null,null,null,null,null,null,null,null,null,null,null,null,4,4,4,5,6,6,1]
[5,null,"堂園　雅也",null,180,"御手洗　茂",null,180,"鷲尾　隆杜",null,180,null,null,null,null,null,null,null,null,null,null,null,null,null,null,null,null,null,null,null,null,null,5,5,5,6,7,7,2]
[6,null,"藤中　健太郎",null,180,"高島　太一",null,180,"長谷川　進",null,180,null,null,null,null,null,null,null,null,null,null,null,null,null,null,null,null,null,null,null,null,null,6,6,6,7,1,1,3]
[7,null,null,null,null,null,null,null,null,null,null,null,null,null,null,null,null,null,null,null,null,null,null,null,null,null,null,null,null,null,null,null,7,7,7,1,2,2,4]
[8]
[]
[]
[]
[]
[]
[]
[]
[]
[]
[]
[]
[]
[]
[]
[]
[]
[]
[]
[]
[]
[]
[]
[]
[]
[]
[]
[null,null,"大橋　義治",null,null,"宮本　一",null,null,"近藤　拓馬"]
[null,null,"大橋　正寛",null,null,"鐵山　泰三",null,null,"吉向　翔平"]
[null,null,"西峰　久祐",null,null,"中尾　亮太",null,null,"巽　大地"]
[null,null,"山中　康寛",null,null,"平井　洸志",null,null,"山田　晃司"]
[null,null,"御手洗　茂",null,null,"堂園　雅也",null,null,"鷲尾　隆杜"]
[null,null,"高島　太一",null,null,"藤中　健太郎",null,null,"長谷川　進"]

{"sheet":"●【進行】結果入力表","index":1,"n_rows":80,"n_cols":13,"rows_kept":80,"cut":false,"hidden":false,"merged":[]}
[null,"試合進行は、基本的にこのシートのみで行います。"]
[]
[]
[]
[]
[]
[]
["節","G-No","所属A","選手名A","HR","得点","得点","HR","選手名B","所属B",null,"レフリー"]
["第1節",1,{"$f":"IF(【準備】登録!C17=\"\",\"\",【準備】登録!C17)","v":"兵庫"},{"$f":"IF(【準備】登録!$C$20=\"\",\"\",【準備】登録!$C$20)","v":"宮本　一"},null,"W",52,null,{"$f":"IF(【準備】登録!$I$20=\"\",\"\",【準備】登録!$I$20)","v":"田尻　哲司"},{"$f":"IF(【準備】登録!I17=\"\",\"\",【準備】登録!I17)","v":"奈良"},null,{"$f":"J17","v":"滋賀"},{"$f":"I17","v":"大橋　義治"}]
["第1節",2,{"$f":"$C$9","v":"兵庫"},{"$f":"IF(【準備】登録!$C$21=\"\",\"\",【準備】登録!$C$21)","v":"鐵山　泰三"},null,26,"W",null,{"$f":"IF(【準備】登録!$I$21=\"\",\"\",【準備】登録!$I$21)","v":"吉向　翔平"},{"$f":"$J$9","v":"奈良"},null,"滋賀","大橋　正寛"]
["第1節",3,"兵庫",{"$f":"IF(【準備】登録!$C$22=\"\",\"\",【準備】登録!$C$22)","v":"中尾　亮太"},null,24,"W",null,{"$f":"IF(【準備】登録!$I$22=\"\",\"\",【準備】登録!$I$22)","v":"巽　大地"},"奈良",null,"滋賀","西峰　久祐"]
["第1節",{"$f":"IF(【準備】登録!$L$2>=4,4,\"\")","v":4},"兵庫",{"$f":"IF(【準備】登録!$C$23=\"\",\"\",【準備】登録!$C$23)","v":"平井　洸志"},null,24,"W",null,{"$f":"IF(【準備】登録!$I$23=\"\",\"\",【準備】登録!$I$23)","v":"山田　晃司"},"奈良",null,"滋賀","山中　康寛"]
["第1節",{"$f":"IF(【準備】登録!$L$2>=5,5,\"\")","v":5},"兵庫",{"$f":"IF(【準備】登録!$C$24=\"\",\"\",【準備】登録!$C$24)","v":"堂園　雅也"},null,"W",155,null,{"$f":"IF(【準備】登録!$I$24=\"\",\"\",【準備】登録!$I$24)","v":"鷲尾　隆杜"},"奈良",null,"滋賀","御手洗　茂"]
["第1節",{"$f":"IF(【準備】登録!$L$2>=6,6,\"\")","v":6},"兵庫",{"$f":"IF(【準備】登録!$C$25=\"\",\"\",【準備】登録!$C$25)","v":"藤中　健太郎"},null,"W",164,null,{"$f":"IF(【準備】登録!$I$25=\"\",\"\",【準備】登録!$I$25)","v":"長谷川　進"},"奈良",null,"滋賀","高島　太一"]
["第1節",{"$f":"IF(【準備】登録!$L$2>=7,7,\"\")","v":""},"兵庫",null,null,null,null,null,null,"奈良",null,{"$f":"J23","v":"滋賀"},{"$f":"I23","v":0}]
["第1節",{"$f":"IF(【準備】登録!$L$2>=8,8,\"\")","v":""},"兵庫",null,null,null,null,null,null,"奈良",null,"滋賀",0]
["第1節",{"$f":"IF(B15=\"\",7,IF(B16=\"\",8,9))","v":7},"兵庫",{"$f":"D9","v":"宮本　一"},null,"W",176,null,{"$f":"IF(【準備】登録!$F$20=\"\",\"\",【準備】登録!$F$20)","v":"大橋　義治"},{"$f":"$C$25","v":"滋賀"},null,{"$f":"J9","v":"奈良"},{"$f":"I9","v":"田尻　哲司"}]
["第1節",{"$f":"B17+1","v":8},"兵庫","鐵山　泰三",null,"W",159,null,{"$f":"IF(【準備】登録!$F$21=\"\",\"\",【準備】登録!$F$21)","v":"大橋　正寛"},"滋賀",null,"奈良","吉向　翔平"]
["第1節",{"$f":"B18+1","v":9},"兵庫","中尾　亮太",null,153,"W",null,{"$f":"IF(【準備】登録!$F$22=\"\",\"\",【準備】登録!$F$22)","v":"西峰　久祐"},"滋賀",null,"奈良","巽　大地"]
["第1節",{"$f":"B19+1","v":10},"兵庫","平井　洸志",null,102,"W",null,{"$f":"IF(【準備】登録!$F$23=\"\",\"\",【準備】登録!$F$23)","v":"山中　康寛"},"滋賀",null,"奈良","山田　晃司"]
["第1節",{"$f":"B20+1","v":11},"兵庫","堂園　雅也",null,"W",95,null,{"$f":"IF(【準備】登録!$F$24=\"\",\"\",【準備】登録!$F$24)","v":"御手洗　茂"},"滋賀",null,"奈良","鷲尾　隆杜"]
["第1節",{"$f":"B21+1","v":12},"兵庫","藤中　健太郎",null,84,"W",null,{"$f":"IF(【準備】登録!$F$25=\"\",\"\",【準備】登録!$F$25)","v":"高島　太一"},"滋賀",null,"奈良","長谷川　進"]
["第1節",{"$f":"IF(B15=\"\",\"\",B22+1)","v":""},"兵庫",null,null,null,null,null,null,"滋賀",null,{"$f":"J15","v":"奈良"},{"$f":"I15","v":0}]
["第1節",{"$f":"IF(B23=\"\",\"\",B23+1)","v":""},"兵庫",null,null,null,null,null,null,"滋賀",null,"奈良",0]
["第1節",{"$f":"IF(B23=\"\",B22+1,IF(B24=\"\",B23+1))","v":13},{"$f":"IF(【準備】登録!F17=\"\",\"\",【準備】登録!F17)","v":"滋賀"},{"$f":"I17","v":"大橋　義治"},null,"W",172,null,{"$f":"I9","v":"田尻　哲司"},{"$f":"$J$9","v":"奈良"},null,{"$f":"C9","v":"兵庫"},{"$f":"D17","v":"宮本　一"}]
["第1節",{"$f":"B25+1","v":14},{"$f":"$C$25","v":"滋賀"},"大橋　正寛",null,"W",137,null,"吉向　翔平","奈良",null,"兵庫","鐵山　泰三"]
["第1節",{"$f":"B26+1","v":15},"滋賀","西峰　久祐",null,"W",160,null,"巽　大地","奈良",null,"兵庫","中尾　亮太"]
["第1節",{"$f":"B27+1","v":16},"滋賀","山中　康寛",null,78,"W",102,"山田　晃司","奈良",null,"兵庫","平井　洸志"]
["第1節",{"$f":"B28+1","v":17},"滋賀","御手洗　茂",null,31,"W",105,"鷲尾　隆杜","奈良",null,"兵庫","堂園　雅也"]
["第1節",{"$f":"B29+1","v":18},"滋賀","高島　太一",null,"W",108,null,"長谷川　進","奈良",null,"兵庫","藤中　健太郎"]
["第1節",{"$f":"IF(B23=\"\",\"\",B30+1)","v":""},"滋賀",null,null,null,null,null,null,"奈良",null,{"$f":"C15","v":"兵庫"},{"$f":"D23","v":0}]
["第1節",{"$f":"IF(B31=\"\",\"\",B31+1)","v":""},"滋賀",null,null,null,null,null,null,"奈良",null,"兵庫",0]
["第2節",{"$f":"IF(B31=\"\",B30+1,IF(B32=\"\",B31+1))","v":19},{"$f":"$C$9","v":"兵庫"},{"$f":"D41","v":"堂園　雅也"},null,"W",73,null,{"$f":"IF(【準備】登録!$I$23=\"\",\"\",【準備】登録!$I$23)","v":"山田　晃司"},"奈良",null,{"$f":"J41","v":"滋賀"},{"$f":"I41","v":"高島　太一"}]
["第2節",{"$f":"B33+1","v":20},"兵庫","藤中　健太郎",null,88,"W",null,{"$f":"IF(【準備】登録!$I$24=\"\",\"\",【準備】登録!$I$24)","v":"鷲尾　隆杜"},"奈良",null,{"$f":"J42","v":"滋賀"},{"$f":"I42","v":"大橋　義治"}]
["第2節",{"$f":"B34+1","v":21},"兵庫","宮本　一",108,"W",50,null,{"$f":"IF(【準備】登録!$I$25=\"\",\"\",【準備】登録!$I$25)","v":"長谷川　進"},"奈良",null,"滋賀","大橋　正寛"]
["第2節",{"$f":"B35+1","v":22},"兵庫","鐵山　泰三",100,"W",53,null,{"$f":"IF(【準備】登録!$I$20=\"\",\"\",【準備】登録!$I$20)","v":"田尻　哲司"},"奈良",null,"滋賀","西峰　久祐"]
["第2節",{"$f":"B36+1","v":23},"兵庫","中尾　亮太",null,53,"W",null,{"$f":"IF(【準備】登録!$I$21=\"\",\"\",【準備】登録!$I$21)","v":"吉向　翔平"},"奈良",null,"滋賀","山中　康寛"]
["第2節",{"$f":"B37+1","v":24},"兵庫","平井　洸志",null,"W",91,null,{"$f":"IF(【準備】登録!$I$22=\"\",\"\",【準備】登録!$I$22)","v":"巽　大地"},"奈良",null,"滋賀","御手洗　茂"]
["第2節",{"$f":"IF(B31=\"\",\"\",B38+1)","v":""},"兵庫",null,null,null,null,null,null,"奈良",null,"滋賀",0]
["第2節",{"$f":"IF(B39=\"\",\"\",B39+1)","v":""},"兵庫",null,null,null,null,null,null,"奈良",null,"滋賀",0]
["第2節",{"$f":"IF(B39=\"\",B38+1,IF(B40=\"\",B39+1))","v":25},"兵庫",{"$f":"IF($D$9=\"\",\"\",【準備】登録!$C$24)","v":"堂園　雅也"},null,156,"W",null,{"$f":"IF($D$9=\"\",\"\",【準備】登録!$F$25)","v":"高島　太一"},{"$f":"$C$25","v":"滋賀"},null,{"$f":"J33","v":"奈良"},{"$f":"I33","v":"山田　晃司"}]
["第2節",{"$f":"B41+1","v":26},"兵庫",{"$f":"IF($D$9=\"\",\"\",IF(【準備】登録!C27=\"\",【準備】登録!C25,【準備】登録!$C$26))","v":"藤中　健太郎"},null,24,"W",null,{"$f":"IF($D$9=\"\",\"\",【準備】登録!$F$20)","v":"大橋　義治"},"滋賀",null,{"$f":"J34","v":"奈良"},{"$f":"I34","v":"鷲尾　隆杜"}]
["第2節",{"$f":"B42+1","v":27},"兵庫",{"$f":"IF($D$9=\"\",\"\",【準備】登録!$C$20)","v":"宮本　一"},null,"W",156,null,{"$f":"IF($D$9=\"\",\"\",【準備】登録!$F$21)","v":"大橋　正寛"},"滋賀",null,"奈良","長谷川　進"]
["第2節",{"$f":"B43+1","v":28},"兵庫",{"$f":"IF($D$9=\"\",\"\",【準備】登録!$C$21)","v":"鐵山　泰三"},null,"W",62,null,{"$f":"IF($D$9=\"\",\"\",【準備】登録!$F$22)","v":"西峰　久祐"},"滋賀",null,"奈良","田尻　哲司"]
["第2節",{"$f":"B44+1","v":29},"兵庫",{"$f":"IF($D$9=\"\",\"\",【準備】登録!$C$22)","v":"中尾　亮太"},null,149,"W",null,{"$f":"IF($D$9=\"\",\"\",【準備】登録!$F$23)","v":"山中　康寛"},"滋賀",null,"奈良","吉向　翔平"]
["第2節",{"$f":"B45+1","v":30},"兵庫",{"$f":"IF($D$9=\"\",\"\",【準備】登録!$C$23)","v":"平井　洸志"},null,"W",88,null,{"$f":"IF($D$9=\"\",\"\",【準備】登録!$F$24)","v":"御手洗　茂"},"滋賀",null,"奈良","巽　大地"]
["第2節",{"$f":"IF(B39=\"\",\"\",B46+1)","v":""},"兵庫",null,null,null,null,null,null,"滋賀",null,"奈良",0]
["第2節",{"$f":"IF(B47=\"\",\"\",B47+1)","v":""},"兵庫",null,null,null,null,null,null,"滋賀",null,"奈良",0]
["第2節",{"$f":"IF(B47=\"\",B46+1,IF(B48=\"\",B47+1))","v":31},{"$f":"$C$25","v":"滋賀"},{"$f":"I41","v":"高島　太一"},null,100,"W",null,{"$f":"I33","v":"山田　晃司"},{"$f":"$J$9","v":"奈良"},null,{"$f":"C41","v":"兵庫"},{"$f":"D41","v":"堂園　雅也"}]
["第2節",{"$f":"B49+1","v":32},"滋賀",{"$f":"I42","v":"大橋　義治"},null,"W",57,null,"鷲尾　隆杜","奈良",null,{"$f":"C42","v":"兵庫"},{"$f":"D42","v":"藤中　健太郎"}]
["第2節",{"$f":"B50+1","v":33},"滋賀","大橋　正寛",null,"W",96,null,"長谷川　進","奈良",null,"兵庫","宮本　一"]
["第2節",{"$f":"B51+1","v":34},"滋賀","西峰　久祐",null,"W",65,null,"田尻　哲司","奈良",null,"兵庫","鐵山　泰三"]
["第2節",{"$f":"B52+1","v":35},"滋賀","山中　康寛",null,135,"W",null,"吉向　翔平","奈良",null,"兵庫","中尾　亮太"]
["第2節",{"$f":"B53+1","v":36},"滋賀","御手洗　茂",null,96,"W",null,"巽　大地","奈良",null,"兵庫","平井　洸志"]
["第2節",{"$f":"IF(B47=\"\",\"\",B54+1)","v":""},"滋賀",null,null,null,null,null,null,"奈良",null,"兵庫",0]
["第2節",{"$f":"IF(B55=\"\",\"\",B55+1)","v":""},"滋賀",null,null,null,null,null,null,"奈良",null,"兵庫",0]
["第3節",{"$f":"IF(B55=\"\",B54+1,IF(B56=\"\",B55+1))","v":37},{"$f":"$C$9","v":"兵庫"},{"$f":"D65","v":"中尾　亮太"},null,"W",99,null,{"$f":"IF($D$9=\"\",\"\",【準備】登録!$I$20)","v":"田尻　哲司"},"奈良",null,{"$f":"J65","v":"滋賀"},{"$f":"I65","v":"御手洗　茂"}]
["第3節",{"$f":"B57+1","v":38},"兵庫","平井　洸志",null,"W",124,null,{"$f":"IF($D$9=\"\",\"\",【準備】登録!$I$21)","v":"吉向　翔平"},"奈良",null,{"$f":"J66","v":"滋賀"},{"$f":"I66","v":"高島　太一"}]
["第3節",{"$f":"B58+1","v":39},"兵庫","堂園　雅也",110,"W",42,null,{"$f":"IF($D$9=\"\",\"\",【準備】登録!$I$22)","v":"巽　大地"},"奈良",null,"滋賀","大橋　義治"]
["第3節",{"$f":"B59+1","v":40},"兵庫","藤中　健太郎",107,"W",164,null,{"$f":"IF($D$9=\"\",\"\",【準備】登録!$I$23)","v":"山田　晃司"},"奈良",null,"滋賀","大橋　正寛"]
["第3節",{"$f":"B60+1","v":41},"兵庫","宮本　一",null,"W",112,null,{"$f":"IF($D$9=\"\",\"\",【準備】登録!$I$24)","v":"鷲尾　隆杜"},"奈良",null,"滋賀","西峰　久祐"]
["第3節",{"$f":"B61+1","v":42},"兵庫","鐵山　泰三",null,"W",58,null,{"$f":"IF($D$9=\"\",\"\",【準備】登録!$I$25)","v":"長谷川　進"},"奈良",null,"滋賀","山中　康寛"]
["第3節",{"$f":"IF(B55=\"\",\"\",B62+1)","v":""},"兵庫",null,null,null,null,null,null,"奈良",null,"滋賀",0]
["第3節",{"$f":"IF(B63=\"\",\"\",B63+1)","v":""},"兵庫",null,null,null,null,null,null,"奈良",null,"滋賀",0]
["第3節",{"$f":"IF(B63=\"\",B62+1,IF(B64=\"\",B63+1))","v":43},"兵庫",{"$f":"IF($D$9=\"\",\"\",【準備】登録!$C$22)","v":"中尾　亮太"},null,"W",61,null,{"$f":"IF($D$9=\"\",\"\",【準備】登録!$F$24)","v":"御手洗　茂"},{"$f":"$C$25","v":"滋賀"},null,{"$f":"J57","v":"奈良"},{"$f":"I57","v":"田尻　哲司"}]
["第3節",{"$f":"B65+1","v":44},"兵庫",{"$f":"IF($D$9=\"\",\"\",IF(【準備】登録!C27=\"\",【準備】登録!C23,【準備】登録!$C$24))","v":"平井　洸志"},null,45,"W",null,{"$f":"IF($D$9=\"\",\"\",IF(【準備】登録!F27=\"\",【準備】登録!F25,【準備】登録!$F$26))","v":"高島　太一"},"滋賀",null,{"$f":"J58","v":"奈良"},{"$f":"I58","v":"吉向　翔平"}]
["第3節",{"$f":"B66+1","v":45},"兵庫",{"$f":"IF($D$9=\"\",\"\",IF(【準備】登録!C27=\"\",【準備】登録!C24,【準備】登録!$C$25))","v":"堂園　雅也"},null,88,"W",null,{"$f":"IF($D$9=\"\",\"\",【準備】登録!$F$20)","v":"大橋　義治"},"滋賀",null,"奈良","巽　大地"]
["第3節",{"$f":"B67+1","v":46},"兵庫",{"$f":"IF($D$9=\"\",\"\",IF(【準備】登録!C27=\"\",【準備】登録!C25,【準備】登録!$C$26))","v":"藤中　健太郎"},null,"W",17,null,{"$f":"IF($D$9=\"\",\"\",【準備】登録!$F$21)","v":"大橋　正寛"},"滋賀",null,"奈良","山田　晃司"]
["第3節",{"$f":"B68+1","v":47},"兵庫",{"$f":"IF($D$9=\"\",\"\",【準備】登録!$C$20)","v":"宮本　一"},null,"W",120,null,{"$f":"IF($D$9=\"\",\"\",【準備】登録!$F$22)","v":"西峰　久祐"},"滋賀",null,"奈良","鷲尾　隆杜"]
["第3節",{"$f":"B69+1","v":48},"兵庫",{"$f":"IF($D$9=\"\",\"\",【準備】登録!$C$21)","v":"鐵山　泰三"},null,178,"W",null,{"$f":"IF($D$9=\"\",\"\",【準備】登録!$F$23)","v":"山中　康寛"},"滋賀",null,"奈良","長谷川　進"]
["第3節",{"$f":"IF(B63=\"\",\"\",B70+1)","v":""},"兵庫",null,null,null,null,null,null,"滋賀",null,"奈良",0]
["第3節",{"$f":"IF(B71=\"\",\"\",B71+1)","v":""},"兵庫",null,null,null,null,null,null,"滋賀",null,"奈良",0]
["第3節",{"$f":"IF(B71=\"\",B70+1,IF(B72=\"\",B71+1))","v":49},{"$f":"$C$25","v":"滋賀"},{"$f":"I65","v":"御手洗　茂"},null,134,"W",null,{"$f":"I57","v":"田尻　哲司"},{"$f":"$J$9","v":"奈良"},null,{"$f":"C65","v":"兵庫"},{"$f":"D65","v":"中尾　亮太"}]
["第3節",{"$f":"B73+1","v":50},"滋賀",{"$f":"I66","v":"高島　太一"},null,132,"W",null,"吉向　翔平","奈良",null,{"$f":"C66","v":"兵庫"},{"$f":"D66","v":"平井　洸志"}]
["第3節",{"$f":"B74+1","v":51},"滋賀","大橋　義治",null,"W",39,null,"巽　大地","奈良",null,"兵庫","堂園　雅也"]
["第3節",{"$f":"B75+1","v":52},"滋賀","大橋　正寛",null,75,"W",null,"山田　晃司","奈良",null,"兵庫","藤中　健太郎"]
["第3節",{"$f":"B76+1","v":53},"滋賀","西峰　久祐",null,"W",89,null,"鷲尾　隆杜","奈良",null,"兵庫","宮本　一"]
["第3節",{"$f":"B77+1","v":54},"滋賀","山中　康寛",null,80,"W",null,"長谷川　進","奈良",null,"兵庫","鐵山　泰三"]
["第3節",{"$f":"IF(B71=\"\",\"\",B78+1)","v":""},"滋賀",null,null,null,null,null,null,"奈良",null,"兵庫",0]
["第3節",{"$f":"IF(B79=\"\",\"\",B79+1)","v":""},"滋賀",null,null,null,null,null,null,"奈良",null,"兵庫",0]

{"sheet":"●【結果】総合結果表","index":2,"n_rows":34,"n_cols":37,"rows_kept":34,"cut":false,"hidden":false,"merged":[[5,28,6,31],[5,32,6,39],[7,13,8,23],[5,13,6,23],[0,1,1,39],[3,36,3,39],[5,1,6,4],[7,1,8,4],[5,24,6,27],[7,24,8,27],[7,5,8,12],[7,28,8,31],[7,32,8,39],[5,5,6,12],[21,36,26,39],[27,26,32,29],[27,36,32,39],[21,30,22,33],[23,30,26,33],[27,30,28,33],[29,30,32,33],[11,30,14,33],[11,36,14,39],[15,26,20,29],[15,36,20,39],[17,30,20,33],[15,30,16,33],[21,22,26,25],[27,22,32,25],[11,22,14,25],[11,26,14,29],[21,26,26,29],[11,4,12,9],[11,10,12,15],[11,16,12,21],[15,22,20,25],[13,4,14,6],[13,7,14,9],[13,10,14,12],[13,13,14,15],[13,16,14,18],[13,19,14,21],[17,10,18,12],[17,13,18,15],[17,16,18,18],[17,19,18,21],[15,16,16,18],[15,19,16,21],[15,10,16,12],[15,13,16,15],[31,10,32,12],[31,13,32,15],[19,16,20,18],[19,19,20,21],[29,10,30,12],[29,13,30,15],[27,10,28,12],[27,13,28,15],[19,10,20,12],[19,13,20,15],[27,16,32,21],[25,19,26,21],[21,10,26,15],[23,16,24,18],[23,19,24,21],[21,16,22,18],[21,19,22,21],[25,16,26,18],[15,1,20,3],[21,1,26,3],[27,1,32,3],[21,4,22,6],[27,4,28,6],[15,4,20,9],[21,7,22,9],[23,4,24,6],[23,7,24,9],[31,4,32,6],[31,7,32,9],[25,7,26,9],[27,7,28,9],[29,4,30,6],[25,4,26,6],[29,7,30,9]]}
[null,{"$f":"●【結果】個人成績表!A1","v":"第8回　神奈滋対抗戦　　　(奈良；キングスポット)"}]
[]
[]
[null,null,null,null,null,null,null,null,null,null,null,null,null,null,null,null,null,null,null,null,null,null,null,null,null,null,null,null,null,null,null,null,null,null,null,null,{"$f":"【準備】登録!D4","v":"2017-10-22"}]
[]
[null,"MVP",null,null,null,{"$f":"IF(ISERROR(VLOOKUP(1,●【結果】個人成績表!CI6:CK8,3,FALSE)),\"\",VLOOKUP(1,●【結果】個人成績表!CI6:CK8,3,FALSE))","v":"宮本　一"},null,null,null,null,null,null,null,null,null,null,null,null,null,null,null,null,null,null,"VP",null,null,null,{"$f":"IF(ISERROR(VLOOKUP(2,●【結果】個人成績表!CI6:CK8,3,FALSE)),\"\",VLOOKUP(2,●【結果】個人成績表!CI6:CK8,3,FALSE))","v":"大橋　義治"}]
[]
[null,"HR",null,null,null,{"$f":"IF(VLOOKUP(1,●【結果】個人成績表!$BX$6:$CA$33,4,FALSE)<100,\"\",VLOOKUP(1,●【結果】個人成績表!$BX$6:$CA$33,2,FALSE))","v":"堂園　雅也"},null,null,null,null,null,null,null,{"$f":"IF(VLOOKUP(1,●【結果】個人成績表!$BX$6:$CA$33,4,FALSE)<100,\"\",\"(\"&VLOOKUP(1,●【結果】個人成績表!$BX$6:$CA$33,3,FALSE)&\")　\"&VLOOKUP(1,●【結果】個人成績表!$BX$6:$CA$33,4,FALSE)&\" p\")","v":"(兵庫)　110 p"},null,null,null,null,null,null,null,null,null,null,"VP",null,null,null,{"$f":"IF(ISERROR(VLOOKUP(3,●【結果】個人成績表!CI6:CK8,3,FALSE)),\"\",VLOOKUP(3,●【結果】個人成績表!CI6:CK8,3,FALSE))","v":"吉向　翔平"}]
[]
[]
[]
[null,null,null,null,{"$f":"B16","v":"兵庫"},null,null,null,null,null,{"$f":"B22","v":"滋賀"},null,null,null,null,null,{"$f":"B28","v":"奈良"},null,null,null,null,null,"W",null,null,null,"L",null,null,null,"TP",null,null,null,null,null,"RK"]
[null,null,null,null,null,null,null,null,null,null,null,null,null,null,null,null,null,null,null,null,null,null,null,null,null,null,null,null,null,null,null,null,null,null,"(TP)","TP"]
[null,null,null,null,"W",null,null,"L",null,null,"W",null,null,"L",null,null,"W",null,null,"L"]
[]
[null,{"$f":"IF(【準備】登録!C17=\"\",\"\",【準備】登録!C17)","v":"兵庫"},null,null,null,null,null,null,null,null,{"$f":"IF(●【結果】個人成績表!R14=\"\",\"\",●【結果】個人成績表!R14-Q16)","v":3},null,null,{"$f":"IF(●【結果】個人成績表!S14=\"\",\"\",●【結果】個人成績表!S14-T16)","v":3},null,null,{"$f":"●【結果】個人成績表!H14","v":3},null,null,{"$f":"●【結果】個人成績表!I14","v":3},null,null,{"$f":"IF(Q16=\"\",\"\",SUM(Q16:S21,K16:M21))","v":22},null,null,null,{"$f":"IF(T16=\"\",\"\",SUM(T16:V21,N16:P21))","v":14},null,null,null,{"$f":"IF(●【結果】個人成績表!BH14=0,\"\",\"(\"&●【結果】個人成績表!BH14&\")\")","v":"(5154)"},null,null,null,{"$f":"●【結果】個人成績表!BH14","v":5154},{"$f":"●【結果】個人成績表!CF14","v":5154},{"$f":"IF(AE18=\"\",\"\",RANK(W$16:W$33,W$16:W$33,0))","v":1}]
[]
[null,null,null,null,null,null,null,null,null,null,{"$f":"IF(●【結果】個人成績表!AL14=\"\",\"\",●【結果】個人成績表!AL14-●【結果】個人成績表!AB14)","v":3},null,null,{"$f":"IF(●【結果】個人成績表!AM14=\"\",\"\",●【結果】個人成績表!AM14-●【結果】個人成績表!AC14)","v":3},null,null,{"$f":"IF(●【結果】個人成績表!AB14=\"\",\"\",●【結果】個人成績表!AB14-●【結果】個人成績表!R14)","v":4},null,null,{"$f":"IF(●【結果】個人成績表!AC14=\"\",\"\",●【結果】個人成績表!AC14-●【結果】個人成績表!S14)","v":2},null,null,null,null,null,null,null,null,null,null,{"$f":"IF(●【結果】個人成績表!CF14=0,\"\",●【結果】個人成績表!CF14)","v":5154}]
[]
[null,null,null,null,null,null,null,null,null,null,{"$f":"IF(●【結果】個人成績表!BF14=\"\",\"\",●【結果】個人成績表!BF14-●【結果】個人成績表!AV14)","v":3},null,null,{"$f":"IF(●【結果】個人成績表!BG14=\"\",\"\",●【結果】個人成績表!BG14-●【結果】個人成績表!AW14)","v":3},null,null,{"$f":"IF(●【結果】個人成績表!AV14=\"\",\"\",●【結果】個人成績表!AV14-●【結果】個人成績表!AL14)","v":6},null,null,{"$f":"IF(●【結果】個人成績表!AW14=\"\",\"\",●【結果】個人成績表!AW14-●【結果】個人成績表!AM14)","v":0}]
[]
[null,{"$f":"IF(【準備】登録!F17=\"\",\"\",【準備】登録!F17)","v":"滋賀"},null,null,{"$f":"N16","v":3},null,null,{"$f":"K16","v":3},null,null,null,null,null,null,null,null,{"$f":"IF(●【結果】個人成績表!R24=\"\",\"\",●【結果】個人成績表!R24-●【結果】個人成績表!H24)","v":4},null,null,{"$f":"IF(●【結果】個人成績表!S24=\"\",\"\",●【結果】個人成績表!S24-●【結果】個人成績表!I24)","v":2},null,null,{"$f":"IF(E22=\"\",\"\",SUM(E22:G27,Q22:S27))","v":18},null,null,null,{"$f":"IF(H22=\"\",\"\",SUM(H22:J27,T22:V27))","v":18},null,null,null,{"$f":"IF(●【結果】個人成績表!BH24=0,\"\",\"(\"&●【結果】個人成績表!BH24&\")\")","v":"(5035)"},null,null,null,{"$f":"●【結果】個人成績表!BH24","v":5035},{"$f":"●【結果】個人成績表!CF24","v":5035},{"$f":"IF(AE24=\"\",\"\",RANK(W$16:W$33,W$16:W$33,0))","v":2}]
[]
[null,null,null,null,{"$f":"N18","v":3},null,null,{"$f":"K18","v":3},null,null,null,null,null,null,null,null,{"$f":"IF(●【結果】個人成績表!AL24=\"\",\"\",●【結果】個人成績表!AL24-●【結果】個人成績表!AB24)","v":3},null,null,{"$f":"IF(●【結果】個人成績表!AM24=\"\",\"\",●【結果】個人成績表!AM24-●【結果】個人成績表!AC24)","v":3},null,null,null,null,null,null,null,null,null,null,{"$f":"IF(●【結果】個人成績表!CF24=0,\"\",●【結果】個人成績表!CF24)","v":5035}]
[]
[null,null,null,null,{"$f":"N20","v":3},null,null,{"$f":"K20","v":3},null,null,null,null,null,null,null,null,{"$f":"IF(●【結果】個人成績表!BF24=\"\",\"\",●【結果】個人成績表!BF24-●【結果】個人成績表!AV24)","v":2},null,null,{"$f":"IF(●【結果】個人成績表!BG24=\"\",\"\",●【結果】個人成績表!BG24-●【結果】個人成績表!AW24)","v":4}]
[]
[null,{"$f":"IF(【準備】登録!I17=\"\",\"\",【準備】登録!I17)","v":"奈良"},null,null,{"$f":"●【結果】個人成績表!H34","v":3},null,null,{"$f":"●【結果】個人成績表!I34","v":3},null,null,{"$f":"T22","v":2},null,null,{"$f":"Q22","v":4},null,null,null,null,null,null,null,null,{"$f":"IF(E28=\"\",\"\",SUM(E28:G33,K28:M33))","v":14},null,null,null,{"$f":"IF(H28=\"\",\"\",SUM(H28:J33,N28:P33))","v":22},null,null,null,{"$f":"IF(●【結果】個人成績表!BH34=0,\"\",\"(\"&●【結果】個人成績表!BH34&\")\")","v":"(4680)"},null,null,null,{"$f":"●【結果】個人成績表!BH34","v":4680},{"$f":"●【結果】個人成績表!CF34","v":4680},{"$f":"IF(AE30=\"\",\"\",RANK(W$16:W$33,W$16:W$33,0))","v":3}]
[]
[null,null,null,null,{"$f":"T18","v":2},null,null,{"$f":"Q18","v":4},null,null,{"$f":"T24","v":3},null,null,{"$f":"Q24","v":3},null,null,null,null,null,null,null,null,null,null,null,null,null,null,null,null,{"$f":"IF(●【結果】個人成績表!CF34=0,\"\",●【結果】個人成績表!CF34)","v":4680}]
[]
[null,null,null,null,{"$f":"T20","v":0},null,null,{"$f":"Q20","v":6},null,null,{"$f":"T26","v":4},null,null,{"$f":"Q26","v":2}]
[]
[null,null,null,"※","TPの上段（　　）内の数字は、ハンデによる換算をしていない得点を示す。"]

{"sheet":"●【結果】個人成績表","index":3,"n_rows":35,"n_cols":90,"rows_kept":35,"cut":false,"hidden":false,"merged":[[28,59,28,60],[32,49,32,50],[28,53,28,54],[28,49,28,50],[28,51,28,52],[32,43,32,44],[1,64,1,69],[33,49,33,50],[33,29,33,30],[33,53,33,54],[33,59,33,60],[33,43,33,44],[31,43,31,44],[31,59,31,60],[31,53,31,54],[31,49,31,50],[32,59,32,60],[32,53,32,54],[30,43,30,44],[30,59,30,60],[30,53,30,54],[30,49,30,50],[30,51,30,52],[29,43,29,44],[31,39,31,40],[29,59,29,60],[29,53,29,54],[29,49,29,50],[29,51,29,52],[28,43,28,44],[33,1,33,3],[33,5,33,6],[33,19,33,20],[33,13,33,14],[32,23,32,24],[32,39,32,40],[32,33,32,34],[32,1,32,3],[32,5,32,6],[32,19,32,20],[32,13,32,14],[32,11,32,12],[32,31,32,32],[33,31,33,32],[33,9,33,10],[33,33,33,34],[33,39,33,40],[33,23,33,24],[32,29,32,30],[33,11,33,12],[32,21,32,22],[33,21,33,22],[32,9,32,10],[31,33,31,34],[31,29,31,30],[31,31,31,32],[31,1,31,3],[31,5,31,6],[31,19,31,20],[31,13,31,14],[31,9,31,10],[31,11,31,12],[31,21,31,22],[31,23,31,24],[30,23,30,24],[30,39,30,40],[30,33,30,34],[30,29,30,30],[30,31,30,32],[30,1,30,3],[30,5,30,6],[30,19,30,20],[30,13,30,14],[30,9,30,10],[30,11,30,12],[30,21,30,22],[29,23,29,24],[29,39,29,40],[29,33,29,34],[29,29,29,30],[29,31,29,32],[29,1,29,3],[29,5,29,6],[29,19,29,20],[29,13,29,14],[29,9,29,10],[29,11,29,12],[29,21,29,22],[28,23,28,24],[28,39,28,40],[28,33,28,34],[28,29,28,30],[28,31,28,32],[28,1,28,3],[28,5,28,6],[28,19,28,20],[28,13,28,14],[28,9,28,10],[28,11,28,12],[28,21,28,22],[28,41,28,42],[26,31,26,32],[27,43,27,44],[27,1,27,3],[27,5,27,6],[27,19,27,20],[27,13,27,14],[27,59,27,60],[27,53,27,54],[27,49,27,50],[27,51,27,52],[27,23,27,24],[27,39,27,40],[27,33,27,34],[27,29,27,30],[27,31,27,32],[27,41,27,42],[27,9,27,10],[27,11,27,12],[27,21,27,22],[26,1,26,3],[26,5,26,6],[26,19,26,20],[26,13,26,14],[26,9,26,10],[25,33,25,34],[25,29,25,30],[25,43,25,44],[25,59,25,60],[25,53,25,54],[25,49,25,50],[25,41,25,42],[26,11,26,12],[26,21,26,22],[26,41,26,42],[26,43,26,44],[26,59,26,60],[26,53,26,54],[26,49,26,50],[26,51,26,52],[26,23,26,24],[26,39,26,40],[26,33,26,34],[26,29,26,30],[24,23,24,24],[24,39,24,40],[24,21,24,22],[24,59,24,60],[24,53,24,54],[24,49,24,50],[25,1,25,3],[25,5,25,6],[25,19,25,20],[25,13,25,14],[25,9,25,10],[25,23,25,24],[25,39,25,40],[24,1,24,3],[24,5,24,6],[24,19,24,20],[24,13,24,14],[24,9,24,10],[24,11,24,12],[25,11,25,12],[25,21,25,22],[25,31,25,32],[24,33,24,34],[24,29,24,30],[24,43,24,44],[22,43,22,44],[22,39,22,40],[22,33,22,34],[22,59,22,60],[22,53,22,54],[24,31,24,32],[23,33,23,34],[23,39,23,40],[22,49,22,50],[23,59,23,60],[23,43,23,44],[23,49,23,50],[22,31,22,32],[23,31,23,32],[23,53,23,54],[23,23,23,24],[23,11,23,12],[23,21,23,22],[23,29,23,30],[21,53,21,54],[21,49,21,50],[21,51,21,52],[21,23,21,24],[21,39,21,40],[21,33,21,34],[21,29,21,30],[21,31,21,32],[22,23,22,24],[22,29,22,30],[22,19,22,20],[22,13,22,14],[22,11,22,12],[22,21,22,22],[23,13,23,14],[23,19,23,20],[23,5,23,6],[21,5,21,6],[21,19,21,20],[21,13,21,14],[21,9,21,10],[21,11,21,12],[23,9,23,10],[22,5,22,6],[22,9,22,10],[20,5,20,6],[20,19,20,20],[20,13,20,14],[20,9,20,10],[20,11,20,12],[20,21,20,22],[21,21,21,22],[21,43,21,44],[21,59,21,60],[20,43,20,44],[20,59,20,60],[20,53,20,54],[20,49,20,50],[20,51,20,52],[20,23,20,24],[20,39,20,40],[20,33,20,34],[20,29,20,30],[20,31,20,32],[19,59,19,60],[19,53,19,54],[19,49,19,50],[19,51,19,52],[19,23,19,24],[19,39,19,40],[19,33,19,34],[19,29,19,30],[19,31,19,32],[18,59,18,60],[18,53,18,54],[18,49,18,50],[18,51,18,52],[18,23,18,24],[18,39,18,40],[18,33,18,34],[18,29,18,30],[18,31,18,32],[17,53,17,54],[17,49,17,50],[17,51,17,52],[17,23,17,24],[17,39,17,40],[17,33,17,34],[17,29,17,30],[17,31,17,32],[19,1,19,3],[19,5,19,6],[19,19,19,20],[19,13,19,14],[19,9,19,10],[19,11,19,12],[18,43,18,44],[18,1,18,3],[18,5,18,6],[18,19,18,20],[18,13,18,14],[18,9,18,10],[18,11,18,12],[18,21,18,22],[19,21,19,22],[19,43,19,44],[17,5,17,6],[17,19,17,20],[17,13,17,14],[17,9,17,10],[17,11,17,12],[16,43,16,44],[16,59,16,60],[16,53,16,54],[16,49,16,50],[16,51,16,52],[16,23,16,24],[16,39,16,40],[16,33,16,34],[16,29,16,30],[16,31,16,32],[16,5,16,6],[16,19,16,20],[16,13,16,14],[16,9,16,10],[16,11,16,12],[16,21,16,22],[17,21,17,22],[17,43,17,44],[17,59,17,60],[15,23,15,24],[15,39,15,40],[14,33,14,34],[14,29,14,30],[14,31,14,32],[15,11,15,12],[15,21,15,22],[15,59,15,60],[15,53,15,54],[15,49,15,50],[15,51,15,52],[15,33,15,34],[15,29,15,30],[15,31,15,32],[15,43,15,44],[14,59,14,60],[14,53,14,54],[14,49,14,50],[14,43,14,44],[15,41,15,42],[14,23,14,24],[14,21,14,22],[14,41,14,42],[13,5,13,6],[13,9,13,10],[13,11,13,12],[15,1,15,3],[15,5,15,6],[15,19,15,20],[15,13,15,14],[15,9,15,10],[14,1,14,3],[14,5,14,6],[14,19,14,20],[14,13,14,14],[14,9,14,10],[14,11,14,12],[13,19,13,20],[13,59,13,60],[12,53,12,54],[12,59,12,60],[11,43,11,44],[13,33,13,34],[13,39,13,40],[13,31,13,32],[14,39,14,40],[13,43,13,44],[13,41,13,42],[12,41,12,42],[12,39,12,40],[11,33,11,34],[11,59,11,60],[13,49,13,50],[11,53,11,54],[12,43,12,44],[12,49,12,50],[13,53,13,54],[11,39,11,40],[12,31,12,32],[10,43,10,44],[10,49,10,50],[9,31,9,32],[10,31,10,32],[11,49,11,50],[11,41,11,42],[9,59,9,60],[10,33,10,34],[10,29,10,30],[10,53,10,54],[10,59,10,60],[9,51,9,52],[10,51,10,52],[9,39,9,40],[9,43,9,44],[9,49,9,50],[9,33,9,34],[9,29,9,30],[9,41,9,42],[10,41,10,42],[9,53,9,54],[10,39,10,40],[11,29,11,30],[11,31,11,32],[7,59,7,60],[8,43,8,44],[8,49,8,50],[8,53,8,54],[8,59,8,60],[8,51,8,52],[7,51,7,52],[5,29,5,30],[6,53,6,54],[5,53,5,54],[5,59,5,60],[5,43,5,44],[5,49,5,50],[6,59,6,60],[5,51,5,52],[8,39,8,40],[8,31,8,32],[5,41,5,42],[8,41,8,42],[7,43,7,44],[7,49,7,50],[7,33,7,34],[7,29,7,30],[7,53,7,54],[8,33,8,34],[8,29,8,30],[8,23,8,24],[9,23,9,24],[12,23,12,24],[13,23,13,24],[13,29,13,30],[11,23,11,24],[12,33,12,34],[8,19,8,20],[9,19,9,20],[10,19,10,20],[13,21,13,22],[10,23,10,24],[12,29,12,30],[11,13,11,14],[12,13,12,14],[10,13,10,14],[11,19,11,20],[12,19,12,20],[13,13,13,14],[7,13,7,14],[8,13,8,14],[4,59,4,60],[4,51,4,52],[4,23,4,24],[4,29,4,30],[4,33,4,34],[4,39,4,40],[4,31,4,32],[4,41,4,42],[6,43,6,44],[6,49,6,50],[6,51,6,52],[7,31,7,32],[6,41,6,42],[7,41,7,42],[4,43,4,44],[4,49,4,50],[4,53,4,54],[5,23,5,24],[6,23,6,24],[6,39,6,40],[6,33,6,34],[6,29,6,30],[5,39,5,40],[5,33,5,34],[7,19,7,20],[5,31,5,32],[6,31,6,32],[7,23,7,24],[7,39,7,40],[5,19,5,20],[6,19,6,20],[4,11,4,12],[5,11,5,12],[6,11,6,12],[7,11,7,12],[8,11,8,12],[9,11,9,12],[10,11,10,12],[11,5,11,6],[12,5,12,6],[4,9,4,10],[11,9,11,10],[12,9,12,10],[11,11,11,12],[12,11,12,12],[4,19,4,20],[5,13,5,14],[6,13,6,14],[8,21,8,22],[9,21,9,22],[10,21,10,22],[11,21,11,22],[12,21,12,22],[4,0,13,0],[4,5,4,6],[5,5,5,6],[6,5,6,6],[7,5,7,6],[8,5,8,6],[9,5,9,6],[9,13,9,14],[5,9,5,10],[6,9,6,10],[7,9,7,10],[8,9,8,10],[9,9,9,10],[10,9,10,10],[10,5,10,6],[4,13,4,14],[14,0,23,0],[24,0,33,0],[12,1,12,3],[8,1,8,3],[9,1,9,3],[10,1,10,3],[11,1,11,3],[4,1,4,3],[5,1,5,3],[6,1,6,3],[7,1,7,3],[13,1,13,3],[17,1,17,3],[16,1,16,3],[21,1,21,3],[20,1,20,3],[23,1,23,3],[22,1,22,3],[29,41,29,42],[30,41,30,42],[31,41,31,42],[32,41,32,42],[33,41,33,42],[11,51,11,52],[12,51,12,52],[13,51,13,52],[14,51,14,52],[22,51,22,52],[23,51,23,52],[24,51,24,52],[25,51,25,52],[31,51,31,52],[32,51,32,52],[33,51,33,52],[16,41,16,42],[17,41,17,42],[18,41,18,42],[19,41,19,42],[20,41,20,42],[21,41,21,42],[22,41,22,42],[23,41,23,42],[3,5,3,22],[3,23,3,42],[3,43,3,62],[27,61,27,62],[23,61,23,62],[24,61,24,62],[25,61,25,62],[26,61,26,62],[19,61,19,62],[20,61,20,62],[4,61,4,62],[5,61,5,62],[6,61,6,62],[7,61,7,62],[8,61,8,62],[9,61,9,62],[10,61,10,62],[16,61,16,62],[17,61,17,62],[24,41,24,42],[4,21,4,22],[5,21,5,22],[6,21,6,22],[7,21,7,22],[3,64,3,69],[31,61,31,62],[32,61,32,62],[33,61,33,62],[28,61,28,62],[29,61,29,62],[30,61,30,62],[21,61,21,62],[22,61,22,62],[15,61,15,62],[18,61,18,62],[11,61,11,62],[12,61,12,62],[13,61,13,62],[14,61,14,62]]}
[{"$f":"【準備】登録!D2&【準備】登録!E2&【準備】登録!F2&\"　\"&【準備】登録!G2&【準備】登録!I2&\"　　　\"&\"(\"&【準備】登録!K6&\"；\"&【準備】登録!D6&\")\"","v":"第8回　神奈滋対抗戦　　　(奈良；キングスポット)"}]
[null,null,null,null,null,null,null,null,null,null,null,null,null,null,null,null,null,null,null,null,null,null,null,null,null,null,null,null,null,null,null,null,null,null,null,null,null,null,null,null,null,null,null,null,null,null,null,null,null,null,null,null,null,null,null,null,null,null,null,null,null,null,null,null,{"$f":"【準備】登録!D4","v":"2017-10-22"}]
[]
[null,null,null,null,null,{"$f":"●【進行】結果入力表!A9","v":"第1節"},null,null,null,null,null,null,null,null,null,null,null,null,null,null,null,null,null,{"$f":"●【進行】結果入力表!A33","v":"第2節"},null,null,null,null,null,null,null,null,null,null,null,null,null,null,null,null,null,null,null,{"$f":"●【進行】結果入力表!A57","v":"第3節"},null,null,null,null,null,null,null,null,null,null,null,null,null,null,null,null,null,null,null,"順","HR記録",null,null,null,null,null,null,"HR",null,null,"HR_Point","Rank","氏名","クラブ","MAX",null,"Rank","途中経過"]
[{"$f":"IF(【準備】登録!C17=\"\",\"\",【準備】登録!C17)","v":"兵庫"},"選手名",null,null,"持点",{"$f":"A25","v":"奈良"},null,"W","L","TP",null,"TP",null,{"$f":"A15","v":"滋賀"},null,"W","L","W","L","TP",null,"TP",null,{"$f":"F5","v":"奈良"},null,"W","L","W","L","TP",null,"TP",null,{"$f":"N5","v":"滋賀"},null,"W","L","W","L","TP",null,"TP",null,{"$f":"F5","v":"奈良"},null,"W","L","W","L","TP",null,"TP",null,{"$f":"N5","v":"滋賀"},null,"W","L","W","L","TP",null,"TP",null,"R","1G","2G","3G","4G","5G","6G",null,"A","B","P",null,null,null,null,null,null,null,"W","L","TP","R_P",null,null,"MVP、VP"]
[null,{"$f":"IF(【準備】登録!$C$20=0,\"\",【準備】登録!$C$20)","v":"宮本　一"},null,null,{"$f":"【準備】登録!E20","v":180},{"$f":"IFERROR(VLOOKUP($F$4&$A$5&F$5&$B6,結果リスト!$A:$F,6,FALSE),\"\")","v":"W"},null,{"$f":"IF(F6=\"\",\"\",IF(F6=\"w\",1,0))","v":1},{"$f":"IF(F6=\"\",\"\",IF(F6=\"w\",0,1))","v":0},{"$f":"IF(F6=\"\",\"\",IF(F6=\"w\",E6,F6))","v":180},null,{"$f":"IF($F6=\"\",\"\",J6/$E6*180)","v":180},null,{"$f":"IFERROR(VLOOKUP($F$4&$A$5&N$5&$B6,結果リスト!$A:$F,6,FALSE),\"\")","v":"W"},null,{"$f":"IF(N6=\"\",\"\",IF(N6=\"w\",1,0))","v":1},{"$f":"IF(N6=\"\",\"\",IF(N6=\"w\",0,1))","v":0},{"$f":"IF(N6=\"\",\"\",SUM(H6,P6))","v":2},{"$f":"IF(N6=\"\",\"\",SUM(I6,Q6))","v":0},{"$f":"IF(N6=\"\",\"\",IF(N6=\"w\",E6+J6,N6+J6))","v":360},null,{"$f":"IF($N6=\"\",\"\",T6/$E6*180)","v":360},null,{"$f":"IFERROR(VLOOKUP($X$4&$A$5&X$5&$B6,結果リスト!$A:$F,6,FALSE),\"\")","v":"W"},null,{"$f":"IF(X6=\"\",\"\",IF(X6=\"w\",1,0))","v":1},{"$f":"IF(X6=\"\",\"\",IF(X6=\"w\",0,1))","v":0},{"$f":"IF(X6=\"\",\"\",SUM(R6,Z6))","v":3},{"$f":"IF(X6=\"\",\"\",SUM(S6,AA6))","v":0},{"$f":"IF(X6=\"\",\"\",IF(X6=\"w\",T6+E6,X6+T6))","v":540},null,{"$f":"IF($X6=\"\",\"\",AD6/$E6*180)","v":540},null,{"$f":"IFERROR(VLOOKUP($X$4&$A$5&AH$5&$B6,結果リスト!$A:$F,6,FALSE),\"\")","v":"W"},null,{"$f":"IF(AH6=\"\",\"\",IF(AH6=\"w\",1,0))","v":1},{"$f":"IF(AH6=\"\",\"\",IF(AH6=\"w\",0,1))","v":0},{"$f":"IF(AH6=\"\",\"\",SUM(AB6,AJ6))","v":4},{"$f":"IF(AH6=\"\",\"\",SUM(AC6,AK6))","v":0},{"$f":"IF(AH6=\"\",\"\",IF(AH6=\"w\",AD6+E6,AH6+AD6))","v":720},null,{"$f":"IF($AH6=\"\",\"\",AN6/$E6*180)","v":720},null,{"$f":"IFERROR(VLOOKUP($AR$4&$A$5&AR$5&$B6,結果リスト!$A:$F,6,FALSE),\"\")","v":"W"},null,{"$f":"IF(AR6=\"\",\"\",IF(AR6=\"w\",1,0))","v":1},{"$f":"IF(AR6=\"\",\"\",IF(AR6=\"w\",0,1))","v":0},{"$f":"IF(AR6=\"\",\"\",IF(AR6=\"w\",AL6+1,AL6))","v":5},{"$f":"IF(AR6=\"\",\"\",IF(AR6=\"w\",AM6,AM6+1))","v":0},{"$f":"IF(AR6=\"\",\"\",IF(AR6=\"w\",AN6+E6,AR6+AN6))","v":900},null,{"$f":"IF($AR6=\"\",\"\",AX6/$E6*180)","v":900},null,{"$f":"IFERROR(VLOOKUP($AR$4&$A$5&BB$5&$B6,結果リスト!$A:$F,6,FALSE),\"\")","v":"W"},null,{"$f":"IF(BB6=\"\",\"\",IF(BB6=\"w\",1,0))","v":1},{"$f":"IF(BB6=\"\",\"\",IF(BB6=\"w\",0,1))","v":0},{"$f":"IF(BB6=\"\",\"\",IF(BB6=\"w\",AV6+1,AV6))","v":6},{"$f":"IF(BB6=\"\",\"\",IF(BB6=\"w\",AW6,AW6+1))","v":0},{"$f":"IF(BB6=\"\",\"\",IF(BB6=\"w\",AX6+E6,BB6+AX6))","v":1080},null,{"$f":"IF($BB6=\"\",\"\",BH6/$E6*180)","v":1080},null,{"$f":"IF(SUM(H6:I6,R6:S6)=0,\"\",IF(B$12=\"\",RANK($CG$6:$CG$12,$CG$6:$CG$12,0),RANK($CG$6:$CG$13,$CG$6:$CG$13,0)))","v":1},{"$f":"IF(●【進行】結果入力表!E9=\"\",\"\",●【進行】結果入力表!E9)","v":""},{"$f":"IF(●【進行】結果入力表!E17=\"\",\"\",●【進行】結果入力表!E17)","v":""},{"$f":"IF(●【進行】結果入力表!E35=\"\",\"\",●【進行】結果入力表!E35)","v":108},{"$f":"IF(●【進行】結果入力表!E43=\"\",\"\",●【進行】結果入力表!E43)","v":""},{"$f":"IFERROR(VLOOKUP(B6,●【進行】結果入力表!$D$57:$E$64,2,FALSE),\"\")","v":0},{"$f":"IF(●【進行】結果入力表!E69=\"\",\"\",●【進行】結果入力表!E69)","v":""},null,{"$f":"COUNTIF($BM6:$BR6,BT$5)","v":0},{"$f":"COUNTIF($BM6:$BR6,BU$5)","v":0},{"$f":"MAX($BM6:$BR6)","v":108},{"$f":"BT6*10000+BU6*1000+BV6","v":108},{"$f":"RANK(BW6,$BW$6:$BW$33)","v":2},{"$f":"B6","v":"宮本　一"},{"$f":"$A$5","v":"兵庫"},{"$f":"IF(BT6>0,\"A\"&E6,IF(BU6>0,\"B\"&E6,BV6))","v":108},null,null,{"$f":"COUNTIF(F6:BC6,\"w\")","v":6},{"$f":"COUNT(F6,N6,AH6,X6,AR6,BB6)","v":0},{"$f":"CD6*180+SUM(F6,N6,AH6,X6,AR6,BB6)*180/E6","v":1080},{"$f":"CD6*100000+CF6","v":601080},null,{"$f":"RANK(CL6,CL6:CL8)","v":1},{"$f":"A5","v":"兵庫"},{"$f":"VLOOKUP(1,BL6:CG13,14,FALSE)","v":"宮本　一"},{"$f":"VLOOKUP(1,BL6:CG13,22,FALSE)","v":601080}]
[null,{"$f":"IF(【準備】登録!$C$20=0,\"\",【準備】登録!$C$21)","v":"鐵山　泰三"},null,null,{"$f":"【準備】登録!E21","v":180},{"$f":"IFERROR(VLOOKUP($F$4&$A$5&F$5&$B7,結果リスト!$A:$F,6,FALSE),\"\")","v":26},null,{"$f":"IF(F7=\"\",\"\",IF(F7=\"w\",1,0))","v":0},{"$f":"IF(F7=\"\",\"\",IF(F7=\"w\",0,1))","v":1},{"$f":"IF(F7=\"\",\"\",IF(F7=\"w\",E7,F7))","v":26},null,{"$f":"IF($F7=\"\",\"\",J7/$E7*180)","v":25.999999999999996},null,{"$f":"IFERROR(VLOOKUP($F$4&$A$5&N$5&$B7,結果リスト!$A:$F,6,FALSE),\"\")","v":"W"},null,{"$f":"IF(N7=\"\",\"\",IF(N7=\"w\",1,0))","v":1},{"$f":"IF(N7=\"\",\"\",IF(N7=\"w\",0,1))","v":0},{"$f":"IF(N7=\"\",\"\",SUM(H7,P7))","v":1},{"$f":"IF(N7=\"\",\"\",SUM(I7,Q7))","v":1},206,null,206,null,{"$f":"IFERROR(VLOOKUP($X$4&$A$5&X$5&$B7,結果リスト!$A:$F,6,FALSE),\"\")","v":"W"},null,{"$f":"IF(X7=\"\",\"\",IF(X7=\"w\",1,0))","v":1},{"$f":"IF(X7=\"\",\"\",IF(X7=\"w\",0,1))","v":0},{"$f":"IF(X7=\"\",\"\",SUM(R7,Z7))","v":2},{"$f":"IF(X7=\"\",\"\",SUM(S7,AA7))","v":1},386,null,386,null,{"$f":"IFERROR(VLOOKUP($X$4&$A$5&AH$5&$B7,結果リスト!$A:$F,6,FALSE),\"\")","v":"W"},null,{"$f":"IF(AH7=\"\",\"\",IF(AH7=\"w\",1,0))","v":1},{"$f":"IF(AH7=\"\",\"\",IF(AH7=\"w\",0,1))","v":0},{"$f":"IF(AH7=\"\",\"\",SUM(AB7,AJ7))","v":3},{"$f":"IF(AH7=\"\",\"\",SUM(AC7,AK7))","v":1},566,null,566,null,{"$f":"IFERROR(VLOOKUP($AR$4&$A$5&AR$5&$B7,結果リスト!$A:$F,6,FALSE),\"\")","v":"W"},null,{"$f":"IF(AR7=\"\",\"\",IF(AR7=\"w\",1,0))","v":1},{"$f":"IF(AR7=\"\",\"\",IF(AR7=\"w\",0,1))","v":0},{"$f":"IF(AR7=\"\",\"\",IF(AR7=\"w\",AL7+1,AL7))","v":4},{"$f":"IF(AR7=\"\",\"\",IF(AR7=\"w\",AM7,AM7+1))","v":1},746,null,746.00000000000011,null,{"$f":"IFERROR(VLOOKUP($AR$4&$A$5&BB$5&$B7,結果リスト!$A:$F,6,FALSE),\"\")","v":178},null,{"$f":"IF(BB7=\"\",\"\",IF(BB7=\"w\",1,0))","v":0},{"$f":"IF(BB7=\"\",\"\",IF(BB7=\"w\",0,1))","v":1},{"$f":"IF(BB7=\"\",\"\",IF(BB7=\"w\",AV7+1,AV7))","v":4},{"$f":"IF(BB7=\"\",\"\",IF(BB7=\"w\",AW7,AW7+1))","v":2},924,null,924.00000000000011,null,{"$f":"IF(SUM(H7:I7,R7:S7)=0,\"\",IF(B$13=\"\",RANK($CG$6:$CG$12,$CG$6:$CG$12,0),RANK($CG$6:$CG$13,$CG$6:$CG$13,0)))","v":3},{"$f":"IF(●【進行】結果入力表!E10=\"\",\"\",●【進行】結果入力表!E10)","v":""},{"$f":"IF(●【進行】結果入力表!E18=\"\",\"\",●【進行】結果入力表!E18)","v":""},{"$f":"IF(●【進行】結果入力表!E36=\"\",\"\",●【進行】結果入力表!E36)","v":100},{"$f":"IF(●【進行】結果入力表!E44=\"\",\"\",●【進行】結果入力表!E44)","v":""},{"$f":"IFERROR(VLOOKUP(B7,●【進行】結果入力表!$D$57:$E$64,2,FALSE),\"\")","v":0},{"$f":"IF(●【進行】結果入力表!E70=\"\",\"\",●【進行】結果入力表!E70)","v":""},null,{"$f":"COUNTIF($BM7:$BR7,BT$5)","v":0},0,{"$f":"MAX($BM7:$BR7)","v":100},{"$f":"BT7*10000+BU7*1000+BV7","v":100},{"$f":"RANK(BW7,$BW$6:$BW$33)","v":6},{"$f":"B7","v":"鐵山　泰三"},{"$f":"$A$5","v":"兵庫"},100,null,null,4,2,924,{"$f":"CD7*100000+CF7","v":400924},null,{"$f":"RANK(CL7,CL6:CL8)","v":2},{"$f":"A15","v":"滋賀"},{"$f":"VLOOKUP(1,BL16:CG23,14,FALSE)","v":"大橋　義治"},{"$f":"VLOOKUP(1,BL16:CG23,22,FALSE)","v":501076}]
[null,{"$f":"IF(【準備】登録!$C$20=0,\"\",【準備】登録!$C$22)","v":"中尾　亮太"},null,null,{"$f":"【準備】登録!E22","v":180},{"$f":"IFERROR(VLOOKUP($F$4&$A$5&F$5&$B8,結果リスト!$A:$F,6,FALSE),\"\")","v":24},null,0,1,24,null,24,null,{"$f":"IFERROR(VLOOKUP($F$4&$A$5&N$5&$B8,結果リスト!$A:$F,6,FALSE),\"\")","v":153},null,0,1,0,2,177,null,177,null,{"$f":"IFERROR(VLOOKUP($X$4&$A$5&X$5&$B8,結果リスト!$A:$F,6,FALSE),\"\")","v":53},null,0,1,0,3,230,null,229.99999999999997,null,{"$f":"IFERROR(VLOOKUP($X$4&$A$5&AH$5&$B8,結果リスト!$A:$F,6,FALSE),\"\")","v":149},null,0,1,0,4,379,null,379,null,{"$f":"IFERROR(VLOOKUP($AR$4&$A$5&AR$5&$B8,結果リスト!$A:$F,6,FALSE),\"\")","v":"W"},null,1,0,1,4,559,null,559,null,{"$f":"IFERROR(VLOOKUP($AR$4&$A$5&BB$5&$B8,結果リスト!$A:$F,6,FALSE),\"\")","v":"W"},null,1,0,2,4,739,null,738.99999999999989,null,6,{"$f":"IF(●【進行】結果入力表!E11=\"\",\"\",●【進行】結果入力表!E11)","v":""},{"$f":"IF(●【進行】結果入力表!E19=\"\",\"\",●【進行】結果入力表!E19)","v":""},{"$f":"IF(●【進行】結果入力表!E37=\"\",\"\",●【進行】結果入力表!E37)","v":""},{"$f":"IF(●【進行】結果入力表!E45=\"\",\"\",●【進行】結果入力表!E45)","v":""},{"$f":"IFERROR(VLOOKUP(B8,●【進行】結果入力表!$D$57:$E$64,2,FALSE),\"\")","v":0},{"$f":"IF(●【進行】結果入力表!E71=\"\",\"\",●【進行】結果入力表!E71)","v":""},null,0,0,0,0,7,"中尾　亮太","兵庫",0,null,null,2,4,739,200739,null,{"$f":"RANK(CL8,CL6:CL8)","v":3},{"$f":"A25","v":"奈良"},{"$f":"VLOOKUP(1,BL26:CG33,14,FALSE)","v":"吉向　翔平"},{"$f":"VLOOKUP(1,BL26:CG33,22,FALSE)","v":400981}]
[null,{"$f":"IF(【準備】登録!$C$20=0,\"\",【準備】登録!$C$23)","v":"平井　洸志"},null,null,{"$f":"【準備】登録!E23","v":180},{"$f":"IFERROR(VLOOKUP($F$4&$A$5&F$5&$B9,結果リスト!$A:$F,6,FALSE),\"\")","v":24},null,0,1,24,null,24,null,{"$f":"IFERROR(VLOOKUP($F$4&$A$5&N$5&$B9,結果リスト!$A:$F,6,FALSE),\"\")","v":102},null,0,1,0,2,126,null,125.99999999999999,null,{"$f":"IFERROR(VLOOKUP($X$4&$A$5&X$5&$B9,結果リスト!$A:$F,6,FALSE),\"\")","v":"W"},null,1,0,1,2,306,null,306,null,{"$f":"IFERROR(VLOOKUP($X$4&$A$5&AH$5&$B9,結果リスト!$A:$F,6,FALSE),\"\")","v":"W"},null,1,0,2,2,486,null,486.00000000000006,null,{"$f":"IFERROR(VLOOKUP($AR$4&$A$5&AR$5&$B9,結果リスト!$A:$F,6,FALSE),\"\")","v":"W"},null,1,0,3,2,666,null,666,null,{"$f":"IFERROR(VLOOKUP($AR$4&$A$5&BB$5&$B9,結果リスト!$A:$F,6,FALSE),\"\")","v":45},null,0,1,3,3,711,null,711,null,5,{"$f":"IF(●【進行】結果入力表!E12=\"\",\"\",●【進行】結果入力表!E12)","v":""},{"$f":"IF(●【進行】結果入力表!E20=\"\",\"\",●【進行】結果入力表!E20)","v":""},{"$f":"IF(●【進行】結果入力表!E38=\"\",\"\",●【進行】結果入力表!E38)","v":""},{"$f":"IF(●【進行】結果入力表!E46=\"\",\"\",●【進行】結果入力表!E46)","v":""},{"$f":"IFERROR(VLOOKUP(B9,●【進行】結果入力表!$D$57:$E$64,2,FALSE),\"\")","v":0},{"$f":"IF(●【進行】結果入力表!D$72=\"\",IF(●【進行】結果入力表!E65=\"\",\"\",●【進行】結果入力表!E65),IF(●【進行】結果入力表!E72=\"\",\"\",●【進行】結果入力表!E72))","v":""},null,0,0,0,0,7,"平井　洸志","兵庫",0,null,null,3,3,711,300711]
[null,{"$f":"IF(【準備】登録!$C$20=0,\"\",【準備】登録!$C$24)","v":"堂園　雅也"},null,null,{"$f":"【準備】登録!E24","v":180},{"$f":"IFERROR(VLOOKUP($F$4&$A$5&F$5&$B10,結果リスト!$A:$F,6,FALSE),\"\")","v":"W"},null,1,0,180,null,180,null,{"$f":"IFERROR(VLOOKUP($F$4&$A$5&N$5&$B10,結果リスト!$A:$F,6,FALSE),\"\")","v":"W"},null,1,0,2,0,360,null,360,null,{"$f":"IFERROR(VLOOKUP($X$4&$A$5&X$5&$B10,結果リスト!$A:$F,6,FALSE),\"\")","v":"W"},null,1,0,3,0,540,null,540,null,{"$f":"IFERROR(VLOOKUP($X$4&$A$5&AH$5&$B10,結果リスト!$A:$F,6,FALSE),\"\")","v":156},null,0,1,3,1,696,null,696,null,{"$f":"IFERROR(VLOOKUP($AR$4&$A$5&AR$5&$B10,結果リスト!$A:$F,6,FALSE),\"\")","v":"W"},null,1,0,4,1,876,null,875.99999999999989,null,{"$f":"IFERROR(VLOOKUP($AR$4&$A$5&BB$5&$B10,結果リスト!$A:$F,6,FALSE),\"\")","v":88},null,0,1,4,2,964,null,963.99999999999989,null,2,{"$f":"IF(●【進行】結果入力表!E13=\"\",\"\",●【進行】結果入力表!E13)","v":""},{"$f":"IF(●【進行】結果入力表!E21=\"\",\"\",●【進行】結果入力表!E21)","v":""},{"$f":"IF(●【進行】結果入力表!E39=\"\",\"\",●【進行】結果入力表!E39)","v":""},{"$f":"IF(●【進行】結果入力表!E47=\"\",\"\",●【進行】結果入力表!E47)","v":""},{"$f":"IFERROR(VLOOKUP(B10,●【進行】結果入力表!$D$57:$E$64,2,FALSE),\"\")","v":110},{"$f":"IF(●【進行】結果入力表!D$72=\"\",IF(●【進行】結果入力表!E66=\"\",\"\",●【進行】結果入力表!E66),IF(●【進行】結果入力表!E65=\"\",\"\",●【進行】結果入力表!E65))","v":""},null,0,0,110,110,1,"堂園　雅也","兵庫",110,null,null,4,2,964,400964]
[null,{"$f":"IF(【準備】登録!$C$20=0,\"\",【準備】登録!$C$25)","v":"藤中　健太郎"},null,null,{"$f":"【準備】登録!E25","v":180},{"$f":"IFERROR(VLOOKUP($F$4&$A$5&F$5&$B11,結果リスト!$A:$F,6,FALSE),\"\")","v":"W"},null,1,0,180,null,180,null,{"$f":"IFERROR(VLOOKUP($F$4&$A$5&N$5&$B11,結果リスト!$A:$F,6,FALSE),\"\")","v":84},null,0,1,1,1,264,null,264,null,{"$f":"IFERROR(VLOOKUP($X$4&$A$5&X$5&$B11,結果リスト!$A:$F,6,FALSE),\"\")","v":88},null,0,1,1,2,352,null,352,null,{"$f":"IFERROR(VLOOKUP($X$4&$A$5&AH$5&$B11,結果リスト!$A:$F,6,FALSE),\"\")","v":24},null,0,1,1,3,376,null,376,null,{"$f":"IFERROR(VLOOKUP($AR$4&$A$5&AR$5&$B11,結果リスト!$A:$F,6,FALSE),\"\")","v":"W"},null,1,0,2,3,556,null,556,null,{"$f":"IFERROR(VLOOKUP($AR$4&$A$5&BB$5&$B11,結果リスト!$A:$F,6,FALSE),\"\")","v":"W"},null,1,0,3,3,736,null,736,null,4,{"$f":"IF(●【進行】結果入力表!E14=\"\",\"\",●【進行】結果入力表!E14)","v":""},{"$f":"IF(●【進行】結果入力表!E22=\"\",\"\",●【進行】結果入力表!E22)","v":""},{"$f":"IF(●【進行】結果入力表!D$48=\"\",IF(●【進行】結果入力表!E33=\"\",\"\",●【進行】結果入力表!E33),IF(●【進行】結果入力表!E40=\"\",\"\",●【進行】結果入力表!E40))","v":""},{"$f":"IF(●【進行】結果入力表!D$48=\"\",IF(●【進行】結果入力表!E41=\"\",\"\",●【進行】結果入力表!E41),IF(●【進行】結果入力表!E48=\"\",\"\",●【進行】結果入力表!E48))","v":""},{"$f":"IFERROR(VLOOKUP(B11,●【進行】結果入力表!$D$57:$E$64,2,FALSE),\"\")","v":107},{"$f":"IF(●【進行】結果入力表!D$72=\"\",IF(●【進行】結果入力表!E67=\"\",\"\",●【進行】結果入力表!E67),IF(●【進行】結果入力表!E66=\"\",\"\",●【進行】結果入力表!E66))","v":""},null,0,0,107,107,3,"藤中　健太郎","兵庫",107,null,null,3,3,736,300736]
[null,{"$f":"IF(【準備】登録!$C$27=0,\"\",【準備】登録!$C$27)","v":""},null,null,{"$f":"【準備】登録!E26","v":0},{"$f":"IFERROR(VLOOKUP($F$4&$A$5&F$5&$B12,結果リスト!$A:$F,6,FALSE),\"\")","v":""},null,"","","",null,"",null,{"$f":"IFERROR(VLOOKUP($F$4&$A$5&N$5&$B12,結果リスト!$A:$F,6,FALSE),\"\")","v":""},null,"","","","","",null,"",null,{"$f":"IFERROR(VLOOKUP($X$4&$A$5&X$5&$B12,結果リスト!$A:$F,6,FALSE),\"\")","v":""},null,"","","","","",null,"",null,{"$f":"IFERROR(VLOOKUP($X$4&$A$5&AH$5&$B12,結果リスト!$A:$F,6,FALSE),\"\")","v":""},null,"","","","","",null,"",null,{"$f":"IFERROR(VLOOKUP($AR$4&$A$5&AR$5&$B12,結果リスト!$A:$F,6,FALSE),\"\")","v":""},null,"","","","","",null,"",null,{"$f":"IFERROR(VLOOKUP($AR$4&$A$5&BB$5&$B12,結果リスト!$A:$F,6,FALSE),\"\")","v":""},null,"","","","","",null,"",null,"",{"$f":"IF(●【進行】結果入力表!E15=\"\",\"\",●【進行】結果入力表!E15)","v":""},{"$f":"IF(●【進行】結果入力表!E23=\"\",\"\",●【進行】結果入力表!E23)","v":""},{"$f":"IF(●【進行】結果入力表!D$48=\"\",IF(●【進行】結果入力表!E34=\"\",\"\",●【進行】結果入力表!E34),IF(●【進行】結果入力表!E33=\"\",\"\",●【進行】結果入力表!E33))","v":""},{"$f":"IF(●【進行】結果入力表!D$48=\"\",IF(●【進行】結果入力表!E42=\"\",\"\",●【進行】結果入力表!E42),IF(●【進行】結果入力表!E41=\"\",\"\",●【進行】結果入力表!E41))","v":""},{"$f":"IFERROR(VLOOKUP(B12,●【進行】結果入力表!$D$57:$E$64,2,FALSE),\"\")","v":""},{"$f":"IF(●【進行】結果入力表!D$72=\"\",IF(●【進行】結果入力表!E68=\"\",\"\",●【進行】結果入力表!E68),IF(●【進行】結果入力表!E67=\"\",\"\",●【進行】結果入力表!E67))","v":""},null,0,0,0,0,7,"","兵庫",0,null,null,{"$f":"IF(B12=\"\",\"\",COUNTIF(F12:BC12,\"w\"))","v":""},{"$f":"IF(B12=\"\",\"\",COUNT(F12,N12,AH12,X12,AR12,BB12))","v":""},{"$f":"IF(CD12=\"\",\"\",CD12*180+SUM(F12,N12,AH12,X12,AR12,BB12)*180/E12)","v":""},{"$f":"IF(B12=\"\",\"\",CD12*100000+CF12)","v":""}]
[null,{"$f":"IF(【準備】登録!$C$27=0,\"\",【準備】登録!$C$27)","v":""},null,null,{"$f":"IF(【準備】登録!$C$27=\"\",\"\",【準備】登録!E27)","v":""},{"$f":"IFERROR(VLOOKUP($F$4&$A$5&F$5&$B13,結果リスト!$A:$F,6,FALSE),\"\")","v":""},null,{"$f":"IF(F13=\"\",\"\",IF(F13=\"w\",1,0))","v":""},{"$f":"IF(F13=\"\",\"\",IF(F13=\"w\",0,1))","v":""},"",null,"",null,{"$f":"IFERROR(VLOOKUP($F$4&$A$5&N$5&$B13,結果リスト!$A:$F,6,FALSE),\"\")","v":""},null,"","","","","",null,"",null,{"$f":"IFERROR(VLOOKUP($X$4&$A$5&X$5&$B13,結果リスト!$A:$F,6,FALSE),\"\")","v":""},null,"","","","","",null,"",null,{"$f":"IFERROR(VLOOKUP($X$4&$A$5&AH$5&$B13,結果リスト!$A:$F,6,FALSE),\"\")","v":""},null,"","","","","",null,"",null,{"$f":"IFERROR(VLOOKUP($AR$4&$A$5&AR$5&$B13,結果リスト!$A:$F,6,FALSE),\"\")","v":""},null,"","",{"$f":"IF(AR13=\"\",\"\",IF(AR13=\"w\",AL13+1,AL13))","v":""},{"$f":"IF(AR13=\"\",\"\",IF(AR13=\"w\",AM13,AM13+1))","v":""},"",null,"",null,{"$f":"IFERROR(VLOOKUP($AR$4&$A$5&BB$5&$B13,結果リスト!$A:$F,6,FALSE),\"\")","v":""},null,"","",{"$f":"IF(BB13=\"\",\"\",IF(BB13=\"w\",AV13+1,AV13))","v":""},{"$f":"IF(BB13=\"\",\"\",IF(BB13=\"w\",AW13,AW13+1))","v":""},"",null,"",null,"",{"$f":"IF(●【進行】結果入力表!E16=\"\",\"\",●【進行】結果入力表!E16)","v":""},{"$f":"IF(●【進行】結果入力表!E24=\"\",\"\",●【進行】結果入力表!E24)","v":""},{"$f":"IF(●【進行】結果入力表!D48=\"\",\"\",IF(●【進行】結果入力表!E34=\"\",\"\",●【進行】結果入力表!E34))","v":""},{"$f":"IF(●【進行】結果入力表!D48=\"\",\"\",IF(●【進行】結果入力表!E42=\"\",\"\",●【進行】結果入力表!E42))","v":""},{"$f":"IFERROR(VLOOKUP(B13,●【進行】結果入力表!$D$57:$E$64,2,FALSE),\"\")","v":""},{"$f":"IF(●【進行】結果入力表!D72=\"\",\"\",IF(●【進行】結果入力表!E68=\"\",\"\",●【進行】結果入力表!E68))","v":""},null,0,0,0,0,7,"","兵庫",0,null,null,{"$f":"IF(B13=\"\",\"\",COUNTIF(F13:BC13,\"w\"))","v":""},{"$f":"IF(B13=\"\",\"\",COUNT(F13,N13,AH13,X13,AR13,BB13))","v":""},{"$f":"IF(CD13=\"\",\"\",CD13*180+SUM(F13,N13,AH13,X13,AR13,BB13)*180/E13)","v":""},{"$f":"IF(B13=\"\",\"\",CD13*100000+CF13)","v":""}]
[null,"Total",null,null,null,null,null,{"$f":"IF(COUNTBLANK(H6:H13)=8,\"\",SUM(H6:H13))","v":3},{"$f":"IF(COUNTBLANK(I6:I13)=8,\"\",SUM(I6:I13))","v":3},{"$f":"IF($B6=\"\",\"\",SUM(J6:J13))","v":614},{"$f":"IF($B6=\"\",\"\",SUM(K6:K13))","v":0},{"$f":"IF(COUNTBLANK(L6:L13)=8,\"\",SUM(L6:L13))","v":614},{"$f":"IF($B6=\"\",\"\",SUM(M6:M13))","v":0},null,null,{"$f":"SUM(P6:P13)","v":3},{"$f":"SUM(Q6:Q13)","v":3},{"$f":"IF(COUNTBLANK(R6:R13)=8,\"\",SUM(H14,P14))","v":6},{"$f":"IF(COUNTBLANK(S6:S13)=8,\"\",SUM(I14,Q14))","v":6},{"$f":"IF($B6=\"\",\"\",SUM(T6:T13))","v":1493},{"$f":"IF($B6=\"\",\"\",SUM(U6:U13))","v":0},{"$f":"IF(COUNTBLANK(V6:V13)=8,\"\",SUM(V6:V13))","v":1493},{"$f":"IF($B6=\"\",\"\",SUM(W6:W13))","v":0},null,null,{"$f":"SUM(Z6:Z13)","v":4},{"$f":"SUM(AA6:AA13)","v":2},{"$f":"IF(COUNTBLANK(AB6:AB13)=8,\"\",SUM(R14,Z14))","v":10},{"$f":"IF(COUNTBLANK(AC6:AC13)=8,\"\",SUM(S14,AA14))","v":8},{"$f":"IF($B6=\"\",\"\",SUM(AD6:AD13))","v":2354},{"$f":"IF($B6=\"\",\"\",SUM(AE6:AE13))","v":0},{"$f":"IF(COUNTBLANK(AF6:AF13)=8,\"\",SUM(AF6:AF13))","v":2354},{"$f":"IF($B6=\"\",\"\",SUM(AG6:AG13))","v":0},null,null,{"$f":"SUM(AJ6:AJ13)","v":3},{"$f":"SUM(AK6:AK13)","v":3},{"$f":"IF(COUNTBLANK(AL6:AL13)=8,\"\",SUM(AB14,AJ14))","v":13},{"$f":"IF(COUNTBLANK(AM6:AM13)=8,\"\",SUM(AC14,AK14))","v":11},{"$f":"IF($B6=\"\",\"\",SUM(AN6:AN13))","v":3223},{"$f":"IF($B6=\"\",\"\",SUM(AO6:AO13))","v":0},{"$f":"IF(COUNTBLANK(AP6:AP13)=8,\"\",SUM(AP6:AP13))","v":3223},{"$f":"IF($B6=\"\",\"\",SUM(AQ6:AQ13))","v":0},null,null,{"$f":"SUM(AT6:AT13)","v":6},{"$f":"SUM(AU6:AU13)","v":0},{"$f":"IF(COUNTBLANK(AV6:AV13)=8,\"\",SUM(AL14,AT14))","v":19},{"$f":"IF(COUNTBLANK(AW6:AW13)=8,\"\",SUM(AM14,AU14))","v":11},{"$f":"IF($B6=\"\",\"\",SUM(AX6:AX13))","v":4303},{"$f":"IF($B6=\"\",\"\",SUM(AY6:AY13))","v":0},{"$f":"IF(COUNTBLANK(AZ6:AZ13)=8,\"\",SUM(AZ6:AZ13))","v":4303},{"$f":"IF($B6=\"\",\"\",SUM(BA6:BA13))","v":0},null,null,{"$f":"SUM(BD6:BD13)","v":3},{"$f":"SUM(BE6:BE13)","v":3},{"$f":"IF(COUNTBLANK(BF6:BF13)=8,\"\",SUM(AV14,BD14))","v":22},{"$f":"IF(COUNTBLANK(BG6:BG13)=8,\"\",SUM(AW14,BE14))","v":14},{"$f":"IF($B6=\"\",\"\",SUM(BH6:BH13))","v":5154},{"$f":"IF($B6=\"\",\"\",SUM(BI6:BI13))","v":0},{"$f":"IF(COUNTBLANK(BJ6:BJ13)=8,\"\",SUM(BJ6:BJ13))","v":5154},{"$f":"IF($B6=\"\",\"\",SUM(BK6:BK13))","v":0},null,null,null,null,null,null,null,null,null,null,null,null,null,null,null,null,null,null,{"$f":"SUM(CD6:CD13)","v":22},{"$f":"SUM(CE6:CE13)","v":14},{"$f":"SUM(CF6:CF13)","v":5154},{"$f":"SUM(CG6:CG13)","v":2205154}]
[{"$f":"IF(【準備】登録!F17=\"\",\"\",【準備】登録!F17)","v":"滋賀"},{"$f":"B5","v":"選手名"},null,null,{"$f":"E5","v":"持点"},{"$f":"A5","v":"兵庫"},null,"W","L","TP",null,"TP",null,{"$f":"A25","v":"奈良"},null,"W","L","W","L","TP",null,"TP",null,{"$f":"A5","v":"兵庫"},null,"W","L","W","L","TP",null,"TP",null,{"$f":"A25","v":"奈良"},null,"W","L","W","L","TP",null,"TP",null,{"$f":"A5","v":"兵庫"},null,"W","L","W","L","TP",null,"TP",null,{"$f":"A25","v":"奈良"},null,"W","L","W","L","TP",null,"TP",null,"R",{"$f":"BM$5","v":"1G"},"2G","3G","4G","5G","6G",null,null,null,null,null,null,null,null,null,null,null,{"$f":"CD$5","v":"W"},{"$f":"CE$5","v":"L"},{"$f":"CF$5","v":"TP"},{"$f":"CG$5","v":"R_P"}]
[null,{"$f":"IF(【準備】登録!$C$20=0,\"\",【準備】登録!$F$20)","v":"大橋　義治"},null,null,{"$f":"【準備】登録!H20","v":180},{"$f":"IFERROR(VLOOKUP($F$4&$A$15&F$15&$B16,結果リスト!$A:$F,6,FALSE),\"\")","v":176},null,{"$f":"IF(F16=\"\",\"\",IF(F16=\"w\",1,0))","v":0},{"$f":"IF(F16=\"\",\"\",IF(F16=\"w\",0,1))","v":1},{"$f":"IF(F16=\"\",\"\",IF(F16=\"w\",E16,F16))","v":176},null,{"$f":"IF($F16=\"\",\"\",J16/$E16*180)","v":176},null,{"$f":"IFERROR(VLOOKUP($F$4&$A$15&N$15&$B16,結果リスト!$A:$F,6,FALSE),\"\")","v":"W"},null,{"$f":"IF(N16=\"\",\"\",IF(N16=\"w\",1,0))","v":1},{"$f":"IF(N16=\"\",\"\",IF(N16=\"w\",0,1))","v":0},{"$f":"IF(N16=\"\",\"\",SUM(H16,P16))","v":1},{"$f":"IF(N16=\"\",\"\",SUM(I16,Q16))","v":1},{"$f":"IF(N16=\"\",\"\",IF(N16=\"w\",E16+J16,N16+J16))","v":356},null,{"$f":"IF($N16=\"\",\"\",T16/$E16*180)","v":356},null,{"$f":"IFERROR(VLOOKUP($X$4&$A$15&X$15&$B16,結果リスト!$A:$F,6,FALSE),\"\")","v":"W"},null,{"$f":"IF(X16=\"\",\"\",IF(X16=\"w\",1,0))","v":1},{"$f":"IF(X16=\"\",\"\",IF(X16=\"w\",0,1))","v":0},{"$f":"IF(X16=\"\",\"\",SUM(R16,Z16))","v":2},{"$f":"IF(X16=\"\",\"\",SUM(S16,AA16))","v":1},{"$f":"IF(X16=\"\",\"\",IF(X16=\"w\",T16+E16,X16+T16))","v":536},null,{"$f":"IF($X16=\"\",\"\",AD16/$E16*180)","v":536},null,{"$f":"IFERROR(VLOOKUP($X$4&$A$15&AH$15&$B16,結果リスト!$A:$F,6,FALSE),\"\")","v":"W"},null,{"$f":"IF(AH16=\"\",\"\",IF(AH16=\"w\",1,0))","v":1},{"$f":"IF(AH16=\"\",\"\",IF(AH16=\"w\",0,1))","v":0},{"$f":"IF(AH16=\"\",\"\",SUM(AB16,AJ16))","v":3},{"$f":"IF(AH16=\"\",\"\",SUM(AC16,AK16))","v":1},{"$f":"IF(AH16=\"\",\"\",IF(AH16=\"w\",AD16+E16,AH16+AD16))","v":716},null,{"$f":"IF($AH16=\"\",\"\",AN16/$E16*180)","v":716},null,{"$f":"IFERROR(VLOOKUP($AR$4&$A$15&AR$15&$B16,結果リスト!$A:$F,6,FALSE),\"\")","v":"W"},null,{"$f":"IF(AR16=\"\",\"\",IF(AR16=\"w\",1,0))","v":1},{"$f":"IF(AR16=\"\",\"\",IF(AR16=\"w\",0,1))","v":0},{"$f":"IF(AR16=\"\",\"\",IF(AR16=\"w\",AL16+1,AL16))","v":4},{"$f":"IF(AR16=\"\",\"\",IF(AR16=\"w\",AM16,AM16+1))","v":1},{"$f":"IF(AR16=\"\",\"\",IF(AR16=\"w\",AN16+E16,AR16+AN16))","v":896},null,{"$f":"IF($AR16=\"\",\"\",AX16/$E16*180)","v":896},null,{"$f":"IFERROR(VLOOKUP($AR$4&$A$15&BB$15&$B16,結果リスト!$A:$F,6,FALSE),\"\")","v":"W"},null,{"$f":"IF(BB16=\"\",\"\",IF(BB16=\"w\",1,0))","v":1},{"$f":"IF(BB16=\"\",\"\",IF(BB16=\"w\",0,1))","v":0},{"$f":"IF(BB16=\"\",\"\",IF(BB16=\"w\",AV16+1,AV16))","v":5},{"$f":"IF(BB16=\"\",\"\",IF(BB16=\"w\",AW16,AW16+1))","v":1},{"$f":"IF(BB16=\"\",\"\",IF(BB16=\"w\",AX16+E16,BB16+AX16))","v":1076},null,{"$f":"IF($BB16=\"\",\"\",BH16/$E16*180)","v":1076},null,{"$f":"IF(SUM(H16:I16,R16:S16)=0,\"\",IF(B$13=\"\",RANK($CG$16:$CG$22,$CG$16:$CG$22,0),RANK($CG$16:$CG$23,$CG$16:$CG$23,0)))","v":1},{"$f":"IF(●【進行】結果入力表!H17=\"\",\"\",●【進行】結果入力表!H17)","v":""},{"$f":"IF(●【進行】結果入力表!E25=\"\",\"\",●【進行】結果入力表!E25)","v":""},{"$f":"IF(●【進行】結果入力表!H42=\"\",\"\",●【進行】結果入力表!H42)","v":""},{"$f":"IF(●【進行】結果入力表!E50=\"\",\"\",●【進行】結果入力表!E50)","v":""},{"$f":"IF(●【進行】結果入力表!H67=\"\",\"\",●【進行】結果入力表!H67)","v":""},{"$f":"IF(●【進行】結果入力表!E75=\"\",\"\",●【進行】結果入力表!E75)","v":""},null,{"$f":"COUNTIF($BM16:$BR16,BT$5)","v":0},{"$f":"COUNTIF($BM16:$BR16,BU$5)","v":0},0,{"$f":"BT16*10000+BU16*1000+BV16","v":0},7,{"$f":"B16","v":"大橋　義治"},{"$f":"$A$15","v":"滋賀"},{"$f":"IF(BT16>0,\"A\"&E16,IF(BU16>0,\"B\"&E16,BV16))","v":0},null,null,{"$f":"COUNTIF(F16:BC16,\"w\")","v":5},{"$f":"COUNT(F16,N16,AH16,X16,AR16,BB16)","v":1},{"$f":"CD16*180+SUM(F16,N16,AH16,X16,AR16,BB16)*180/E16","v":1076},{"$f":"CD16*100000+CF16","v":501076}]
[null,{"$f":"IF(【準備】登録!$C$20=0,\"\",【準備】登録!$F$21)","v":"大橋　正寛"},null,null,{"$f":"【準備】登録!H21","v":180},{"$f":"IFERROR(VLOOKUP($F$4&$A$15&F$15&$B17,結果リスト!$A:$F,6,FALSE),\"\")","v":159},null,{"$f":"IF(F17=\"\",\"\",IF(F17=\"w\",1,0))","v":0},{"$f":"IF(F17=\"\",\"\",IF(F17=\"w\",0,1))","v":1},{"$f":"IF(F17=\"\",\"\",IF(F17=\"w\",E17,F17))","v":159},null,{"$f":"IF($F17=\"\",\"\",J17/$E17*180)","v":159},null,{"$f":"IFERROR(VLOOKUP($F$4&$A$15&N$15&$B17,結果リスト!$A:$F,6,FALSE),\"\")","v":"W"},null,{"$f":"IF(N17=\"\",\"\",IF(N17=\"w\",1,0))","v":1},{"$f":"IF(N17=\"\",\"\",IF(N17=\"w\",0,1))","v":0},{"$f":"IF(N17=\"\",\"\",SUM(H17,P17))","v":1},{"$f":"IF(N17=\"\",\"\",SUM(I17,Q17))","v":1},339,null,339,null,{"$f":"IFERROR(VLOOKUP($X$4&$A$15&X$15&$B17,結果リスト!$A:$F,6,FALSE),\"\")","v":156},null,{"$f":"IF(X17=\"\",\"\",IF(X17=\"w\",1,0))","v":0},{"$f":"IF(X17=\"\",\"\",IF(X17=\"w\",0,1))","v":1},{"$f":"IF(X17=\"\",\"\",SUM(R17,Z17))","v":1},{"$f":"IF(X17=\"\",\"\",SUM(S17,AA17))","v":2},495,null,495,null,{"$f":"IFERROR(VLOOKUP($X$4&$A$15&AH$15&$B17,結果リスト!$A:$F,6,FALSE),\"\")","v":"W"},null,{"$f":"IF(AH17=\"\",\"\",IF(AH17=\"w\",1,0))","v":1},{"$f":"IF(AH17=\"\",\"\",IF(AH17=\"w\",0,1))","v":0},{"$f":"IF(AH17=\"\",\"\",SUM(AB17,AJ17))","v":2},{"$f":"IF(AH17=\"\",\"\",SUM(AC17,AK17))","v":2},675,null,675,null,{"$f":"IFERROR(VLOOKUP($AR$4&$A$15&AR$15&$B17,結果リスト!$A:$F,6,FALSE),\"\")","v":17},null,{"$f":"IF(AR17=\"\",\"\",IF(AR17=\"w\",1,0))","v":0},{"$f":"IF(AR17=\"\",\"\",IF(AR17=\"w\",0,1))","v":1},2,3,692,null,692,null,{"$f":"IFERROR(VLOOKUP($AR$4&$A$15&BB$15&$B17,結果リスト!$A:$F,6,FALSE),\"\")","v":75},null,{"$f":"IF(BB17=\"\",\"\",IF(BB17=\"w\",1,0))","v":0},{"$f":"IF(BB17=\"\",\"\",IF(BB17=\"w\",0,1))","v":1},2,4,767,null,767,null,5,{"$f":"IF(●【進行】結果入力表!H18=\"\",\"\",●【進行】結果入力表!H18)","v":""},{"$f":"IF(●【進行】結果入力表!E26=\"\",\"\",●【進行】結果入力表!E26)","v":""},{"$f":"IF(●【進行】結果入力表!H43=\"\",\"\",●【進行】結果入力表!H43)","v":""},{"$f":"IF(●【進行】結果入力表!E51=\"\",\"\",●【進行】結果入力表!E51)","v":""},{"$f":"IF(●【進行】結果入力表!H68=\"\",\"\",●【進行】結果入力表!H68)","v":""},{"$f":"IF(●【進行】結果入力表!E76=\"\",\"\",●【進行】結果入力表!E76)","v":""},null,{"$f":"COUNTIF($BM17:$BR17,BT$5)","v":0},0,0,{"$f":"BT17*10000+BU17*1000+BV17","v":0},7,{"$f":"B17","v":"大橋　正寛"},{"$f":"$A$15","v":"滋賀"},0,null,null,2,4,767,{"$f":"CD17*100000+CF17","v":200767}]
[null,{"$f":"IF(【準備】登録!$C$20=0,\"\",【準備】登録!$F$22)","v":"西峰　久祐"},null,null,{"$f":"【準備】登録!H22","v":180},{"$f":"IFERROR(VLOOKUP($F$4&$A$15&F$15&$B18,結果リスト!$A:$F,6,FALSE),\"\")","v":"W"},null,1,0,180,null,180,null,{"$f":"IFERROR(VLOOKUP($F$4&$A$15&N$15&$B18,結果リスト!$A:$F,6,FALSE),\"\")","v":"W"},null,1,0,2,0,360,null,360,null,{"$f":"IFERROR(VLOOKUP($X$4&$A$15&X$15&$B18,結果リスト!$A:$F,6,FALSE),\"\")","v":62},null,0,1,2,1,422,null,422,null,{"$f":"IFERROR(VLOOKUP($X$4&$A$15&AH$15&$B18,結果リスト!$A:$F,6,FALSE),\"\")","v":"W"},null,1,0,3,1,602,null,602,null,{"$f":"IFERROR(VLOOKUP($AR$4&$A$15&AR$15&$B18,結果リスト!$A:$F,6,FALSE),\"\")","v":120},null,0,1,3,2,722,null,722,null,{"$f":"IFERROR(VLOOKUP($AR$4&$A$15&BB$15&$B18,結果リスト!$A:$F,6,FALSE),\"\")","v":"W"},null,1,0,4,2,902,null,902,null,3,{"$f":"IF(●【進行】結果入力表!H19=\"\",\"\",●【進行】結果入力表!H19)","v":""},{"$f":"IF(●【進行】結果入力表!E27=\"\",\"\",●【進行】結果入力表!E27)","v":""},{"$f":"IF(●【進行】結果入力表!H44=\"\",\"\",●【進行】結果入力表!H44)","v":""},{"$f":"IF(●【進行】結果入力表!E52=\"\",\"\",●【進行】結果入力表!E52)","v":""},{"$f":"IF(●【進行】結果入力表!H69=\"\",\"\",●【進行】結果入力表!H69)","v":""},{"$f":"IF(●【進行】結果入力表!E77=\"\",\"\",●【進行】結果入力表!E77)","v":""},null,0,0,0,0,7,"西峰　久祐","滋賀",0,null,null,4,2,902,400902]
[null,{"$f":"IF(【準備】登録!$C$20=0,\"\",【準備】登録!$F$23)","v":"山中　康寛"},null,null,{"$f":"【準備】登録!H23","v":180},{"$f":"IFERROR(VLOOKUP($F$4&$A$15&F$15&$B19,結果リスト!$A:$F,6,FALSE),\"\")","v":"W"},null,1,0,180,null,180,null,{"$f":"IFERROR(VLOOKUP($F$4&$A$15&N$15&$B19,結果リスト!$A:$F,6,FALSE),\"\")","v":78},null,0,1,1,1,258,null,258,null,{"$f":"IFERROR(VLOOKUP($X$4&$A$15&X$15&$B19,結果リスト!$A:$F,6,FALSE),\"\")","v":"W"},null,1,0,2,1,438,null,437.99999999999994,null,{"$f":"IFERROR(VLOOKUP($X$4&$A$15&AH$15&$B19,結果リスト!$A:$F,6,FALSE),\"\")","v":135},null,0,1,2,2,573,null,573,null,{"$f":"IFERROR(VLOOKUP($AR$4&$A$15&AR$15&$B19,結果リスト!$A:$F,6,FALSE),\"\")","v":"W"},null,1,0,3,2,753,null,753,null,{"$f":"IFERROR(VLOOKUP($AR$4&$A$15&BB$15&$B19,結果リスト!$A:$F,6,FALSE),\"\")","v":80},null,0,1,3,3,833,null,833.00000000000011,null,4,{"$f":"IF(●【進行】結果入力表!H20=\"\",\"\",●【進行】結果入力表!H20)","v":""},{"$f":"IF(●【進行】結果入力表!E28=\"\",\"\",●【進行】結果入力表!E28)","v":""},{"$f":"IF(●【進行】結果入力表!H45=\"\",\"\",●【進行】結果入力表!H45)","v":""},{"$f":"IF(●【進行】結果入力表!E53=\"\",\"\",●【進行】結果入力表!E53)","v":""},{"$f":"IF(●【進行】結果入力表!H70=\"\",\"\",●【進行】結果入力表!H70)","v":""},{"$f":"IF(●【進行】結果入力表!E78=\"\",\"\",●【進行】結果入力表!E78)","v":""},null,0,0,0,0,7,"山中　康寛","滋賀",0,null,null,3,3,833,300833]
[null,{"$f":"IF(【準備】登録!$C$20=0,\"\",【準備】登録!$F$24)","v":"御手洗　茂"},null,null,{"$f":"【準備】登録!H24","v":180},{"$f":"IFERROR(VLOOKUP($F$4&$A$15&F$15&$B20,結果リスト!$A:$F,6,FALSE),\"\")","v":95},null,0,1,95,null,95,null,{"$f":"IFERROR(VLOOKUP($F$4&$A$15&N$15&$B20,結果リスト!$A:$F,6,FALSE),\"\")","v":31},null,0,1,0,2,126,null,125.99999999999999,null,{"$f":"IFERROR(VLOOKUP($X$4&$A$15&X$15&$B20,結果リスト!$A:$F,6,FALSE),\"\")","v":88},null,0,1,0,3,214,null,214,null,{"$f":"IFERROR(VLOOKUP($X$4&$A$15&AH$15&$B20,結果リスト!$A:$F,6,FALSE),\"\")","v":96},null,0,1,0,4,310,null,310,null,{"$f":"IFERROR(VLOOKUP($AR$4&$A$15&AR$15&$B20,結果リスト!$A:$F,6,FALSE),\"\")","v":61},null,0,1,0,5,371,null,370.99999999999994,null,{"$f":"IFERROR(VLOOKUP($AR$4&$A$15&BB$15&$B20,結果リスト!$A:$F,6,FALSE),\"\")","v":134},null,0,1,0,6,505,null,504.99999999999994,null,6,{"$f":"IF(●【進行】結果入力表!H21=\"\",\"\",●【進行】結果入力表!H21)","v":""},{"$f":"IF(●【進行】結果入力表!E29=\"\",\"\",●【進行】結果入力表!E29)","v":""},{"$f":"IF(●【進行】結果入力表!H46=\"\",\"\",●【進行】結果入力表!H46)","v":""},{"$f":"IF(●【進行】結果入力表!E54=\"\",\"\",●【進行】結果入力表!E54)","v":""},{"$f":"IF(●【進行】結果入力表!H71=\"\",\"\",●【進行】結果入力表!H71)","v":""},{"$f":"IF(●【進行】結果入力表!E79=\"\",\"\",●【進行】結果入力表!E79)","v":""},null,0,0,0,0,7,"御手洗　茂","滋賀",0,null,null,0,6,505,505]
[null,{"$f":"IF(【準備】登録!$C$20=0,\"\",【準備】登録!$F$25)","v":"高島　太一"},null,null,{"$f":"【準備】登録!H25","v":180},{"$f":"IFERROR(VLOOKUP($F$4&$A$15&F$15&$B21,結果リスト!$A:$F,6,FALSE),\"\")","v":"W"},null,1,0,180,null,180,null,{"$f":"IFERROR(VLOOKUP($F$4&$A$15&N$15&$B21,結果リスト!$A:$F,6,FALSE),\"\")","v":"W"},null,1,0,2,0,360,null,360,null,{"$f":"IFERROR(VLOOKUP($X$4&$A$15&X$15&$B21,結果リスト!$A:$F,6,FALSE),\"\")","v":"W"},null,1,0,3,0,540,null,540,null,{"$f":"IFERROR(VLOOKUP($X$4&$A$15&AH$15&$B21,結果リスト!$A:$F,6,FALSE),\"\")","v":100},null,0,1,3,1,640,null,640,null,{"$f":"IFERROR(VLOOKUP($AR$4&$A$15&AR$15&$B21,結果リスト!$A:$F,6,FALSE),\"\")","v":"W"},null,1,0,4,1,820,null,820,null,{"$f":"IFERROR(VLOOKUP($AR$4&$A$15&BB$15&$B21,結果リスト!$A:$F,6,FALSE),\"\")","v":132},null,0,1,4,2,952,null,952,null,2,{"$f":"IF(●【進行】結果入力表!H22=\"\",\"\",●【進行】結果入力表!H22)","v":""},{"$f":"IF(●【進行】結果入力表!E30=\"\",\"\",●【進行】結果入力表!E30)","v":""},{"$f":"IF(●【進行】結果入力表!H47=\"\",\"\",●【進行】結果入力表!H47)","v":""},{"$f":"IF(●【進行】結果入力表!E55=\"\",\"\",●【進行】結果入力表!E55)","v":""},{"$f":"IF(●【進行】結果入力表!I72=\"\",IF(●【進行】結果入力表!H65=\"\",\"\",●【進行】結果入力表!H65),IF(●【進行】結果入力表!H72=\"\",\"\",●【進行】結果入力表!H72))","v":""},{"$f":"IF(●【進行】結果入力表!D80=\"\",IF(●【進行】結果入力表!E73=\"\",\"\",●【進行】結果入力表!E73),IF(●【進行】結果入力表!E80=\"\",\"\",●【進行】結果入力表!E80))","v":""},null,0,0,0,0,7,"高島　太一","滋賀",0,null,null,4,2,952,400952]
[null,{"$f":"IF(【準備】登録!$F$27=0,\"\",【準備】登録!$F$27)","v":""},null,null,{"$f":"【準備】登録!H26","v":0},{"$f":"IFERROR(VLOOKUP($F$4&$A$15&F$15&$B22,結果リスト!$A:$F,6,FALSE),\"\")","v":""},null,"","","",null,"",null,{"$f":"IFERROR(VLOOKUP($F$4&$A$15&N$15&$B22,結果リスト!$A:$F,6,FALSE),\"\")","v":""},null,"","","","","",null,"",null,{"$f":"IFERROR(VLOOKUP($X$4&$A$15&X$15&$B22,結果リスト!$A:$F,6,FALSE),\"\")","v":""},null,"","","","","",null,"",null,{"$f":"IFERROR(VLOOKUP($X$4&$A$15&AH$15&$B22,結果リスト!$A:$F,6,FALSE),\"\")","v":""},null,"","","","","",null,"",null,{"$f":"IFERROR(VLOOKUP($AR$4&$A$15&AR$15&$B22,結果リスト!$A:$F,6,FALSE),\"\")","v":""},null,"","","","","",null,"",null,{"$f":"IFERROR(VLOOKUP($AR$4&$A$15&BB$15&$B22,結果リスト!$A:$F,6,FALSE),\"\")","v":""},null,"","","","","",null,"",null,"",{"$f":"IF(●【進行】結果入力表!H23=\"\",\"\",●【進行】結果入力表!H23)","v":""},{"$f":"IF(●【進行】結果入力表!E31=\"\",\"\",●【進行】結果入力表!E31)","v":""},{"$f":"IF(●【進行】結果入力表!I48=\"\",IF(●【進行】結果入力表!H41=\"\",\"\",●【進行】結果入力表!H41),IF(●【進行】結果入力表!H48=\"\",\"\",●【進行】結果入力表!H48))","v":""},{"$f":"IF(●【進行】結果入力表!D56=\"\",IF(●【進行】結果入力表!E49=\"\",\"\",●【進行】結果入力表!E49),IF(●【進行】結果入力表!E56=\"\",\"\",●【進行】結果入力表!E56))","v":""},{"$f":"IF(●【進行】結果入力表!I72=\"\",IF(●【進行】結果入力表!H66=\"\",\"\",●【進行】結果入力表!H66),IF(●【進行】結果入力表!H65=\"\",\"\",●【進行】結果入力表!H65))","v":""},{"$f":"IF(●【進行】結果入力表!D80=\"\",IF(●【進行】結果入力表!E74=\"\",\"\",●【進行】結果入力表!E74),IF(●【進行】結果入力表!E73=\"\",\"\",●【進行】結果入力表!E73))","v":""},null,0,0,0,0,7,"","滋賀",0,null,null,{"$f":"IF(B22=\"\",\"\",COUNTIF(F22:BC22,\"w\"))","v":""},{"$f":"IF(B22=\"\",\"\",COUNT(F22,N22,AH22,X22,AR22,BB22))","v":""},{"$f":"IF(CD22=\"\",\"\",CD22*180+SUM(F22,N22,AH22,X22,AR22,BB22)*180/E22)","v":""},{"$f":"IF(CD22=\"\",\"\",CD22*100000+CF22)","v":""}]
[null,{"$f":"IF(【準備】登録!$F$27=0,\"\",【準備】登録!$F$27)","v":""},null,null,{"$f":"IF(【準備】登録!$F$27=\"\",\"\",【準備】登録!H27)","v":""},{"$f":"IFERROR(VLOOKUP($F$4&$A$15&F$15&$B23,結果リスト!$A:$F,6,FALSE),\"\")","v":""},null,{"$f":"IF(F23=\"\",\"\",IF(F23=\"w\",1,0))","v":""},{"$f":"IF(F23=\"\",\"\",IF(F23=\"w\",0,1))","v":""},"",null,"",null,{"$f":"IFERROR(VLOOKUP($F$4&$A$15&N$15&$B23,結果リスト!$A:$F,6,FALSE),\"\")","v":""},null,"","","","","",null,"",null,{"$f":"IFERROR(VLOOKUP($X$4&$A$15&X$15&$B23,結果リスト!$A:$F,6,FALSE),\"\")","v":""},null,"","","","","",null,"",null,{"$f":"IFERROR(VLOOKUP($X$4&$A$15&AH$15&$B23,結果リスト!$A:$F,6,FALSE),\"\")","v":""},null,"","","","","",null,"",null,{"$f":"IFERROR(VLOOKUP($AR$4&$A$15&AR$15&$B23,結果リスト!$A:$F,6,FALSE),\"\")","v":""},null,"","","","","",null,"",null,{"$f":"IFERROR(VLOOKUP($AR$4&$A$15&BB$15&$B23,結果リスト!$A:$F,6,FALSE),\"\")","v":""},null,"","","","","",null,"",null,"",{"$f":"IF(●【進行】結果入力表!H24=\"\",\"\",●【進行】結果入力表!H24)","v":""},{"$f":"IF(●【進行】結果入力表!E32=\"\",\"\",●【進行】結果入力表!E32)","v":""},{"$f":"IF(●【進行】結果入力表!I48=\"\",\"\",IF(●【進行】結果入力表!H41=\"\",\"\",●【進行】結果入力表!H41))","v":""},{"$f":"IF(●【進行】結果入力表!D56=\"\",\"\",IF(●【進行】結果入力表!E49=\"\",\"\",●【進行】結果入力表!E49))","v":""},{"$f":"IF(●【進行】結果入力表!I72=\"\",\"\",IF(●【進行】結果入力表!H66=\"\",\"\",●【進行】結果入力表!H66))","v":""},{"$f":"IF(●【進行】結果入力表!D80=\"\",\"\",IF(●【進行】結果入力表!E74=\"\",\"\",●【進行】結果入力表!E74))","v":""},null,0,0,0,0,7,"","滋賀",0,null,null,{"$f":"IF(B23=\"\",\"\",COUNTIF(F23:BC23,\"w\"))","v":""},{"$f":"IF(B23=\"\",\"\",COUNT(F23,N23,AH23,X23,AR23,BB23))","v":""},{"$f":"IF(CD23=\"\",\"\",CD23*180+SUM(F23,N23,AH23,X23,AR23,BB23)*180/E23)","v":""},{"$f":"IF(B23=\"\",\"\",CD23*100000+CF23)","v":""}]
[null,"Total",null,null,null,null,null,{"$f":"IF(COUNTBLANK(H16:H23)=8,\"\",SUM(H16:H23))","v":3},{"$f":"IF(COUNTBLANK(I16:I23)=8,\"\",SUM(I16:I23))","v":3},{"$f":"IF($B16=\"\",\"\",SUM(J16:J23))","v":970},{"$f":"IF($B16=\"\",\"\",SUM(K16:K23))","v":0},{"$f":"IF(COUNTBLANK(L16:L23)=8,\"\",SUM(L16:L23))","v":970},{"$f":"IF($B16=\"\",\"\",SUM(M16:M23))","v":0},null,null,{"$f":"SUM(P16:P23)","v":4},{"$f":"SUM(Q16:Q23)","v":2},{"$f":"IF(COUNTBLANK(R16:R23)=8,\"\",SUM(H24,P24))","v":7},{"$f":"IF(COUNTBLANK(S16:S23)=8,\"\",SUM(I24,Q24))","v":5},{"$f":"IF($B16=\"\",\"\",SUM(T16:T23))","v":1799},{"$f":"IF($B16=\"\",\"\",SUM(U16:U23))","v":0},{"$f":"IF(COUNTBLANK(V16:V23)=8,\"\",SUM(V16:V23))","v":1799},{"$f":"IF($B16=\"\",\"\",SUM(W16:W23))","v":0},null,null,{"$f":"SUM(Z16:Z23)","v":3},{"$f":"SUM(AA16:AA23)","v":3},{"$f":"IF(COUNTBLANK(AB16:AB23)=8,\"\",SUM(R24,Z24))","v":10},{"$f":"IF(COUNTBLANK(AC16:AC23)=8,\"\",SUM(S24,AA24))","v":8},{"$f":"IF($B16=\"\",\"\",SUM(AD16:AD23))","v":2645},{"$f":"IF($B16=\"\",\"\",SUM(AE16:AE23))","v":0},{"$f":"IF(COUNTBLANK(AF16:AF23)=8,\"\",SUM(AF16:AF23))","v":2645},{"$f":"IF($B16=\"\",\"\",SUM(AG16:AG23))","v":0},null,null,{"$f":"SUM(AJ16:AJ23)","v":3},{"$f":"SUM(AK16:AK23)","v":3},{"$f":"IF(COUNTBLANK(AL16:AL23)=8,\"\",SUM(AB24,AJ24))","v":13},{"$f":"IF(COUNTBLANK(AM16:AM23)=8,\"\",SUM(AC24,AK24))","v":11},{"$f":"IF($B16=\"\",\"\",SUM(AN16:AN23))","v":3516},{"$f":"IF($B16=\"\",\"\",SUM(AO16:AO23))","v":0},{"$f":"IF(COUNTBLANK(AP16:AP23)=8,\"\",SUM(AP16:AP23))","v":3516},{"$f":"IF($B16=\"\",\"\",SUM(AQ16:AQ23))","v":0},null,null,{"$f":"SUM(AT16:AT23)","v":3},{"$f":"SUM(AU16:AU23)","v":3},{"$f":"IF(COUNTBLANK(AV16:AV23)=8,\"\",SUM(AL24,AT24))","v":16},{"$f":"IF(COUNTBLANK(AW16:AW23)=8,\"\",SUM(AM24,AU24))","v":14},{"$f":"IF($B16=\"\",\"\",SUM(AX16:AX23))","v":4254},{"$f":"IF($B16=\"\",\"\",SUM(AY16:AY23))","v":0},{"$f":"IF(COUNTBLANK(AZ16:AZ23)=8,\"\",SUM(AZ16:AZ23))","v":4254},{"$f":"IF($B16=\"\",\"\",SUM(BA16:BA23))","v":0},null,null,{"$f":"SUM(BD16:BD23)","v":2},{"$f":"SUM(BE16:BE23)","v":4},{"$f":"IF(COUNTBLANK(BF16:BF23)=8,\"\",SUM(AV24,BD24))","v":18},{"$f":"IF(COUNTBLANK(BG16:BG23)=8,\"\",SUM(AW24,BE24))","v":18},{"$f":"IF($B16=\"\",\"\",SUM(BH16:BH23))","v":5035},{"$f":"IF($B16=\"\",\"\",SUM(BI16:BI23))","v":0},{"$f":"IF(COUNTBLANK(BJ16:BJ23)=8,\"\",SUM(BJ16:BJ23))","v":5035},{"$f":"IF($B16=\"\",\"\",SUM(BK16:BK23))","v":0},null,null,null,null,null,null,null,null,null,null,null,null,null,null,null,null,null,null,{"$f":"SUM(CD16:CD23)","v":18},{"$f":"SUM(CE16:CE23)","v":18},{"$f":"SUM(CF16:CF23)","v":5035},{"$f":"SUM(CG16:CG23)","v":1805035}]
[{"$f":"IF(【準備】登録!I17=\"\",\"\",【準備】登録!I17)","v":"奈良"},{"$f":"B5","v":"選手名"},null,null,{"$f":"E5","v":"持点"},{"$f":"A5","v":"兵庫"},null,"W","L","TP",null,"TP",null,{"$f":"A15","v":"滋賀"},null,"W","L","W","L","TP",null,"TP",null,{"$f":"A5","v":"兵庫"},null,"W","L","W","L","TP",null,"TP",null,{"$f":"A15","v":"滋賀"},null,"W","L","W","L","TP",null,"TP",null,{"$f":"A5","v":"兵庫"},null,"W","L","W","L","TP",null,"TP",null,{"$f":"A15","v":"滋賀"},null,"W","L","W","L","TP",null,"TP",null,"R",{"$f":"BM$5","v":"1G"},"2G","3G","4G","5G","6G",null,null,null,null,null,null,null,null,null,null,null,{"$f":"CD$5","v":"W"},{"$f":"CE$5","v":"L"},{"$f":"CF$5","v":"TP"},{"$f":"CG$5","v":"R_P"}]
[null,{"$f":"IF(【準備】登録!$C$20=0,\"\",【準備】登録!$I$20)","v":"田尻　哲司"},null,null,{"$f":"【準備】登録!K20","v":180},{"$f":"IFERROR(VLOOKUP($F$4&$A$25&F$25&$B26,結果リスト!$A:$F,6,FALSE),\"\")","v":52},null,{"$f":"IF(F26=\"\",\"\",IF(F26=\"w\",1,0))","v":0},{"$f":"IF(F26=\"\",\"\",IF(F26=\"w\",0,1))","v":1},{"$f":"IF(F26=\"\",\"\",IF(F26=\"w\",E26,F26))","v":52},null,{"$f":"IF($F26=\"\",\"\",J26/$E26*180)","v":51.999999999999993},null,{"$f":"IFERROR(VLOOKUP($F$4&$A$25&N$25&$B26,結果リスト!$A:$F,6,FALSE),\"\")","v":172},null,{"$f":"IF(N26=\"\",\"\",IF(N26=\"w\",1,0))","v":0},{"$f":"IF(N26=\"\",\"\",IF(N26=\"w\",0,1))","v":1},{"$f":"IF(N26=\"\",\"\",SUM(H26,P26))","v":0},{"$f":"IF(N26=\"\",\"\",SUM(I26,Q26))","v":2},{"$f":"IF(N26=\"\",\"\",IF(N26=\"w\",E26+J26,N26+J26))","v":224},null,{"$f":"IF($N26=\"\",\"\",T26/$E26*180)","v":224},null,{"$f":"IFERROR(VLOOKUP($X$4&$A$25&X$25&$B26,結果リスト!$A:$F,6,FALSE),\"\")","v":53},null,{"$f":"IF(X26=\"\",\"\",IF(X26=\"w\",1,0))","v":0},{"$f":"IF(X26=\"\",\"\",IF(X26=\"w\",0,1))","v":1},{"$f":"IF(X26=\"\",\"\",SUM(R26,Z26))","v":0},{"$f":"IF(X26=\"\",\"\",SUM(S26,AA26))","v":3},{"$f":"IF(X26=\"\",\"\",IF(X26=\"w\",T26+E26,X26+T26))","v":277},null,{"$f":"IF($X26=\"\",\"\",AD26/$E26*180)","v":277},null,{"$f":"IFERROR(VLOOKUP($X$4&$A$25&AH$25&$B26,結果リスト!$A:$F,6,FALSE),\"\")","v":65},null,{"$f":"IF(AH26=\"\",\"\",IF(AH26=\"w\",1,0))","v":0},{"$f":"IF(AH26=\"\",\"\",IF(AH26=\"w\",0,1))","v":1},{"$f":"IF(AH26=\"\",\"\",SUM(AB26,AJ26))","v":0},{"$f":"IF(AH26=\"\",\"\",SUM(AC26,AK26))","v":4},{"$f":"IF(AH26=\"\",\"\",IF(AH26=\"w\",AD26+E26,AH26+AD26))","v":342},null,{"$f":"IF($AH26=\"\",\"\",AN26/$E26*180)","v":342},null,{"$f":"IFERROR(VLOOKUP($AR$4&$A$25&AR$25&$B26,結果リスト!$A:$F,6,FALSE),\"\")","v":99},null,{"$f":"IF(AR26=\"\",\"\",IF(AR26=\"w\",1,0))","v":0},{"$f":"IF(AR26=\"\",\"\",IF(AR26=\"w\",0,1))","v":1},{"$f":"IF(AR26=\"\",\"\",IF(AR26=\"w\",AL26+1,AL26))","v":0},{"$f":"IF(AR26=\"\",\"\",IF(AR26=\"w\",AM26,AM26+1))","v":5},{"$f":"IF(AR26=\"\",\"\",IF(AR26=\"w\",AN26+E26,AR26+AN26))","v":441},null,{"$f":"IF($AR26=\"\",\"\",AX26/$E26*180)","v":441.00000000000006},null,{"$f":"IFERROR(VLOOKUP($AR$4&$A$25&BB$25&$B26,結果リスト!$A:$F,6,FALSE),\"\")","v":"W"},null,{"$f":"IF(BB26=\"\",\"\",IF(BB26=\"w\",1,0))","v":1},{"$f":"IF(BB26=\"\",\"\",IF(BB26=\"w\",0,1))","v":0},{"$f":"IF(BB26=\"\",\"\",IF(BB26=\"w\",AV26+1,AV26))","v":1},{"$f":"IF(BB26=\"\",\"\",IF(BB26=\"w\",AW26,AW26+1))","v":5},{"$f":"IF(BB26=\"\",\"\",IF(BB26=\"w\",AX26+E26,BB26+AX26))","v":621},null,{"$f":"IF($BB26=\"\",\"\",BH26/$E26*180)","v":621},null,{"$f":"IF(SUM(H26:I26,R26:S26)=0,\"\",IF(B$13=\"\",RANK($CG$26:$CG$32,$CG$26:$CG$32,0),RANK($CG$26:$CG$33,$CG$26:$CG$33,0)))","v":6},{"$f":"IF(●【進行】結果入力表!H9=\"\",\"\",●【進行】結果入力表!H9)","v":""},{"$f":"IF(●【進行】結果入力表!H25=\"\",\"\",●【進行】結果入力表!H25)","v":""},{"$f":"IF(●【進行】結果入力表!H33=\"\",\"\",●【進行】結果入力表!H33)","v":""},{"$f":"IF(●【進行】結果入力表!H49=\"\",\"\",●【進行】結果入力表!H49)","v":""},{"$f":"IF(●【進行】結果入力表!H57=\"\",\"\",●【進行】結果入力表!H57)","v":""},{"$f":"IF(●【進行】結果入力表!H73=\"\",\"\",●【進行】結果入力表!H73)","v":""},null,{"$f":"COUNTIF($BM26:$BR26,BT$5)","v":0},{"$f":"COUNTIF($BM26:$BR26,BU$5)","v":0},0,{"$f":"BT26*10000+BU26*1000+BV26","v":0},7,{"$f":"B26","v":"田尻　哲司"},{"$f":"$A$25","v":"奈良"},{"$f":"IF(BT26>0,\"A\"&E26,IF(BU26>0,\"B\"&E26,BV26))","v":0},null,null,{"$f":"COUNTIF(F26:BC26,\"w\")","v":1},{"$f":"COUNT(F26,N26,AH26,X26,AR26,BB26)","v":5},{"$f":"CD26*180+SUM(F26,N26,AH26,X26,AR26,BB26)*180/E26","v":621},{"$f":"CD26*100000+CF26","v":100621}]
[null,{"$f":"IF(【準備】登録!$C$20=0,\"\",【準備】登録!$I$21)","v":"吉向　翔平"},null,null,{"$f":"【準備】登録!K21","v":180},{"$f":"IFERROR(VLOOKUP($F$4&$A$25&F$25&$B27,結果リスト!$A:$F,6,FALSE),\"\")","v":"W"},null,{"$f":"IF(F27=\"\",\"\",IF(F27=\"w\",1,0))","v":1},{"$f":"IF(F27=\"\",\"\",IF(F27=\"w\",0,1))","v":0},{"$f":"IF(F27=\"\",\"\",IF(F27=\"w\",E27,F27))","v":180},null,{"$f":"IF($F27=\"\",\"\",J27/$E27*180)","v":180},null,{"$f":"IFERROR(VLOOKUP($F$4&$A$25&N$25&$B27,結果リスト!$A:$F,6,FALSE),\"\")","v":137},null,{"$f":"IF(N27=\"\",\"\",IF(N27=\"w\",1,0))","v":0},{"$f":"IF(N27=\"\",\"\",IF(N27=\"w\",0,1))","v":1},{"$f":"IF(N27=\"\",\"\",SUM(H27,P27))","v":1},{"$f":"IF(N27=\"\",\"\",SUM(I27,Q27))","v":1},317,null,317,null,{"$f":"IFERROR(VLOOKUP($X$4&$A$25&X$25&$B27,結果リスト!$A:$F,6,FALSE),\"\")","v":"W"},null,{"$f":"IF(X27=\"\",\"\",IF(X27=\"w\",1,0))","v":1},{"$f":"IF(X27=\"\",\"\",IF(X27=\"w\",0,1))","v":0},{"$f":"IF(X27=\"\",\"\",SUM(R27,Z27))","v":2},{"$f":"IF(X27=\"\",\"\",SUM(S27,AA27))","v":1},497,null,497,null,{"$f":"IFERROR(VLOOKUP($X$4&$A$25&AH$25&$B27,結果リスト!$A:$F,6,FALSE),\"\")","v":"W"},null,{"$f":"IF(AH27=\"\",\"\",IF(AH27=\"w\",1,0))","v":1},{"$f":"IF(AH27=\"\",\"\",IF(AH27=\"w\",0,1))","v":0},{"$f":"IF(AH27=\"\",\"\",SUM(AB27,AJ27))","v":3},{"$f":"IF(AH27=\"\",\"\",SUM(AC27,AK27))","v":1},677,null,677,null,{"$f":"IFERROR(VLOOKUP($AR$4&$A$25&AR$25&$B27,結果リスト!$A:$F,6,FALSE),\"\")","v":124},null,{"$f":"IF(AR27=\"\",\"\",IF(AR27=\"w\",1,0))","v":0},{"$f":"IF(AR27=\"\",\"\",IF(AR27=\"w\",0,1))","v":1},3,2,801,null,801,null,{"$f":"IFERROR(VLOOKUP($AR$4&$A$25&BB$25&$B27,結果リスト!$A:$F,6,FALSE),\"\")","v":"W"},null,{"$f":"IF(BB27=\"\",\"\",IF(BB27=\"w\",1,0))","v":1},{"$f":"IF(BB27=\"\",\"\",IF(BB27=\"w\",0,1))","v":0},4,2,981,null,981,null,1,{"$f":"IF(●【進行】結果入力表!H10=\"\",\"\",●【進行】結果入力表!H10)","v":""},{"$f":"IF(●【進行】結果入力表!H26=\"\",\"\",●【進行】結果入力表!H26)","v":""},{"$f":"IF(●【進行】結果入力表!H34=\"\",\"\",●【進行】結果入力表!H34)","v":""},{"$f":"IF(●【進行】結果入力表!H50=\"\",\"\",●【進行】結果入力表!H50)","v":""},{"$f":"IF(●【進行】結果入力表!H58=\"\",\"\",●【進行】結果入力表!H58)","v":""},{"$f":"IF(●【進行】結果入力表!H74=\"\",\"\",●【進行】結果入力表!H74)","v":""},null,{"$f":"COUNTIF($BM27:$BR27,BT$5)","v":0},0,0,{"$f":"BT27*10000+BU27*1000+BV27","v":0},7,{"$f":"B27","v":"吉向　翔平"},{"$f":"$A$25","v":"奈良"},0,null,null,4,2,981,{"$f":"CD27*100000+CF27","v":400981}]
[null,{"$f":"IF(【準備】登録!$C$20=0,\"\",【準備】登録!$I$22)","v":"巽　大地"},null,null,{"$f":"【準備】登録!K22","v":180},{"$f":"IFERROR(VLOOKUP($F$4&$A$25&F$25&$B28,結果リスト!$A:$F,6,FALSE),\"\")","v":"W"},null,1,0,180,null,180,null,{"$f":"IFERROR(VLOOKUP($F$4&$A$25&N$25&$B28,結果リスト!$A:$F,6,FALSE),\"\")","v":160},null,0,1,1,1,340,null,340,null,{"$f":"IFERROR(VLOOKUP($X$4&$A$25&X$25&$B28,結果リスト!$A:$F,6,FALSE),\"\")","v":91},null,0,1,1,2,431,null,431,null,{"$f":"IFERROR(VLOOKUP($X$4&$A$25&AH$25&$B28,結果リスト!$A:$F,6,FALSE),\"\")","v":"W"},null,1,0,2,2,611,null,611,null,{"$f":"IFERROR(VLOOKUP($AR$4&$A$25&AR$25&$B28,結果リスト!$A:$F,6,FALSE),\"\")","v":42},null,0,1,2,3,653,null,653,null,{"$f":"IFERROR(VLOOKUP($AR$4&$A$25&BB$25&$B28,結果リスト!$A:$F,6,FALSE),\"\")","v":39},null,0,1,2,4,692,null,692,null,4,{"$f":"IF(●【進行】結果入力表!H11=\"\",\"\",●【進行】結果入力表!H11)","v":""},{"$f":"IF(●【進行】結果入力表!H27=\"\",\"\",●【進行】結果入力表!H27)","v":""},{"$f":"IF(●【進行】結果入力表!H35=\"\",\"\",●【進行】結果入力表!H35)","v":""},{"$f":"IF(●【進行】結果入力表!H51=\"\",\"\",●【進行】結果入力表!H51)","v":""},{"$f":"IF(●【進行】結果入力表!H59=\"\",\"\",●【進行】結果入力表!H59)","v":""},{"$f":"IF(●【進行】結果入力表!H75=\"\",\"\",●【進行】結果入力表!H75)","v":""},null,0,0,0,0,7,"巽　大地","奈良",0,null,null,2,4,692,200692]
[null,{"$f":"IF(【準備】登録!$C$20=0,\"\",【準備】登録!$I$23)","v":"山田　晃司"},null,null,{"$f":"【準備】登録!K23","v":180},{"$f":"IFERROR(VLOOKUP($F$4&$A$25&F$25&$B29,結果リスト!$A:$F,6,FALSE),\"\")","v":"W"},null,1,0,180,null,180,null,{"$f":"IFERROR(VLOOKUP($F$4&$A$25&N$25&$B29,結果リスト!$A:$F,6,FALSE),\"\")","v":"W"},null,1,0,2,0,360,null,360,null,{"$f":"IFERROR(VLOOKUP($X$4&$A$25&X$25&$B29,結果リスト!$A:$F,6,FALSE),\"\")","v":73},null,0,1,2,1,433,null,433,null,{"$f":"IFERROR(VLOOKUP($X$4&$A$25&AH$25&$B29,結果リスト!$A:$F,6,FALSE),\"\")","v":"W"},null,1,0,3,1,613,null,613,null,{"$f":"IFERROR(VLOOKUP($AR$4&$A$25&AR$25&$B29,結果リスト!$A:$F,6,FALSE),\"\")","v":164},null,0,1,3,2,777,null,777,null,{"$f":"IFERROR(VLOOKUP($AR$4&$A$25&BB$25&$B29,結果リスト!$A:$F,6,FALSE),\"\")","v":"W"},null,1,0,4,2,957,null,957,null,2,{"$f":"IF(●【進行】結果入力表!H12=\"\",\"\",●【進行】結果入力表!H12)","v":""},{"$f":"IF(●【進行】結果入力表!H28=\"\",\"\",●【進行】結果入力表!H28)","v":102},{"$f":"IF(●【進行】結果入力表!H36=\"\",\"\",●【進行】結果入力表!H36)","v":""},{"$f":"IF(●【進行】結果入力表!H52=\"\",\"\",●【進行】結果入力表!H52)","v":""},{"$f":"IF(●【進行】結果入力表!H60=\"\",\"\",●【進行】結果入力表!H60)","v":""},{"$f":"IF(●【進行】結果入力表!H76=\"\",\"\",●【進行】結果入力表!H76)","v":""},null,0,0,102,102,5,"山田　晃司","奈良",102,null,null,4,2,957,400957]
[null,{"$f":"IF(【準備】登録!$C$20=0,\"\",【準備】登録!$I$24)","v":"鷲尾　隆杜"},null,null,{"$f":"【準備】登録!K24","v":180},{"$f":"IFERROR(VLOOKUP($F$4&$A$25&F$25&$B30,結果リスト!$A:$F,6,FALSE),\"\")","v":155},null,0,1,155,null,155,null,{"$f":"IFERROR(VLOOKUP($F$4&$A$25&N$25&$B30,結果リスト!$A:$F,6,FALSE),\"\")","v":"W"},null,1,0,1,1,335,null,335,null,{"$f":"IFERROR(VLOOKUP($X$4&$A$25&X$25&$B30,結果リスト!$A:$F,6,FALSE),\"\")","v":"W"},null,1,0,2,1,515,null,515,null,{"$f":"IFERROR(VLOOKUP($X$4&$A$25&AH$25&$B30,結果リスト!$A:$F,6,FALSE),\"\")","v":57},null,0,1,2,2,572,null,572,null,{"$f":"IFERROR(VLOOKUP($AR$4&$A$25&AR$25&$B30,結果リスト!$A:$F,6,FALSE),\"\")","v":112},null,0,1,2,3,684,null,684,null,{"$f":"IFERROR(VLOOKUP($AR$4&$A$25&BB$25&$B30,結果リスト!$A:$F,6,FALSE),\"\")","v":89},null,0,1,2,4,773,null,773,null,3,{"$f":"IF(●【進行】結果入力表!H13=\"\",\"\",●【進行】結果入力表!H13)","v":""},{"$f":"IF(●【進行】結果入力表!H29=\"\",\"\",●【進行】結果入力表!H29)","v":105},{"$f":"IF(●【進行】結果入力表!H37=\"\",\"\",●【進行】結果入力表!H37)","v":""},{"$f":"IF(●【進行】結果入力表!H53=\"\",\"\",●【進行】結果入力表!H53)","v":""},{"$f":"IF(●【進行】結果入力表!H61=\"\",\"\",●【進行】結果入力表!H61)","v":""},{"$f":"IF(●【進行】結果入力表!H77=\"\",\"\",●【進行】結果入力表!H77)","v":""},null,0,0,105,105,4,"鷲尾　隆杜","奈良",105,null,null,2,4,773,200773]
[null,{"$f":"IF(【準備】登録!$C$20=0,\"\",【準備】登録!$I$25)","v":"長谷川　進"},null,null,{"$f":"【準備】登録!K25","v":180},{"$f":"IFERROR(VLOOKUP($F$4&$A$25&F$25&$B31,結果リスト!$A:$F,6,FALSE),\"\")","v":164},null,0,1,164,null,164,null,{"$f":"IFERROR(VLOOKUP($F$4&$A$25&N$25&$B31,結果リスト!$A:$F,6,FALSE),\"\")","v":108},null,0,1,0,2,272,null,272,null,{"$f":"IFERROR(VLOOKUP($X$4&$A$25&X$25&$B31,結果リスト!$A:$F,6,FALSE),\"\")","v":50},null,0,1,0,3,322,null,322,null,{"$f":"IFERROR(VLOOKUP($X$4&$A$25&AH$25&$B31,結果リスト!$A:$F,6,FALSE),\"\")","v":96},null,0,1,0,4,418,null,418.00000000000006,null,{"$f":"IFERROR(VLOOKUP($AR$4&$A$25&AR$25&$B31,結果リスト!$A:$F,6,FALSE),\"\")","v":58},null,0,1,0,5,476,null,476,null,{"$f":"IFERROR(VLOOKUP($AR$4&$A$25&BB$25&$B31,結果リスト!$A:$F,6,FALSE),\"\")","v":"W"},null,1,0,1,5,656,null,656,null,5,{"$f":"IF(●【進行】結果入力表!H14=\"\",\"\",●【進行】結果入力表!H14)","v":""},{"$f":"IF(●【進行】結果入力表!H30=\"\",\"\",●【進行】結果入力表!H30)","v":""},{"$f":"IF(●【進行】結果入力表!H38=\"\",\"\",●【進行】結果入力表!H38)","v":""},{"$f":"IF(●【進行】結果入力表!H54=\"\",\"\",●【進行】結果入力表!H54)","v":""},{"$f":"IF(●【進行】結果入力表!H62=\"\",\"\",●【進行】結果入力表!H62)","v":""},{"$f":"IF(●【進行】結果入力表!H78=\"\",\"\",●【進行】結果入力表!H78)","v":""},null,0,0,0,0,7,"長谷川　進","奈良",0,null,null,1,5,656,100656]
[null,{"$f":"IF(【準備】登録!$I$27=0,\"\",【準備】登録!$I$27)","v":""},null,null,{"$f":"【準備】登録!K26","v":0},{"$f":"IFERROR(VLOOKUP($F$4&$A$25&F$25&$B32,結果リスト!$A:$F,6,FALSE),\"\")","v":""},null,"","","",null,"",null,{"$f":"IFERROR(VLOOKUP($F$4&$A$25&N$25&$B32,結果リスト!$A:$F,6,FALSE),\"\")","v":""},null,"","","","","",null,"",null,{"$f":"IFERROR(VLOOKUP($X$4&$A$25&X$25&$B32,結果リスト!$A:$F,6,FALSE),\"\")","v":""},null,"","","","","",null,"",null,{"$f":"IFERROR(VLOOKUP($X$4&$A$25&AH$25&$B32,結果リスト!$A:$F,6,FALSE),\"\")","v":""},null,"","","","","",null,"",null,{"$f":"IFERROR(VLOOKUP($AR$4&$A$25&AR$25&$B32,結果リスト!$A:$F,6,FALSE),\"\")","v":""},null,"","","","","",null,"",null,{"$f":"IFERROR(VLOOKUP($AR$4&$A$25&BB$25&$B32,結果リスト!$A:$F,6,FALSE),\"\")","v":""},null,"","","","","",null,"",null,"",{"$f":"IF(●【進行】結果入力表!H15=\"\",\"\",●【進行】結果入力表!H15)","v":""},{"$f":"IF(●【進行】結果入力表!H31=\"\",\"\",●【進行】結果入力表!H31)","v":""},{"$f":"IF(●【進行】結果入力表!H39=\"\",\"\",●【進行】結果入力表!H39)","v":""},{"$f":"IF(●【進行】結果入力表!H55=\"\",\"\",●【進行】結果入力表!H55)","v":""},{"$f":"IF(●【進行】結果入力表!H63=\"\",\"\",●【進行】結果入力表!H63)","v":""},{"$f":"IF(●【進行】結果入力表!H79=\"\",\"\",●【進行】結果入力表!H79)","v":""},null,0,0,0,0,7,"","奈良",0,null,null,{"$f":"IF(B32=\"\",\"\",COUNTIF(F32:BC32,\"w\"))","v":""},{"$f":"IF(B32=\"\",\"\",COUNT(F32,N32,AH32,X32,AR32,BB32))","v":""},{"$f":"IF(CD32=\"\",\"\",CD32*180+SUM(F32,N32,AH32,X32,AR32,BB32)*180/E32)","v":""},{"$f":"IF(CD32=\"\",\"\",CD32*100000+CF32)","v":""}]
[null,{"$f":"IF(【準備】登録!$I$27=0,\"\",【準備】登録!$I$27)","v":""},null,null,{"$f":"IF(【準備】登録!$I$27=\"\",\"\",【準備】登録!K27)","v":""},{"$f":"IFERROR(VLOOKUP($F$4&$A$25&F$25&$B33,結果リスト!$A:$F,6,FALSE),\"\")","v":""},null,{"$f":"IF(F33=\"\",\"\",IF(F33=\"w\",1,0))","v":""},{"$f":"IF(F33=\"\",\"\",IF(F33=\"w\",0,1))","v":""},"",null,"",null,{"$f":"IFERROR(VLOOKUP($F$4&$A$25&N$25&$B33,結果リスト!$A:$F,6,FALSE),\"\")","v":""},null,"","","","","",null,"",null,{"$f":"IFERROR(VLOOKUP($X$4&$A$25&X$25&$B33,結果リスト!$A:$F,6,FALSE),\"\")","v":""},null,"","","","","",null,"",null,{"$f":"IFERROR(VLOOKUP($X$4&$A$25&AH$25&$B33,結果リスト!$A:$F,6,FALSE),\"\")","v":""},null,"","","","","",null,"",null,{"$f":"IFERROR(VLOOKUP($AR$4&$A$25&AR$25&$B33,結果リスト!$A:$F,6,FALSE),\"\")","v":""},null,"","","","","",null,"",null,{"$f":"IFERROR(VLOOKUP($AR$4&$A$25&BB$25&$B33,結果リスト!$A:$F,6,FALSE),\"\")","v":""},null,"","","","","",null,"",null,"",{"$f":"IF(●【進行】結果入力表!I16=\"\",\"\",IF(●【進行】結果入力表!H16=\"\",\"\",●【進行】結果入力表!H16))","v":""},{"$f":"IF(●【進行】結果入力表!I32=\"\",\"\",IF(●【進行】結果入力表!H32=\"\",\"\",●【進行】結果入力表!H32))","v":""},{"$f":"IF(●【進行】結果入力表!I40=\"\",\"\",IF(●【進行】結果入力表!H40=\"\",\"\",●【進行】結果入力表!H40))","v":""},{"$f":"IF(●【進行】結果入力表!I56=\"\",\"\",IF(●【進行】結果入力表!H56=\"\",\"\",●【進行】結果入力表!H56))","v":""},{"$f":"IF(●【進行】結果入力表!I63=\"\",\"\",IF(●【進行】結果入力表!H64=\"\",\"\",●【進行】結果入力表!H64))","v":""},{"$f":"IF(●【進行】結果入力表!I80=\"\",\"\",IF(●【進行】結果入力表!H80=\"\",\"\",●【進行】結果入力表!H80))","v":""},null,0,0,0,0,7,"","奈良",0,null,null,{"$f":"IF(B33=\"\",\"\",COUNTIF(F33:BC33,\"w\"))","v":""},{"$f":"IF(B33=\"\",\"\",COUNT(F33,N33,AH33,X33,AR33,BB33))","v":""},{"$f":"IF(CD33=\"\",\"\",CD33*180+SUM(F33,N33,AH33,X33,AR33,BB33)*180/E33)","v":""},{"$f":"IF(B33=\"\",\"\",CD33*100000+CF33)","v":""}]
[null,"Total",null,null,null,null,null,{"$f":"IF(COUNTBLANK(H26:H33)=8,\"\",SUM(H26:H33))","v":3},{"$f":"IF(COUNTBLANK(I26:I33)=8,\"\",SUM(I26:I33))","v":3},{"$f":"IF($B26=\"\",\"\",SUM(J26:J33))","v":911},{"$f":"IF($B26=\"\",\"\",SUM(K26:K33))","v":0},{"$f":"IF(COUNTBLANK(L26:L33)=8,\"\",SUM(L26:L33))","v":911},{"$f":"IF($B26=\"\",\"\",SUM(M26:M33))","v":0},null,null,{"$f":"SUM(P26:P33)","v":2},{"$f":"SUM(Q26:Q33)","v":4},{"$f":"IF(COUNTBLANK(R26:R33)=8,\"\",SUM(H34,P34))","v":5},{"$f":"IF(COUNTBLANK(S26:S33)=8,\"\",SUM(I34,Q34))","v":7},{"$f":"IF($B26=\"\",\"\",SUM(T26:T33))","v":1848},{"$f":"IF($B26=\"\",\"\",SUM(U26:U33))","v":0},{"$f":"IF(COUNTBLANK(V26:V33)=8,\"\",SUM(V26:V33))","v":1848},{"$f":"IF($B26=\"\",\"\",SUM(W26:W33))","v":0},null,null,{"$f":"SUM(Z26:Z33)","v":2},{"$f":"SUM(AA26:AA33)","v":4},{"$f":"IF(COUNTBLANK(AB26:AB33)=8,\"\",SUM(R34,Z34))","v":7},{"$f":"IF(COUNTBLANK(AC26:AC33)=8,\"\",SUM(S34,AA34))","v":11},{"$f":"IF($B26=\"\",\"\",SUM(AD26:AD33))","v":2475},{"$f":"IF($B26=\"\",\"\",SUM(AE26:AE33))","v":0},{"$f":"IF(COUNTBLANK(AF26:AF33)=8,\"\",SUM(AF26:AF33))","v":2475},{"$f":"IF($B26=\"\",\"\",SUM(AG26:AG33))","v":0},null,null,{"$f":"SUM(AJ26:AJ33)","v":3},{"$f":"SUM(AK26:AK33)","v":3},{"$f":"IF(COUNTBLANK(AL26:AL33)=8,\"\",SUM(AB34,AJ34))","v":10},{"$f":"IF(COUNTBLANK(AM26:AM33)=8,\"\",SUM(AC34,AK34))","v":14},{"$f":"IF($B26=\"\",\"\",SUM(AN26:AN33))","v":3233},{"$f":"IF($B26=\"\",\"\",SUM(AO26:AO33))","v":0},{"$f":"IF(COUNTBLANK(AP26:AP33)=8,\"\",SUM(AP26:AP33))","v":3233},{"$f":"IF($B26=\"\",\"\",SUM(AQ26:AQ33))","v":0},null,null,{"$f":"SUM(AT26:AT33)","v":0},{"$f":"SUM(AU26:AU33)","v":6},{"$f":"IF(COUNTBLANK(AV26:AV33)=8,\"\",SUM(AL34,AT34))","v":10},{"$f":"IF(COUNTBLANK(AW26:AW33)=8,\"\",SUM(AM34,AU34))","v":20},{"$f":"IF($B26=\"\",\"\",SUM(AX26:AX33))","v":3832},{"$f":"IF($B26=\"\",\"\",SUM(AY26:AY33))","v":0},{"$f":"IF(COUNTBLANK(AZ26:AZ33)=8,\"\",SUM(AZ26:AZ33))","v":3832},{"$f":"IF($B26=\"\",\"\",SUM(BA26:BA33))","v":0},null,null,{"$f":"SUM(BD26:BD33)","v":4},{"$f":"SUM(BE26:BE33)","v":2},{"$f":"IF(COUNTBLANK(BF26:BF33)=8,\"\",SUM(AV34,BD34))","v":14},{"$f":"IF(COUNTBLANK(BG26:BG33)=8,\"\",SUM(AW34,BE34))","v":22},{"$f":"IF($B26=\"\",\"\",SUM(BH26:BH33))","v":4680},{"$f":"IF($B26=\"\",\"\",SUM(BI26:BI33))","v":0},{"$f":"IF(COUNTBLANK(BJ26:BJ33)=8,\"\",SUM(BJ26:BJ33))","v":4680},{"$f":"IF($B26=\"\",\"\",SUM(BK26:BK33))","v":0},null,null,null,null,null,null,null,null,null,null,null,null,null,null,null,null,null,null,{"$f":"SUM(CD26:CD33)","v":14},{"$f":"SUM(CE26:CE33)","v":22},{"$f":"SUM(CF26:CF33)","v":4680},{"$f":"SUM(CG26:CG33)","v":1404680}]
[null,"※","TPの数字は、ハンデによる換算後の得点を示す。"]

{"sheet":"【結果】リーグ成績表","index":4,"n_rows":43,"n_cols":59,"rows_kept":43,"cut":false,"hidden":false,"merged":[[2,0,2,18],[2,20,2,38],[2,40,2,58],[41,49,41,50],[41,53,41,54],[40,40,40,41],[40,42,40,43],[41,40,41,41],[41,42,41,43],[38,53,38,54],[39,49,39,50],[39,53,39,54],[40,49,40,50],[40,53,40,54],[39,40,39,41],[39,42,39,43],[38,40,38,41],[38,42,38,43],[35,40,35,41],[35,42,35,43],[36,40,36,41],[36,42,36,43],[34,40,34,41],[34,42,34,43],[1,51,1,58],[38,47,38,48],[41,45,41,46],[41,47,41,48],[40,45,40,46],[40,47,40,48],[38,49,38,50],[36,47,36,48],[35,45,35,46],[39,45,39,46],[39,47,39,48],[35,47,35,48],[38,45,38,46],[33,53,33,54],[34,49,34,50],[34,53,34,54],[36,49,36,50],[36,53,36,54],[36,45,36,46],[35,49,35,50],[35,53,35,54],[34,45,34,46],[34,47,34,48],[25,47,25,48],[31,40,31,41],[31,42,31,43],[31,45,31,46],[31,47,31,48],[33,40,33,41],[33,42,33,43],[29,47,29,48],[28,53,28,54],[29,49,29,50],[29,53,29,54],[31,49,31,50],[31,53,31,54],[30,53,30,54],[28,40,28,41],[28,42,28,43],[30,49,30,50],[30,40,30,41],[30,42,30,43],[30,45,30,46],[30,47,30,48],[29,40,29,41],[29,42,29,43],[29,45,29,46],[26,49,26,50],[26,53,26,54],[25,40,25,41],[25,42,25,43],[26,40,26,41],[26,42,26,43],[26,45,26,46],[26,47,26,48],[25,45,25,46],[23,40,23,41],[23,42,23,43],[25,49,25,50],[25,53,25,54],[24,40,24,41],[24,42,24,43],[24,45,24,46],[24,47,24,48],[23,53,23,54],[24,49,24,50],[24,53,24,54],[21,49,21,50],[21,53,21,54],[20,53,20,54],[21,40,21,41],[21,42,21,43],[21,45,21,46],[21,47,21,48],[19,42,19,43],[19,45,19,46],[19,47,19,48],[18,53,18,54],[19,49,19,50],[19,53,19,54],[16,47,16,48],[15,45,15,46],[18,40,18,41],[18,42,18,43],[20,49,20,50],[20,40,20,41],[20,42,20,43],[20,45,20,46],[20,47,20,48],[19,40,19,41],[16,49,16,50],[16,53,16,54],[15,40,15,41],[15,42,15,43],[16,40,16,41],[16,42,16,43],[16,45,16,46],[15,49,15,50],[15,53,15,54],[15,47,15,48],[13,40,13,41],[13,42,13,43],[9,47,9,48],[8,53,8,54],[9,49,9,50],[9,53,9,54],[13,53,13,54],[14,49,14,50],[14,53,14,54],[14,40,14,41],[14,42,14,43],[14,45,14,46],[14,47,14,48],[11,49,11,50],[11,53,11,54],[10,53,10,54],[8,40,8,41],[8,42,8,43],[10,49,10,50],[10,40,10,41],[10,42,10,43],[10,45,10,46],[10,47,10,48],[9,40,9,41],[9,42,9,43],[9,45,9,46],[11,40,11,41],[11,42,11,43],[11,45,11,46],[11,47,11,48],[6,49,6,50],[6,53,6,54],[5,40,5,41],[5,42,5,43],[6,40,6,41],[6,42,6,43],[6,45,6,46],[6,47,6,48],[5,45,5,46],[5,47,5,48],[3,40,3,41],[3,42,3,43],[5,49,5,50],[5,53,5,54],[4,40,4,41],[4,42,4,43],[4,45,4,46],[4,47,4,48],[3,53,3,54],[4,49,4,50],[4,53,4,54],[40,29,40,30],[40,33,40,34],[36,27,36,28],[35,25,35,26],[41,29,41,30],[41,33,41,34],[40,20,40,21],[40,22,40,23],[41,20,41,21],[41,22,41,23],[41,25,41,26],[41,27,41,28],[40,25,40,26],[40,27,40,28],[35,29,35,30],[35,33,35,34],[39,20,39,21],[39,22,39,23],[39,25,39,26],[39,27,39,28],[35,20,35,21],[35,22,35,23],[36,20,36,21],[36,22,36,23],[31,29,31,30],[31,33,31,34],[34,20,34,21],[34,22,34,23],[34,25,34,26],[34,27,34,28],[38,27,38,28],[38,29,38,30],[38,33,38,34],[33,20,33,21],[33,22,33,23],[31,20,31,21],[31,22,31,23],[31,25,31,26],[31,27,31,28],[35,27,35,28],[38,20,38,21],[38,22,38,23],[38,25,38,26],[33,33,33,34],[34,29,34,30],[34,33,34,34],[36,29,36,30],[36,33,36,34],[36,25,36,26],[39,29,39,30],[39,33,39,34],[26,29,26,30],[26,33,26,34],[25,20,25,21],[25,22,25,23],[26,20,26,21],[26,22,26,23],[26,25,26,26],[26,27,26,28],[25,25,25,26],[25,27,25,28],[30,33,30,34],[28,20,28,21],[28,22,28,23],[30,29,30,30],[30,20,30,21],[30,22,30,23],[30,25,30,26],[30,27,30,28],[29,20,29,21],[29,22,29,23],[29,25,29,26],[29,27,29,28],[28,33,28,34],[29,29,29,30],[29,33,29,34],[23,20,23,21],[23,22,23,23],[25,29,25,30],[25,33,25,34],[24,20,24,21],[24,22,24,23],[24,25,24,26],[24,27,24,28],[23,33,23,34],[24,29,24,30],[24,33,24,34],[21,29,21,30],[21,33,21,34],[20,33,20,34],[21,20,21,21],[21,22,21,23],[21,25,21,26],[21,27,21,28],[19,22,19,23],[19,25,19,26],[19,27,19,28],[18,33,18,34],[19,29,19,30],[19,33,19,34],[16,27,16,28],[15,25,15,26],[18,20,18,21],[18,22,18,23],[20,29,20,30],[20,20,20,21],[20,22,20,23],[20,25,20,26],[20,27,20,28],[19,20,19,21],[16,29,16,30],[16,33,16,34],[15,20,15,21],[15,22,15,23],[16,20,16,21],[16,22,16,23],[16,25,16,26],[15,29,15,30],[15,33,15,34],[15,27,15,28],[13,20,13,21],[13,22,13,23],[9,27,9,28],[8,33,8,34],[9,29,9,30],[9,33,9,34],[13,33,13,34],[14,29,14,30],[14,33,14,34],[14,20,14,21],[14,22,14,23],[14,25,14,26],[14,27,14,28],[11,29,11,30],[11,33,11,34],[10,33,10,34],[8,20,8,21],[8,22,8,23],[10,29,10,30],[10,20,10,21],[10,22,10,23],[10,25,10,26],[10,27,10,28],[9,20,9,21],[9,22,9,23],[9,25,9,26],[11,20,11,21],[11,22,11,23],[11,25,11,26],[11,27,11,28],[6,29,6,30],[6,33,6,34],[5,20,5,21],[5,22,5,23],[6,20,6,21],[6,22,6,23],[6,25,6,26],[6,27,6,28],[5,25,5,26],[5,27,5,28],[3,20,3,21],[3,22,3,23],[5,29,5,30],[5,33,5,34],[4,20,4,21],[4,22,4,23],[4,25,4,26],[4,27,4,28],[3,33,3,34],[4,29,4,30],[4,33,4,34],[41,9,41,10],[41,13,41,14],[40,0,40,1],[40,2,40,3],[41,0,41,1],[41,2,41,3],[41,5,41,6],[41,7,41,8],[40,5,40,6],[40,7,40,8],[39,9,39,10],[39,13,39,14],[40,9,40,10],[40,13,40,14],[39,0,39,1],[39,2,39,3],[39,5,39,6],[39,7,39,8],[38,0,38,1],[38,2,38,3],[36,9,36,10],[36,13,36,14],[38,13,38,14],[35,13,35,14],[36,0,36,1],[36,2,36,3],[36,5,36,6],[36,7,36,8],[34,2,34,3],[34,5,34,6],[34,7,34,8],[33,13,33,14],[34,9,34,10],[34,13,34,14],[31,7,31,8],[30,5,30,6],[33,0,33,1],[33,2,33,3],[35,9,35,10],[35,0,35,1],[35,2,35,3],[35,5,35,6],[35,7,35,8],[34,0,34,1],[31,9,31,10],[31,13,31,14],[30,0,30,1],[30,2,30,3],[31,0,31,1],[31,2,31,3],[31,5,31,6],[30,9,30,10],[30,13,30,14],[30,7,30,8],[28,0,28,1],[28,2,28,3],[24,7,24,8],[23,13,23,14],[24,9,24,10],[24,13,24,14],[28,13,28,14],[29,9,29,10],[29,13,29,14],[29,0,29,1],[29,2,29,3],[29,5,29,6],[29,7,29,8],[26,9,26,10],[26,13,26,14],[25,13,25,14],[23,0,23,1],[23,2,23,3],[25,9,25,10],[25,0,25,1],[25,2,25,3],[25,5,25,6],[25,7,25,8],[24,0,24,1],[24,2,24,3],[24,5,24,6],[26,0,26,1],[26,2,26,3],[26,5,26,6],[26,7,26,8],[21,9,21,10],[21,13,21,14],[20,0,20,1],[20,2,20,3],[21,0,21,1],[21,2,21,3],[21,5,21,6],[21,7,21,8],[20,5,20,6],[20,7,20,8],[15,2,15,3],[15,5,15,6],[15,7,15,8],[14,0,14,1],[14,2,14,3],[18,0,18,1],[18,2,18,3],[20,9,20,10],[20,13,20,14],[19,0,19,1],[19,2,19,3],[19,5,19,6],[19,7,19,8],[18,13,18,14],[19,9,19,10],[19,13,19,14],[11,9,11,10],[16,9,16,10],[11,13,11,14],[10,0,10,1],[10,2,10,3],[11,0,11,1],[11,2,11,3],[11,5,11,6],[11,7,11,8],[13,13,13,14],[13,0,13,1],[13,2,13,3],[16,13,16,14],[15,13,15,14],[16,0,16,1],[16,2,16,3],[16,5,16,6],[16,7,16,8],[14,5,14,6],[14,7,14,8],[14,9,14,10],[14,13,14,14],[15,9,15,10],[15,0,15,1],[8,0,8,1],[8,2,8,3],[10,9,10,10],[10,13,10,14],[9,0,9,1],[9,2,9,3],[9,5,9,6],[9,7,9,8],[8,13,8,14],[9,9,9,10],[9,13,9,14],[10,7,10,8],[10,5,10,6],[3,2,3,3],[4,2,4,3],[5,2,5,3],[6,2,6,3],[3,0,3,1],[3,13,3,14],[4,13,4,14],[5,13,5,14],[6,13,6,14],[6,5,6,6],[6,7,6,8],[6,9,6,10],[4,5,4,6],[4,7,4,8],[5,5,5,6],[5,7,5,8],[5,9,5,10],[4,9,4,10],[4,0,4,1],[5,0,5,1],[6,0,6,1]]}
[{"$f":"●【結果】個人成績表!A1","v":"第8回　神奈滋対抗戦　　　(奈良；キングスポット)"}]
[null,null,null,null,null,null,null,null,null,null,null,null,null,null,null,null,null,null,null,null,null,null,null,null,null,null,null,null,null,null,null,null,null,null,null,null,null,null,null,null,null,null,null,null,null,null,null,null,null,null,null,{"$f":"【準備】登録!D4","v":"2017-10-22"}]
["第１節",null,null,null,null,null,null,null,null,null,null,null,null,null,null,null,null,null,null,null,"第２節",null,null,null,null,null,null,null,null,null,null,null,null,null,null,null,null,null,null,null,"第３節"]
[1,null,"Name",null,"持点",{"$f":"A5","v":"兵庫"},null,{"$f":"A6","v":"滋賀"},null,{"$f":"A7","v":"奈良"},null,"W","L","TP",null,"TP","LP","R_P","R",null,1,null,"Name",null,{"$f":"$E$4","v":"持点"},{"$f":"$A$5","v":"兵庫"},null,{"$f":"$A$6","v":"滋賀"},null,{"$f":"$A$7","v":"奈良"},null,"W","L","TP",null,"TP","LP","R_P","R",null,1,null,"Name",null,{"$f":"$E$4","v":"持点"},{"$f":"$A$5","v":"兵庫"},null,{"$f":"$A$6","v":"滋賀"},null,{"$f":"$A$7","v":"奈良"},null,"W","L","TP",null,"TP","LP","R_P","R"]
[{"$f":"IF(【準備】登録!$C$17=\"\",\"\",【準備】登録!$C$17)","v":"兵庫"},null,{"$f":"●【進行】結果入力表!D9","v":"宮本　一"},null,{"$f":"【準備】登録!E20","v":180},null,null,{"$f":"IF(●【進行】結果入力表!F17=\"\",\"\",●【進行】結果入力表!F17)","v":"W"},null,{"$f":"IF(●【進行】結果入力表!F9=\"\",\"\",●【進行】結果入力表!F9)","v":"W"},null,{"$f":"IF(J5=\"\",\"\",COUNTIF(F5:K5,\"w\"))","v":2},{"$f":"IF(J5=\"\",\"\",COUNT(H5,J5))","v":0},{"$f":"SUM(F5:K5)+L5*E5","v":360},null,{"$f":"IF(J5=\"\",\"\",N5/E5*180)","v":360},{"$f":"IF(F6=\"w\",180,F6/E5*180)+IF(F7=\"w\",180,F7/E5*180)","v":228},{"$f":"L5*10000000+P5*L10004*10000000+P5*1000-Q5","v":20359772},{"$f":"IF(J5=\"\",\"\",RANK(R5:R7,R5:R7,0))","v":1},null,{"$f":"$A$5","v":"兵庫"},null,{"$f":"●【進行】結果入力表!D41","v":"堂園　雅也"},null,{"$f":"【準備】登録!E25","v":180},null,null,{"$f":"IF(●【進行】結果入力表!F41=\"\",\"\",●【進行】結果入力表!F41)","v":156},null,{"$f":"IF(●【進行】結果入力表!F33=\"\",\"\",●【進行】結果入力表!F33)","v":"W"},null,{"$f":"IF(AD5=\"\",\"\",COUNTIF(Z5:AE5,\"w\"))","v":1},{"$f":"IF(AD5=\"\",\"\",COUNT(AB5,AD5))","v":1},{"$f":"SUM(Z5:AE5)+AF5*Y5","v":336},null,{"$f":"IF(AD5=\"\",\"\",AH5/Y5*180)","v":336},{"$f":"IF(Z6=\"w\",180,Z6/Y5*180)+IF(Z7=\"w\",180,Z7/Y5*180)","v":253},{"$f":"AF5*10000000+AJ5*AF10004*10000000+AJ5*1000-AK5","v":10335747},{"$f":"IF(AD5=\"\",\"\",RANK(AL5:AL7,AL5:AL7,0))","v":{"$error":"#DIV/0!"}},null,{"$f":"$A$5","v":"兵庫"},null,{"$f":"●【進行】結果入力表!D65","v":"中尾　亮太"},null,{"$f":"【準備】登録!E23","v":180},null,null,{"$f":"IF(●【進行】結果入力表!F65=\"\",\"\",●【進行】結果入力表!F65)","v":"W"},null,{"$f":"IF(●【進行】結果入力表!F57=\"\",\"\",●【進行】結果入力表!F57)","v":"W"},null,{"$f":"IF(AX5=\"\",\"\",COUNTIF(AT5:AY5,\"w\"))","v":2},{"$f":"IF(AX5=\"\",\"\",COUNT(AV5,AX5))","v":0},{"$f":"SUM(AT5:AY5)+AZ5*AS5","v":360},null,{"$f":"IF(AX5=\"\",\"\",BB5/AS5*180)","v":360},{"$f":"IF(AT6=\"w\",180,AT6/AS5*180)+IF(AT7=\"w\",180,AT7/AS5*180)","v":160},{"$f":"AZ5*10000000+BD5*AZ10004*10000000+BD5*1000-BE5","v":20359840},{"$f":"IF(AX5=\"\",\"\",RANK(BF5:BF7,BF5:BF7,0))","v":1}]
[{"$f":"IF(【準備】登録!$F$17=\"\",\"\",【準備】登録!$F$17)","v":"滋賀"},null,{"$f":"●【進行】結果入力表!I17","v":"大橋　義治"},null,{"$f":"【準備】登録!H20","v":180},{"$f":"IF(●【進行】結果入力表!G17=\"\",\"\",●【進行】結果入力表!G17)","v":176},null,null,null,{"$f":"IF(●【進行】結果入力表!F25=\"\",\"\",●【進行】結果入力表!F25)","v":"W"},null,{"$f":"IF(J5=\"\",\"\",COUNTIF(F6:K6,\"w\"))","v":1},{"$f":"IF(J5=\"\",\"\",COUNT(F6,J6))","v":1},{"$f":"SUM(F6:K6)+L6*E6","v":356},null,{"$f":"IF(J5=\"\",\"\",N6/E6*180)","v":356},{"$f":"IF(H5=\"w\",180,H5/E6*180)+IF(H7=\"w\",180,H7/E6*180)","v":352},{"$f":"L6*10000000+P6*L10005*10000000+P6*1000-Q6","v":10355648},{"$f":"IF(J5=\"\",\"\",RANK(R5:R7,R5:R7,0))","v":2},null,{"$f":"$A$6","v":"滋賀"},null,{"$f":"●【進行】結果入力表!I41","v":"高島　太一"},null,{"$f":"【準備】登録!H26","v":0},{"$f":"IF(●【進行】結果入力表!G41=\"\",\"\",●【進行】結果入力表!G41)","v":"W"},null,null,null,{"$f":"IF(●【進行】結果入力表!F49=\"\",\"\",●【進行】結果入力表!F49)","v":100},null,{"$f":"IF(AD5=\"\",\"\",COUNTIF(Z6:AE6,\"w\"))","v":1},{"$f":"IF(AD5=\"\",\"\",COUNT(Z6,AD6))","v":1},{"$f":"SUM(Z6:AE6)+AF6*Y6","v":100},null,{"$f":"IF(AD5=\"\",\"\",AH6/Y6*180)","v":{"$error":"#DIV/0!"}},{"$f":"IF(AB5=\"w\",180,AB5/Y6*180)+IF(AB7=\"w\",180,AB7/Y6*180)","v":{"$error":"#DIV/0!"}},{"$f":"AF6*10000000+AJ6*AF10005*10000000+AJ6*1000-AK6","v":{"$error":"#DIV/0!"}},{"$f":"IF(AD5=\"\",\"\",RANK(AL5:AL7,AL5:AL7,0))","v":{"$error":"#DIV/0!"}},null,{"$f":"$A$6","v":"滋賀"},null,{"$f":"●【進行】結果入力表!I65","v":"御手洗　茂"},null,{"$f":"【準備】登録!H25","v":180},{"$f":"IF(●【進行】結果入力表!G65=\"\",\"\",●【進行】結果入力表!G65)","v":61},null,null,null,{"$f":"IF(●【進行】結果入力表!F73=\"\",\"\",●【進行】結果入力表!F73)","v":134},null,{"$f":"IF(AX5=\"\",\"\",COUNTIF(AT6:AY6,\"w\"))","v":0},{"$f":"IF(AX5=\"\",\"\",COUNT(AT6,AX6))","v":2},{"$f":"SUM(AT6:AY6)+AZ6*AS6","v":195},null,{"$f":"IF(AX5=\"\",\"\",BB6/AS6*180)","v":195},{"$f":"IF(AV5=\"w\",180,AV5/AS6*180)+IF(AV7=\"w\",180,AV7/AS6*180)","v":360},{"$f":"AZ6*10000000+BD6*AZ10005*10000000+BD6*1000-BE6","v":194640},{"$f":"IF(AX5=\"\",\"\",RANK(BF5:BF7,BF5:BF7,0))","v":3}]
[{"$f":"IF(【準備】登録!$I$17=\"\",\"\",【準備】登録!$I$17)","v":"奈良"},null,{"$f":"●【進行】結果入力表!I9","v":"田尻　哲司"},null,{"$f":"【準備】登録!K20","v":180},{"$f":"IF(●【進行】結果入力表!G9=\"\",\"\",●【進行】結果入力表!G9)","v":52},null,{"$f":"IF(●【進行】結果入力表!G25=\"\",\"\",●【進行】結果入力表!G25)","v":172},null,null,null,{"$f":"IF(J5=\"\",\"\",COUNTIF(F7:K7,\"w\"))","v":0},{"$f":"IF(J5=\"\",\"\",COUNT(F7,H7))","v":2},{"$f":"SUM(F7:K7)+L7*E7","v":224},null,{"$f":"IF(J5=\"\",\"\",N7/E7*180)","v":224},{"$f":"IF(J5=\"w\",180,J5/E7*180)+IF(J6=\"w\",180,J6/E7*180)","v":360},{"$f":"L7*10000000+P7*L10006*10000000+P7*1000-Q7","v":223640},{"$f":"IF(J5=\"\",\"\",RANK(R5:R7,R5:R7,0))","v":3},null,{"$f":"$A$7","v":"奈良"},null,{"$f":"●【進行】結果入力表!I33","v":"山田　晃司"},null,{"$f":"【準備】登録!K20","v":180},{"$f":"IF(●【進行】結果入力表!G33=\"\",\"\",●【進行】結果入力表!G33)","v":73},null,{"$f":"IF(●【進行】結果入力表!G49=\"\",\"\",●【進行】結果入力表!G49)","v":"W"},null,null,null,{"$f":"IF(AD5=\"\",\"\",COUNTIF(Z7:AE7,\"w\"))","v":1},{"$f":"IF(AD5=\"\",\"\",COUNT(Z7,AB7))","v":1},{"$f":"SUM(Z7:AE7)+AF7*Y7","v":253},null,{"$f":"IF(AD5=\"\",\"\",AH7/Y7*180)","v":252.99999999999997},{"$f":"IF(AD5=\"w\",180,AD5/Y7*180)+IF(AD6=\"w\",180,AD6/Y7*180)","v":280},{"$f":"AF7*10000000+AJ7*AF10006*10000000+AJ7*1000-AK7","v":10252720},{"$f":"IF(AD5=\"\",\"\",RANK(AL5:AL7,AL5:AL7,0))","v":{"$error":"#DIV/0!"}},null,{"$f":"$A$7","v":"奈良"},null,{"$f":"●【進行】結果入力表!I57","v":"田尻　哲司"},null,{"$f":"【準備】登録!K20","v":180},{"$f":"IF(●【進行】結果入力表!G57=\"\",\"\",●【進行】結果入力表!G57)","v":99},null,{"$f":"IF(●【進行】結果入力表!G73=\"\",\"\",●【進行】結果入力表!G73)","v":"W"},null,null,null,{"$f":"IF(AX5=\"\",\"\",COUNTIF(AT7:AY7,\"w\"))","v":1},{"$f":"IF(AX5=\"\",\"\",COUNT(AT7,AV7))","v":1},{"$f":"SUM(AT7:AY7)+AZ7*AS7","v":279},null,{"$f":"IF(AX5=\"\",\"\",BB7/AS7*180)","v":279},{"$f":"IF(AX5=\"w\",180,AX5/AS7*180)+IF(AX6=\"w\",180,AX6/AS7*180)","v":314},{"$f":"AZ7*10000000+BD7*AZ10006*10000000+BD7*1000-BE7","v":10278686},{"$f":"IF(AX5=\"\",\"\",RANK(BF5:BF7,BF5:BF7,0))","v":2}]
[]
[2,null,"Name",null,{"$f":"$E$4","v":"持点"},{"$f":"A10","v":"兵庫"},null,{"$f":"A11","v":"滋賀"},null,{"$f":"A12","v":"奈良"},null,"W","L","TP",null,"TP","LP","R_P","R",null,2,null,"Name",null,{"$f":"$E$4","v":"持点"},{"$f":"$A$5","v":"兵庫"},null,{"$f":"$A$6","v":"滋賀"},null,{"$f":"$A$7","v":"奈良"},null,"W","L","TP",null,"TP","LP","R_P","R",null,2,null,"Name",null,{"$f":"$E$4","v":"持点"},{"$f":"$A$5","v":"兵庫"},null,{"$f":"$A$6","v":"滋賀"},null,{"$f":"$A$7","v":"奈良"},null,"W","L","TP",null,"TP","LP","R_P","R"]
[{"$f":"$A$5","v":"兵庫"},null,{"$f":"●【進行】結果入力表!D10","v":"鐵山　泰三"},null,{"$f":"【準備】登録!E21","v":180},null,null,{"$f":"IF(●【進行】結果入力表!F18=\"\",\"\",●【進行】結果入力表!F18)","v":"W"},null,{"$f":"IF(●【進行】結果入力表!F10=\"\",\"\",●【進行】結果入力表!F10)","v":26},null,{"$f":"IF(J10=\"\",\"\",COUNTIF(F10:K10,\"w\"))","v":1},{"$f":"IF(J10=\"\",\"\",COUNT(H10,J10))","v":1},{"$f":"SUM(F10:K10)+L10*E10","v":206},null,{"$f":"IF(J10=\"\",\"\",N10/E10*180)","v":206},{"$f":"IF(F11=\"w\",180,F11/E10*180)+IF(F12=\"w\",180,F12/E10*180)","v":339},{"$f":"L10*10000000+P10*L10009*10000000+P10*1000-Q10","v":10205661},{"$f":"IF(J10=\"\",\"\",RANK(R10:R12,R10:R12,0))","v":3},null,{"$f":"$A$5","v":"兵庫"},null,{"$f":"●【進行】結果入力表!D42","v":"藤中　健太郎"},null,{"$f":"【準備】登録!E26","v":0},null,null,{"$f":"IF(●【進行】結果入力表!F42=\"\",\"\",●【進行】結果入力表!F42)","v":24},null,{"$f":"IF(●【進行】結果入力表!F34=\"\",\"\",●【進行】結果入力表!F34)","v":88},null,{"$f":"IF(AD10=\"\",\"\",COUNTIF(Z10:AE10,\"w\"))","v":0},{"$f":"IF(AD10=\"\",\"\",COUNT(AB10,AD10))","v":2},{"$f":"SUM(Z10:AE10)+AF10*Y10","v":112},null,{"$f":"IF(AD10=\"\",\"\",AH10/Y10*180)","v":{"$error":"#DIV/0!"}},{"$f":"IF(Z11=\"w\",180,Z11/Y10*180)+IF(Z12=\"w\",180,Z12/Y10*180)","v":360},{"$f":"AF10*10000000+AJ10*AF10009*10000000+AJ10*1000-AK10","v":{"$error":"#DIV/0!"}},{"$f":"IF(AD10=\"\",\"\",RANK(AL10:AL12,AL10:AL12,0))","v":{"$error":"#DIV/0!"}},null,{"$f":"$A$5","v":"兵庫"},null,{"$f":"●【進行】結果入力表!D66","v":"平井　洸志"},null,{"$f":"【準備】登録!E24","v":180},null,null,{"$f":"IF(●【進行】結果入力表!F66=\"\",\"\",●【進行】結果入力表!F66)","v":45},null,{"$f":"IF(●【進行】結果入力表!F58=\"\",\"\",●【進行】結果入力表!F58)","v":"W"},null,{"$f":"IF(AX10=\"\",\"\",COUNTIF(AT10:AY10,\"w\"))","v":1},{"$f":"IF(AX10=\"\",\"\",COUNT(AV10,AX10))","v":1},{"$f":"SUM(AT10:AY10)+AZ10*AS10","v":225},null,{"$f":"IF(AX10=\"\",\"\",BB10/AS10*180)","v":225},{"$f":"IF(AT11=\"w\",180,AT11/AS10*180)+IF(AT12=\"w\",180,AT12/AS10*180)","v":304},{"$f":"AZ10*10000000+BD10*AZ10009*10000000+BD10*1000-BE10","v":10224696},{"$f":"IF(AX10=\"\",\"\",RANK(BF10:BF12,BF10:BF12,0))","v":{"$error":"#DIV/0!"}}]
[{"$f":"$A$6","v":"滋賀"},null,{"$f":"●【進行】結果入力表!I18","v":"大橋　正寛"},null,{"$f":"【準備】登録!H21","v":180},{"$f":"IF(●【進行】結果入力表!G18=\"\",\"\",●【進行】結果入力表!G18)","v":159},null,null,null,{"$f":"IF(●【進行】結果入力表!F26=\"\",\"\",●【進行】結果入力表!F26)","v":"W"},null,{"$f":"IF(J10=\"\",\"\",COUNTIF(F11:K11,\"w\"))","v":1},{"$f":"IF(J10=\"\",\"\",COUNT(F11,J11))","v":1},{"$f":"SUM(F11:K11)+L11*E11","v":339},null,{"$f":"IF(J10=\"\",\"\",N11/E11*180)","v":339},{"$f":"IF(H10=\"w\",180,H10/E11*180)+IF(H12=\"w\",180,H12/E11*180)","v":317},{"$f":"L11*10000000+P11*L10010*10000000+P11*1000-Q11","v":10338683},{"$f":"IF(J10=\"\",\"\",RANK(R10:R12,R10:R12,0))","v":1},null,{"$f":"$A$6","v":"滋賀"},null,{"$f":"●【進行】結果入力表!I42","v":"大橋　義治"},null,{"$f":"【準備】登録!H20","v":180},{"$f":"IF(●【進行】結果入力表!G42=\"\",\"\",●【進行】結果入力表!G42)","v":"W"},null,null,null,{"$f":"IF(●【進行】結果入力表!F50=\"\",\"\",●【進行】結果入力表!F50)","v":"W"},null,{"$f":"IF(AD10=\"\",\"\",COUNTIF(Z11:AE11,\"w\"))","v":2},{"$f":"IF(AD10=\"\",\"\",COUNT(Z11,AD11))","v":0},{"$f":"SUM(Z11:AE11)+AF11*Y11","v":360},null,{"$f":"IF(AD10=\"\",\"\",AH11/Y11*180)","v":360},{"$f":"IF(AB10=\"w\",180,AB10/Y11*180)+IF(AB12=\"w\",180,AB12/Y11*180)","v":81},{"$f":"AF11*10000000+AJ11*AF10010*10000000+AJ11*1000-AK11","v":20359919},{"$f":"IF(AD10=\"\",\"\",RANK(AL10:AL12,AL10:AL12,0))","v":{"$error":"#DIV/0!"}},null,{"$f":"$A$6","v":"滋賀"},null,{"$f":"●【進行】結果入力表!I66","v":"高島　太一"},null,{"$f":"【準備】登録!H26","v":0},{"$f":"IF(●【進行】結果入力表!G66=\"\",\"\",●【進行】結果入力表!G66)","v":"W"},null,null,null,{"$f":"IF(●【進行】結果入力表!F74=\"\",\"\",●【進行】結果入力表!F74)","v":132},null,{"$f":"IF(AX10=\"\",\"\",COUNTIF(AT11:AY11,\"w\"))","v":1},{"$f":"IF(AX10=\"\",\"\",COUNT(AT11,AX11))","v":1},{"$f":"SUM(AT11:AY11)+AZ11*AS11","v":132},null,{"$f":"IF(AX10=\"\",\"\",BB11/AS11*180)","v":{"$error":"#DIV/0!"}},{"$f":"IF(AV10=\"w\",180,AV10/AS11*180)+IF(AV12=\"w\",180,AV12/AS11*180)","v":{"$error":"#DIV/0!"}},{"$f":"AZ11*10000000+BD11*AZ10010*10000000+BD11*1000-BE11","v":{"$error":"#DIV/0!"}},{"$f":"IF(AX10=\"\",\"\",RANK(BF10:BF12,BF10:BF12,0))","v":{"$error":"#DIV/0!"}}]
[{"$f":"$A$7","v":"奈良"},null,{"$f":"●【進行】結果入力表!I10","v":"吉向　翔平"},null,{"$f":"【準備】登録!K21","v":180},{"$f":"IF(●【進行】結果入力表!G10=\"\",\"\",●【進行】結果入力表!G10)","v":"W"},null,{"$f":"IF(●【進行】結果入力表!G26=\"\",\"\",●【進行】結果入力表!G26)","v":137},null,null,null,{"$f":"IF(J10=\"\",\"\",COUNTIF(F12:K12,\"w\"))","v":1},{"$f":"IF(J10=\"\",\"\",COUNT(F12,H12))","v":1},{"$f":"SUM(F12:K12)+L12*E12","v":317},null,{"$f":"IF(J10=\"\",\"\",N12/E12*180)","v":317},{"$f":"IF(J10=\"w\",180,J10/E12*180)+IF(J11=\"w\",180,J11/E12*180)","v":206},{"$f":"L12*10000000+P12*L10011*10000000+P12*1000-Q12","v":10316794},{"$f":"IF(J10=\"\",\"\",RANK(R10:R12,R10:R12,0))","v":2},null,{"$f":"$A$7","v":"奈良"},null,{"$f":"●【進行】結果入力表!I34","v":"鷲尾　隆杜"},null,{"$f":"【準備】登録!K21","v":180},{"$f":"IF(●【進行】結果入力表!G34=\"\",\"\",●【進行】結果入力表!G34)","v":"W"},null,{"$f":"IF(●【進行】結果入力表!G50=\"\",\"\",●【進行】結果入力表!G50)","v":57},null,null,null,{"$f":"IF(AD10=\"\",\"\",COUNTIF(Z12:AE12,\"w\"))","v":1},{"$f":"IF(AD10=\"\",\"\",COUNT(Z12,AB12))","v":1},{"$f":"SUM(Z12:AE12)+AF12*Y12","v":237},null,{"$f":"IF(AD10=\"\",\"\",AH12/Y12*180)","v":237},{"$f":"IF(AD10=\"w\",180,AD10/Y12*180)+IF(AD11=\"w\",180,AD11/Y12*180)","v":268},{"$f":"AF12*10000000+AJ12*AF10011*10000000+AJ12*1000-AK12","v":10236732},{"$f":"IF(AD10=\"\",\"\",RANK(AL10:AL12,AL10:AL12,0))","v":{"$error":"#DIV/0!"}},null,{"$f":"$A$7","v":"奈良"},null,{"$f":"●【進行】結果入力表!I58","v":"吉向　翔平"},null,{"$f":"【準備】登録!K21","v":180},{"$f":"IF(●【進行】結果入力表!G58=\"\",\"\",●【進行】結果入力表!G58)","v":124},null,{"$f":"IF(●【進行】結果入力表!G74=\"\",\"\",●【進行】結果入力表!G74)","v":"W"},null,null,null,{"$f":"IF(AX10=\"\",\"\",COUNTIF(AT12:AY12,\"w\"))","v":1},{"$f":"IF(AX10=\"\",\"\",COUNT(AT12,AV12))","v":1},{"$f":"SUM(AT12:AY12)+AZ12*AS12","v":304},null,{"$f":"IF(AX10=\"\",\"\",BB12/AS12*180)","v":304},{"$f":"IF(AX10=\"w\",180,AX10/AS12*180)+IF(AX11=\"w\",180,AX11/AS12*180)","v":312},{"$f":"AZ12*10000000+BD12*AZ10011*10000000+BD12*1000-BE12","v":10303688},{"$f":"IF(AX10=\"\",\"\",RANK(BF10:BF12,BF10:BF12,0))","v":{"$error":"#DIV/0!"}}]
[]
[3,null,"Name",null,{"$f":"E$4","v":"持点"},{"$f":"A15","v":"兵庫"},null,{"$f":"A16","v":"滋賀"},null,{"$f":"A17","v":"奈良"},null,"W","L","TP",null,"TP","LP","R_P","R",null,3,null,"Name",null,{"$f":"$E$4","v":"持点"},{"$f":"$A$5","v":"兵庫"},null,{"$f":"$A$6","v":"滋賀"},null,{"$f":"$A$7","v":"奈良"},null,"W","L","TP",null,"TP","LP","R_P","R",null,3,null,"Name",null,{"$f":"$E$4","v":"持点"},{"$f":"$A$5","v":"兵庫"},null,{"$f":"$A$6","v":"滋賀"},null,{"$f":"$A$7","v":"奈良"},null,"W","L","TP",null,"TP","LP","R_P","R"]
[{"$f":"$A$5","v":"兵庫"},null,{"$f":"●【進行】結果入力表!D11","v":"中尾　亮太"},null,{"$f":"【準備】登録!E22","v":180},null,null,{"$f":"IF(●【進行】結果入力表!F19=\"\",\"\",●【進行】結果入力表!F19)","v":153},null,{"$f":"IF(●【進行】結果入力表!F11=\"\",\"\",●【進行】結果入力表!F11)","v":24},null,{"$f":"IF(J15=\"\",\"\",COUNTIF(F15:K15,\"w\"))","v":0},{"$f":"IF(J15=\"\",\"\",COUNT(H15,J15))","v":2},{"$f":"SUM(F15:K15)+L15*E15","v":177},null,{"$f":"IF(J15=\"\",\"\",N15/E15*180)","v":177},{"$f":"IF(F16=\"w\",180,F16/E15*180)+IF(F17=\"w\",180,F17/E15*180)","v":360},{"$f":"L15*10000000+P15*L10014*10000000+P15*1000-Q15","v":176640},{"$f":"IF(J15=\"\",\"\",RANK(R15:R17,R15:R17,0))","v":3},null,{"$f":"$A$5","v":"兵庫"},null,{"$f":"●【進行】結果入力表!D43","v":"宮本　一"},null,{"$f":"【準備】登録!E20","v":180},null,null,{"$f":"IF(●【進行】結果入力表!F43=\"\",\"\",●【進行】結果入力表!F43)","v":"W"},null,{"$f":"IF(●【進行】結果入力表!F35=\"\",\"\",●【進行】結果入力表!F35)","v":"W"},null,{"$f":"IF(AD15=\"\",\"\",COUNTIF(Z15:AE15,\"w\"))","v":2},{"$f":"IF(AD15=\"\",\"\",COUNT(AB15,AD15))","v":0},{"$f":"SUM(Z15:AE15)+AF15*Y15","v":360},null,{"$f":"IF(AD15=\"\",\"\",AH15/Y15*180)","v":360},{"$f":"IF(Z16=\"w\",180,Z16/Y15*180)+IF(Z17=\"w\",180,Z17/Y15*180)","v":206},{"$f":"AF15*10000000+AJ15*AF10014*10000000+AJ15*1000-AK15","v":20359794},{"$f":"IF(AD15=\"\",\"\",RANK(AL15:AL17,AL15:AL17,0))","v":1},null,{"$f":"$A$5","v":"兵庫"},null,{"$f":"●【進行】結果入力表!D67","v":"堂園　雅也"},null,{"$f":"【準備】登録!E25","v":180},null,null,{"$f":"IF(●【進行】結果入力表!F67=\"\",\"\",●【進行】結果入力表!F67)","v":88},null,{"$f":"IF(●【進行】結果入力表!F59=\"\",\"\",●【進行】結果入力表!F59)","v":"W"},null,{"$f":"IF(AX15=\"\",\"\",COUNTIF(AT15:AY15,\"w\"))","v":1},{"$f":"IF(AX15=\"\",\"\",COUNT(AV15,AX15))","v":1},{"$f":"SUM(AT15:AY15)+AZ15*AS15","v":268},null,{"$f":"IF(AX15=\"\",\"\",BB15/AS15*180)","v":268},{"$f":"IF(AT16=\"w\",180,AT16/AS15*180)+IF(AT17=\"w\",180,AT17/AS15*180)","v":222},{"$f":"AZ15*10000000+BD15*AZ10014*10000000+BD15*1000-BE15","v":10267778},{"$f":"IF(AX15=\"\",\"\",RANK(BF15:BF17,BF15:BF17,0))","v":2}]
[{"$f":"$A$6","v":"滋賀"},null,{"$f":"●【進行】結果入力表!I19","v":"西峰　久祐"},null,{"$f":"【準備】登録!H22","v":180},{"$f":"IF(●【進行】結果入力表!G19=\"\",\"\",●【進行】結果入力表!G19)","v":"W"},null,null,null,{"$f":"IF(●【進行】結果入力表!F27=\"\",\"\",●【進行】結果入力表!F27)","v":"W"},null,{"$f":"IF(J15=\"\",\"\",COUNTIF(F16:K16,\"w\"))","v":2},{"$f":"IF(J15=\"\",\"\",COUNT(F16,J16))","v":0},{"$f":"SUM(F16:K16)+L16*E16","v":360},null,{"$f":"IF(J15=\"\",\"\",N16/E16*180)","v":360},{"$f":"IF(H15=\"w\",180,H15/E16*180)+IF(H17=\"w\",180,H17/E16*180)","v":313},{"$f":"L16*10000000+P16*L10015*10000000+P16*1000-Q16","v":20359687},{"$f":"IF(J15=\"\",\"\",RANK(R15:R17,R15:R17,0))","v":1},null,{"$f":"$A$6","v":"滋賀"},null,{"$f":"●【進行】結果入力表!I43","v":"大橋　正寛"},null,{"$f":"【準備】登録!H21","v":180},{"$f":"IF(●【進行】結果入力表!G43=\"\",\"\",●【進行】結果入力表!G43)","v":156},null,null,null,{"$f":"IF(●【進行】結果入力表!F51=\"\",\"\",●【進行】結果入力表!F51)","v":"W"},null,{"$f":"IF(AD15=\"\",\"\",COUNTIF(Z16:AE16,\"w\"))","v":1},{"$f":"IF(AD15=\"\",\"\",COUNT(Z16,AD16))","v":1},{"$f":"SUM(Z16:AE16)+AF16*Y16","v":336},null,{"$f":"IF(AD15=\"\",\"\",AH16/Y16*180)","v":336},{"$f":"IF(AB15=\"w\",180,AB15/Y16*180)+IF(AB17=\"w\",180,AB17/Y16*180)","v":276},{"$f":"AF16*10000000+AJ16*AF10015*10000000+AJ16*1000-AK16","v":10335724},{"$f":"IF(AD15=\"\",\"\",RANK(AL15:AL17,AL15:AL17,0))","v":2},null,{"$f":"$A$6","v":"滋賀"},null,{"$f":"●【進行】結果入力表!I67","v":"大橋　義治"},null,{"$f":"【準備】登録!H20","v":180},{"$f":"IF(●【進行】結果入力表!G67=\"\",\"\",●【進行】結果入力表!G67)","v":"W"},null,null,null,{"$f":"IF(●【進行】結果入力表!F75=\"\",\"\",●【進行】結果入力表!F75)","v":"W"},null,{"$f":"IF(AX15=\"\",\"\",COUNTIF(AT16:AY16,\"w\"))","v":2},{"$f":"IF(AX15=\"\",\"\",COUNT(AT16,AX16))","v":0},{"$f":"SUM(AT16:AY16)+AZ16*AS16","v":360},null,{"$f":"IF(AX15=\"\",\"\",BB16/AS16*180)","v":360},{"$f":"IF(AV15=\"w\",180,AV15/AS16*180)+IF(AV17=\"w\",180,AV17/AS16*180)","v":127},{"$f":"AZ16*10000000+BD16*AZ10015*10000000+BD16*1000-BE16","v":20359873},{"$f":"IF(AX15=\"\",\"\",RANK(BF15:BF17,BF15:BF17,0))","v":1}]
[{"$f":"$A$7","v":"奈良"},null,{"$f":"●【進行】結果入力表!I11","v":"巽　大地"},null,{"$f":"【準備】登録!K22","v":180},{"$f":"IF(●【進行】結果入力表!G11=\"\",\"\",●【進行】結果入力表!G11)","v":"W"},null,{"$f":"IF(●【進行】結果入力表!G27=\"\",\"\",●【進行】結果入力表!G27)","v":160},null,null,null,{"$f":"IF(J15=\"\",\"\",COUNTIF(F17:K17,\"w\"))","v":1},{"$f":"IF(J15=\"\",\"\",COUNT(F17,H17))","v":1},{"$f":"SUM(F17:K17)+L17*E17","v":340},null,{"$f":"IF(J15=\"\",\"\",N17/E17*180)","v":340},{"$f":"IF(J15=\"w\",180,J15/E17*180)+IF(J16=\"w\",180,J16/E17*180)","v":204},{"$f":"L17*10000000+P17*L10016*10000000+P17*1000-Q17","v":10339796},{"$f":"IF(J15=\"\",\"\",RANK(R15:R17,R15:R17,0))","v":2},null,{"$f":"$A$7","v":"奈良"},null,{"$f":"●【進行】結果入力表!I35","v":"長谷川　進"},null,{"$f":"【準備】登録!K22","v":180},{"$f":"IF(●【進行】結果入力表!G35=\"\",\"\",●【進行】結果入力表!G35)","v":50},null,{"$f":"IF(●【進行】結果入力表!G51=\"\",\"\",●【進行】結果入力表!G51)","v":96},null,null,null,{"$f":"IF(AD15=\"\",\"\",COUNTIF(Z17:AE17,\"w\"))","v":0},{"$f":"IF(AD15=\"\",\"\",COUNT(Z17,AB17))","v":2},{"$f":"SUM(Z17:AE17)+AF17*Y17","v":146},null,{"$f":"IF(AD15=\"\",\"\",AH17/Y17*180)","v":146},{"$f":"IF(AD15=\"w\",180,AD15/Y17*180)+IF(AD16=\"w\",180,AD16/Y17*180)","v":360},{"$f":"AF17*10000000+AJ17*AF10016*10000000+AJ17*1000-AK17","v":145640},{"$f":"IF(AD15=\"\",\"\",RANK(AL15:AL17,AL15:AL17,0))","v":3},null,{"$f":"$A$7","v":"奈良"},null,{"$f":"●【進行】結果入力表!I59","v":"巽　大地"},null,{"$f":"【準備】登録!K22","v":180},{"$f":"IF(●【進行】結果入力表!G59=\"\",\"\",●【進行】結果入力表!G59)","v":42},null,{"$f":"IF(●【進行】結果入力表!G75=\"\",\"\",●【進行】結果入力表!G75)","v":39},null,null,null,{"$f":"IF(AX15=\"\",\"\",COUNTIF(AT17:AY17,\"w\"))","v":0},{"$f":"IF(AX15=\"\",\"\",COUNT(AT17,AV17))","v":2},{"$f":"SUM(AT17:AY17)+AZ17*AS17","v":81},null,{"$f":"IF(AX15=\"\",\"\",BB17/AS17*180)","v":81},{"$f":"IF(AX15=\"w\",180,AX15/AS17*180)+IF(AX16=\"w\",180,AX16/AS17*180)","v":360},{"$f":"AZ17*10000000+BD17*AZ10016*10000000+BD17*1000-BE17","v":80640},{"$f":"IF(AX15=\"\",\"\",RANK(BF15:BF17,BF15:BF17,0))","v":3}]
[]
[4,null,"Name",null,{"$f":"E$4","v":"持点"},{"$f":"A20","v":"兵庫"},null,{"$f":"A21","v":"滋賀"},null,{"$f":"A22","v":"奈良"},null,"W","L","TP",null,"TP","LP","R_P","R",null,4,null,"Name",null,{"$f":"$E$4","v":"持点"},{"$f":"$A$5","v":"兵庫"},null,{"$f":"$A$6","v":"滋賀"},null,{"$f":"$A$7","v":"奈良"},null,"W","L","TP",null,"TP","LP","R_P","R",null,4,null,"Name",null,{"$f":"$E$4","v":"持点"},{"$f":"$A$5","v":"兵庫"},null,{"$f":"$A$6","v":"滋賀"},null,{"$f":"$A$7","v":"奈良"},null,"W","L","TP",null,"TP","LP","R_P","R"]
[{"$f":"$A$5","v":"兵庫"},null,{"$f":"●【進行】結果入力表!D12","v":"平井　洸志"},null,{"$f":"【準備】登録!E23","v":180},null,null,{"$f":"IF(●【進行】結果入力表!F20=\"\",\"\",●【進行】結果入力表!F20)","v":102},null,{"$f":"IF(●【進行】結果入力表!F12=\"\",\"\",●【進行】結果入力表!F12)","v":24},null,{"$f":"IF(J20=\"\",\"\",COUNTIF(F20:K20,\"w\"))","v":0},{"$f":"IF(J20=\"\",\"\",COUNT(H20,J20))","v":2},{"$f":"SUM(F20:K20)+L20*E20","v":126},null,{"$f":"IF(J20=\"\",\"\",N20/E20*180)","v":125.99999999999999},{"$f":"IF(F21=\"w\",180,F21/E20*180)+IF(F22=\"w\",180,F22/E20*180)","v":360},{"$f":"L20*10000000+P20*L10019*10000000+P20*1000-Q20","v":125639.99999999999},{"$f":"IF(J20=\"\",\"\",RANK(R20:R22,R20:R22,0))","v":3},null,{"$f":"$A$5","v":"兵庫"},null,{"$f":"●【進行】結果入力表!D44","v":"鐵山　泰三"},null,{"$f":"【準備】登録!E21","v":180},null,null,{"$f":"IF(●【進行】結果入力表!F44=\"\",\"\",●【進行】結果入力表!F44)","v":"W"},null,{"$f":"IF(●【進行】結果入力表!F36=\"\",\"\",●【進行】結果入力表!F36)","v":"W"},null,{"$f":"IF(AD20=\"\",\"\",COUNTIF(Z20:AE20,\"w\"))","v":2},{"$f":"IF(AD20=\"\",\"\",COUNT(AB20,AD20))","v":0},{"$f":"SUM(Z20:AE20)+AF20*Y20","v":360},null,{"$f":"IF(AD20=\"\",\"\",AH20/Y20*180)","v":360},{"$f":"IF(Z21=\"w\",180,Z21/Y20*180)+IF(Z22=\"w\",180,Z22/Y20*180)","v":115},{"$f":"AF20*10000000+AJ20*AF10019*10000000+AJ20*1000-AK20","v":20359885},{"$f":"IF(AD20=\"\",\"\",RANK(AL20:AL22,AL20:AL22,0))","v":1},null,{"$f":"$A$5","v":"兵庫"},null,{"$f":"●【進行】結果入力表!D68","v":"藤中　健太郎"},null,{"$f":"【準備】登録!E26","v":0},null,null,{"$f":"IF(●【進行】結果入力表!F68=\"\",\"\",●【進行】結果入力表!F68)","v":"W"},null,{"$f":"IF(●【進行】結果入力表!F60=\"\",\"\",●【進行】結果入力表!F60)","v":"W"},null,{"$f":"IF(AX20=\"\",\"\",COUNTIF(AT20:AY20,\"w\"))","v":2},{"$f":"IF(AX20=\"\",\"\",COUNT(AV20,AX20))","v":0},{"$f":"SUM(AT20:AY20)+AZ20*AS20","v":0},null,{"$f":"IF(AX20=\"\",\"\",BB20/AS20*180)","v":{"$error":"#DIV/0!"}},{"$f":"IF(AT21=\"w\",180,AT21/AS20*180)+IF(AT22=\"w\",180,AT22/AS20*180)","v":{"$error":"#DIV/0!"}},{"$f":"AZ20*10000000+BD20*AZ10019*10000000+BD20*1000-BE20","v":{"$error":"#DIV/0!"}},{"$f":"IF(AX20=\"\",\"\",RANK(BF20:BF22,BF20:BF22,0))","v":{"$error":"#DIV/0!"}}]
[{"$f":"$A$6","v":"滋賀"},null,{"$f":"●【進行】結果入力表!I20","v":"山中　康寛"},null,{"$f":"【準備】登録!H23","v":180},{"$f":"IF(●【進行】結果入力表!G20=\"\",\"\",●【進行】結果入力表!G20)","v":"W"},null,null,null,{"$f":"IF(●【進行】結果入力表!F28=\"\",\"\",●【進行】結果入力表!F28)","v":78},null,{"$f":"IF(J20=\"\",\"\",COUNTIF(F21:K21,\"w\"))","v":1},{"$f":"IF(J20=\"\",\"\",COUNT(F21,J21))","v":1},{"$f":"SUM(F21:K21)+L21*E21","v":258},null,{"$f":"IF(J20=\"\",\"\",N21/E21*180)","v":258},{"$f":"IF(H20=\"w\",180,H20/E21*180)+IF(H22=\"w\",180,H22/E21*180)","v":282},{"$f":"L21*10000000+P21*L10020*10000000+P21*1000-Q21","v":10257718},{"$f":"IF(J20=\"\",\"\",RANK(R20:R22,R20:R22,0))","v":2},null,{"$f":"$A$6","v":"滋賀"},null,{"$f":"●【進行】結果入力表!I44","v":"西峰　久祐"},null,{"$f":"【準備】登録!H22","v":180},{"$f":"IF(●【進行】結果入力表!G44=\"\",\"\",●【進行】結果入力表!G44)","v":62},null,null,null,{"$f":"IF(●【進行】結果入力表!F52=\"\",\"\",●【進行】結果入力表!F52)","v":"W"},null,{"$f":"IF(AD20=\"\",\"\",COUNTIF(Z21:AE21,\"w\"))","v":1},{"$f":"IF(AD20=\"\",\"\",COUNT(Z21,AD21))","v":1},{"$f":"SUM(Z21:AE21)+AF21*Y21","v":242},null,{"$f":"IF(AD20=\"\",\"\",AH21/Y21*180)","v":242.00000000000003},{"$f":"IF(AB20=\"w\",180,AB20/Y21*180)+IF(AB22=\"w\",180,AB22/Y21*180)","v":245},{"$f":"AF21*10000000+AJ21*AF10020*10000000+AJ21*1000-AK21","v":10241755},{"$f":"IF(AD20=\"\",\"\",RANK(AL20:AL22,AL20:AL22,0))","v":2},null,{"$f":"$A$6","v":"滋賀"},null,{"$f":"●【進行】結果入力表!I68","v":"大橋　正寛"},null,{"$f":"【準備】登録!H21","v":180},{"$f":"IF(●【進行】結果入力表!G68=\"\",\"\",●【進行】結果入力表!G68)","v":17},null,null,null,{"$f":"IF(●【進行】結果入力表!F76=\"\",\"\",●【進行】結果入力表!F76)","v":75},null,{"$f":"IF(AX20=\"\",\"\",COUNTIF(AT21:AY21,\"w\"))","v":0},{"$f":"IF(AX20=\"\",\"\",COUNT(AT21,AX21))","v":2},{"$f":"SUM(AT21:AY21)+AZ21*AS21","v":92},null,{"$f":"IF(AX20=\"\",\"\",BB21/AS21*180)","v":92},{"$f":"IF(AV20=\"w\",180,AV20/AS21*180)+IF(AV22=\"w\",180,AV22/AS21*180)","v":360},{"$f":"AZ21*10000000+BD21*AZ10020*10000000+BD21*1000-BE21","v":91640},{"$f":"IF(AX20=\"\",\"\",RANK(BF20:BF22,BF20:BF22,0))","v":{"$error":"#DIV/0!"}}]
[{"$f":"$A$7","v":"奈良"},null,{"$f":"●【進行】結果入力表!I12","v":"山田　晃司"},null,{"$f":"【準備】登録!K23","v":180},{"$f":"IF(●【進行】結果入力表!G12=\"\",\"\",●【進行】結果入力表!G12)","v":"W"},null,{"$f":"IF(●【進行】結果入力表!G28=\"\",\"\",●【進行】結果入力表!G28)","v":"W"},null,null,null,{"$f":"IF(J20=\"\",\"\",COUNTIF(F22:K22,\"w\"))","v":2},{"$f":"IF(J20=\"\",\"\",COUNT(F22,H22))","v":0},{"$f":"SUM(F22:K22)+L22*E22","v":360},null,{"$f":"IF(J20=\"\",\"\",N22/E22*180)","v":360},{"$f":"IF(J20=\"w\",180,J20/E22*180)+IF(J21=\"w\",180,J21/E22*180)","v":102},{"$f":"L22*10000000+P22*L10021*10000000+P22*1000-Q22","v":20359898},{"$f":"IF(J20=\"\",\"\",RANK(R20:R22,R20:R22,0))","v":1},null,{"$f":"$A$7","v":"奈良"},null,{"$f":"●【進行】結果入力表!I36","v":"田尻　哲司"},null,{"$f":"【準備】登録!K23","v":180},{"$f":"IF(●【進行】結果入力表!G36=\"\",\"\",●【進行】結果入力表!G36)","v":53},null,{"$f":"IF(●【進行】結果入力表!G52=\"\",\"\",●【進行】結果入力表!G52)","v":65},null,null,null,{"$f":"IF(AD20=\"\",\"\",COUNTIF(Z22:AE22,\"w\"))","v":0},{"$f":"IF(AD20=\"\",\"\",COUNT(Z22,AB22))","v":2},{"$f":"SUM(Z22:AE22)+AF22*Y22","v":118},null,{"$f":"IF(AD20=\"\",\"\",AH22/Y22*180)","v":118},{"$f":"IF(AD20=\"w\",180,AD20/Y22*180)+IF(AD21=\"w\",180,AD21/Y22*180)","v":360},{"$f":"AF22*10000000+AJ22*AF10021*10000000+AJ22*1000-AK22","v":117640},{"$f":"IF(AD20=\"\",\"\",RANK(AL20:AL22,AL20:AL22,0))","v":3},null,{"$f":"$A$7","v":"奈良"},null,{"$f":"●【進行】結果入力表!I60","v":"山田　晃司"},null,{"$f":"【準備】登録!K23","v":180},{"$f":"IF(●【進行】結果入力表!G60=\"\",\"\",●【進行】結果入力表!G60)","v":164},null,{"$f":"IF(●【進行】結果入力表!G76=\"\",\"\",●【進行】結果入力表!G76)","v":"W"},null,null,null,{"$f":"IF(AX20=\"\",\"\",COUNTIF(AT22:AY22,\"w\"))","v":1},{"$f":"IF(AX20=\"\",\"\",COUNT(AT22,AV22))","v":1},{"$f":"SUM(AT22:AY22)+AZ22*AS22","v":344},null,{"$f":"IF(AX20=\"\",\"\",BB22/AS22*180)","v":344},{"$f":"IF(AX20=\"w\",180,AX20/AS22*180)+IF(AX21=\"w\",180,AX21/AS22*180)","v":255},{"$f":"AZ22*10000000+BD22*AZ10021*10000000+BD22*1000-BE22","v":10343745},{"$f":"IF(AX20=\"\",\"\",RANK(BF20:BF22,BF20:BF22,0))","v":{"$error":"#DIV/0!"}}]
[]
[5,null,"Name",null,{"$f":"E$4","v":"持点"},{"$f":"A25","v":"兵庫"},null,{"$f":"A26","v":"滋賀"},null,{"$f":"A27","v":"奈良"},null,"W","L","TP",null,"TP","LP","R_P","R",null,5,null,"Name",null,{"$f":"$E$4","v":"持点"},{"$f":"$A$5","v":"兵庫"},null,{"$f":"$A$6","v":"滋賀"},null,{"$f":"$A$7","v":"奈良"},null,"W","L","TP",null,"TP","LP","R_P","R",null,5,null,"Name",null,{"$f":"$E$4","v":"持点"},{"$f":"$A$5","v":"兵庫"},null,{"$f":"$A$6","v":"滋賀"},null,{"$f":"$A$7","v":"奈良"},null,"W","L","TP",null,"TP","LP","R_P","R"]
[{"$f":"$A$5","v":"兵庫"},null,{"$f":"●【進行】結果入力表!D13","v":"堂園　雅也"},null,{"$f":"【準備】登録!E24","v":180},null,null,{"$f":"IF(●【進行】結果入力表!F21=\"\",\"\",●【進行】結果入力表!F21)","v":"W"},null,{"$f":"IF(●【進行】結果入力表!F13=\"\",\"\",●【進行】結果入力表!F13)","v":"W"},null,{"$f":"IF(J25=\"\",\"\",COUNTIF(F25:K25,\"w\"))","v":2},{"$f":"IF(J25=\"\",\"\",COUNT(H25,J25))","v":0},{"$f":"SUM(F25:K25)+L25*E25","v":360},null,{"$f":"IF(J25=\"\",\"\",N25/E25*180)","v":360},{"$f":"IF(F26=\"w\",180,F26/E25*180)+IF(F27=\"w\",180,F27/E25*180)","v":250},{"$f":"L25*10000000+P25*L10024*10000000+P25*1000-Q25","v":20359750},{"$f":"IF(J25=\"\",\"\",RANK(R25:R27,R25:R27,0))","v":1},null,{"$f":"$A$5","v":"兵庫"},null,{"$f":"●【進行】結果入力表!D45","v":"中尾　亮太"},null,{"$f":"【準備】登録!E22","v":180},null,null,{"$f":"IF(●【進行】結果入力表!F45=\"\",\"\",●【進行】結果入力表!F45)","v":149},null,{"$f":"IF(●【進行】結果入力表!F37=\"\",\"\",●【進行】結果入力表!F37)","v":53},null,{"$f":"IF(AD25=\"\",\"\",COUNTIF(Z25:AE25,\"w\"))","v":0},{"$f":"IF(AD25=\"\",\"\",COUNT(AB25,AD25))","v":2},{"$f":"SUM(Z25:AE25)+AF25*Y25","v":202},null,{"$f":"IF(AD25=\"\",\"\",AH25/Y25*180)","v":202},{"$f":"IF(Z26=\"w\",180,Z26/Y25*180)+IF(Z27=\"w\",180,Z27/Y25*180)","v":360},{"$f":"AF25*10000000+AJ25*AF10024*10000000+AJ25*1000-AK25","v":201640},{"$f":"IF(AD25=\"\",\"\",RANK(AL25:AL27,AL25:AL27,0))","v":3},null,{"$f":"$A$5","v":"兵庫"},null,{"$f":"●【進行】結果入力表!D69","v":"宮本　一"},null,{"$f":"【準備】登録!E20","v":180},null,null,{"$f":"IF(●【進行】結果入力表!F69=\"\",\"\",●【進行】結果入力表!F69)","v":"W"},null,{"$f":"IF(●【進行】結果入力表!F61=\"\",\"\",●【進行】結果入力表!F61)","v":"W"},null,{"$f":"IF(AX25=\"\",\"\",COUNTIF(AT25:AY25,\"w\"))","v":2},{"$f":"IF(AX25=\"\",\"\",COUNT(AV25,AX25))","v":0},{"$f":"SUM(AT25:AY25)+AZ25*AS25","v":360},null,{"$f":"IF(AX25=\"\",\"\",BB25/AS25*180)","v":360},{"$f":"IF(AT26=\"w\",180,AT26/AS25*180)+IF(AT27=\"w\",180,AT27/AS25*180)","v":232},{"$f":"AZ25*10000000+BD25*AZ10024*10000000+BD25*1000-BE25","v":20359768},{"$f":"IF(AX25=\"\",\"\",RANK(BF25:BF27,BF25:BF27,0))","v":1}]
[{"$f":"$A$6","v":"滋賀"},null,{"$f":"●【進行】結果入力表!I21","v":"御手洗　茂"},null,{"$f":"【準備】登録!H24","v":180},{"$f":"IF(●【進行】結果入力表!G21=\"\",\"\",●【進行】結果入力表!G21)","v":95},null,null,null,{"$f":"IF(●【進行】結果入力表!F29=\"\",\"\",●【進行】結果入力表!F29)","v":31},null,{"$f":"IF(J25=\"\",\"\",COUNTIF(F26:K26,\"w\"))","v":0},{"$f":"IF(J25=\"\",\"\",COUNT(F26,J26))","v":2},{"$f":"SUM(F26:K26)+L26*E26","v":126},null,{"$f":"IF(J25=\"\",\"\",N26/E26*180)","v":125.99999999999999},{"$f":"IF(H25=\"w\",180,H25/E26*180)+IF(H27=\"w\",180,H27/E26*180)","v":360},{"$f":"L26*10000000+P26*L10025*10000000+P26*1000-Q26","v":125639.99999999999},{"$f":"IF(J25=\"\",\"\",RANK(R25:R27,R25:R27,0))","v":3},null,{"$f":"$A$6","v":"滋賀"},null,{"$f":"●【進行】結果入力表!I45","v":"山中　康寛"},null,{"$f":"【準備】登録!H23","v":180},{"$f":"IF(●【進行】結果入力表!G45=\"\",\"\",●【進行】結果入力表!G45)","v":"W"},null,null,null,{"$f":"IF(●【進行】結果入力表!F53=\"\",\"\",●【進行】結果入力表!F53)","v":135},null,{"$f":"IF(AD25=\"\",\"\",COUNTIF(Z26:AE26,\"w\"))","v":1},{"$f":"IF(AD25=\"\",\"\",COUNT(Z26,AD26))","v":1},{"$f":"SUM(Z26:AE26)+AF26*Y26","v":315},null,{"$f":"IF(AD25=\"\",\"\",AH26/Y26*180)","v":315},{"$f":"IF(AB25=\"w\",180,AB25/Y26*180)+IF(AB27=\"w\",180,AB27/Y26*180)","v":329},{"$f":"AF26*10000000+AJ26*AF10025*10000000+AJ26*1000-AK26","v":10314671},{"$f":"IF(AD25=\"\",\"\",RANK(AL25:AL27,AL25:AL27,0))","v":2},null,{"$f":"$A$6","v":"滋賀"},null,{"$f":"●【進行】結果入力表!I69","v":"西峰　久祐"},null,{"$f":"【準備】登録!H22","v":180},{"$f":"IF(●【進行】結果入力表!G69=\"\",\"\",●【進行】結果入力表!G69)","v":120},null,null,null,{"$f":"IF(●【進行】結果入力表!F77=\"\",\"\",●【進行】結果入力表!F77)","v":"W"},null,{"$f":"IF(AX25=\"\",\"\",COUNTIF(AT26:AY26,\"w\"))","v":1},{"$f":"IF(AX25=\"\",\"\",COUNT(AT26,AX26))","v":1},{"$f":"SUM(AT26:AY26)+AZ26*AS26","v":300},null,{"$f":"IF(AX25=\"\",\"\",BB26/AS26*180)","v":300},{"$f":"IF(AV25=\"w\",180,AV25/AS26*180)+IF(AV27=\"w\",180,AV27/AS26*180)","v":269},{"$f":"AZ26*10000000+BD26*AZ10025*10000000+BD26*1000-BE26","v":10299731},{"$f":"IF(AX25=\"\",\"\",RANK(BF25:BF27,BF25:BF27,0))","v":2}]
[{"$f":"$A$7","v":"奈良"},null,{"$f":"●【進行】結果入力表!I13","v":"鷲尾　隆杜"},null,{"$f":"【準備】登録!K24","v":180},{"$f":"IF(●【進行】結果入力表!G13=\"\",\"\",●【進行】結果入力表!G13)","v":155},null,{"$f":"IF(●【進行】結果入力表!G29=\"\",\"\",●【進行】結果入力表!G29)","v":"W"},null,null,null,{"$f":"IF(J25=\"\",\"\",COUNTIF(F27:K27,\"w\"))","v":1},{"$f":"IF(J25=\"\",\"\",COUNT(F27,H27))","v":1},{"$f":"SUM(F27:K27)+L27*E27","v":335},null,{"$f":"IF(J25=\"\",\"\",N27/E27*180)","v":335},{"$f":"IF(J25=\"w\",180,J25/E27*180)+IF(J26=\"w\",180,J26/E27*180)","v":211},{"$f":"L27*10000000+P27*L10026*10000000+P27*1000-Q27","v":10334789},{"$f":"IF(J25=\"\",\"\",RANK(R25:R27,R25:R27,0))","v":2},null,{"$f":"$A$7","v":"奈良"},null,{"$f":"●【進行】結果入力表!I37","v":"吉向　翔平"},null,{"$f":"【準備】登録!K24","v":180},{"$f":"IF(●【進行】結果入力表!G37=\"\",\"\",●【進行】結果入力表!G37)","v":"W"},null,{"$f":"IF(●【進行】結果入力表!G53=\"\",\"\",●【進行】結果入力表!G53)","v":"W"},null,null,null,{"$f":"IF(AD25=\"\",\"\",COUNTIF(Z27:AE27,\"w\"))","v":2},{"$f":"IF(AD25=\"\",\"\",COUNT(Z27,AB27))","v":0},{"$f":"SUM(Z27:AE27)+AF27*Y27","v":360},null,{"$f":"IF(AD25=\"\",\"\",AH27/Y27*180)","v":360},{"$f":"IF(AD25=\"w\",180,AD25/Y27*180)+IF(AD26=\"w\",180,AD26/Y27*180)","v":188},{"$f":"AF27*10000000+AJ27*AF10026*10000000+AJ27*1000-AK27","v":20359812},{"$f":"IF(AD25=\"\",\"\",RANK(AL25:AL27,AL25:AL27,0))","v":1},null,{"$f":"$A$7","v":"奈良"},null,{"$f":"●【進行】結果入力表!I61","v":"鷲尾　隆杜"},null,{"$f":"【準備】登録!K24","v":180},{"$f":"IF(●【進行】結果入力表!G61=\"\",\"\",●【進行】結果入力表!G61)","v":112},null,{"$f":"IF(●【進行】結果入力表!G77=\"\",\"\",●【進行】結果入力表!G77)","v":89},null,null,null,{"$f":"IF(AX25=\"\",\"\",COUNTIF(AT27:AY27,\"w\"))","v":0},{"$f":"IF(AX25=\"\",\"\",COUNT(AT27,AV27))","v":2},{"$f":"SUM(AT27:AY27)+AZ27*AS27","v":201},null,{"$f":"IF(AX25=\"\",\"\",BB27/AS27*180)","v":201},{"$f":"IF(AX25=\"w\",180,AX25/AS27*180)+IF(AX26=\"w\",180,AX26/AS27*180)","v":360},{"$f":"AZ27*10000000+BD27*AZ10026*10000000+BD27*1000-BE27","v":200640},{"$f":"IF(AX25=\"\",\"\",RANK(BF25:BF27,BF25:BF27,0))","v":3}]
[]
[6,null,"Name",null,{"$f":"E$4","v":"持点"},{"$f":"A30","v":"兵庫"},null,{"$f":"A31","v":"滋賀"},null,{"$f":"A32","v":"奈良"},null,"W","L","TP",null,"TP","LP","R_P","R",null,6,null,"Name",null,{"$f":"$E$4","v":"持点"},{"$f":"$A$5","v":"兵庫"},null,{"$f":"$A$6","v":"滋賀"},null,{"$f":"$A$7","v":"奈良"},null,"W","L","TP",null,"TP","LP","R_P","R",null,6,null,"Name",null,{"$f":"$E$4","v":"持点"},{"$f":"$A$5","v":"兵庫"},null,{"$f":"$A$6","v":"滋賀"},null,{"$f":"$A$7","v":"奈良"},null,"W","L","TP",null,"TP","LP","R_P","R"]
[{"$f":"$A$5","v":"兵庫"},null,{"$f":"●【進行】結果入力表!D14","v":"藤中　健太郎"},null,{"$f":"【準備】登録!E25","v":180},null,null,{"$f":"IF(●【進行】結果入力表!F22=\"\",\"\",●【進行】結果入力表!F22)","v":84},null,{"$f":"IF(●【進行】結果入力表!F14=\"\",\"\",●【進行】結果入力表!F14)","v":"W"},null,{"$f":"IF(J30=\"\",\"\",COUNTIF(F30:K30,\"w\"))","v":1},{"$f":"IF(J30=\"\",\"\",COUNT(H30,J30))","v":1},{"$f":"SUM(F30:K30)+L30*E30","v":264},null,{"$f":"IF(J30=\"\",\"\",N30/E30*180)","v":264},{"$f":"IF(F31=\"w\",180,F31/E30*180)+IF(F32=\"w\",180,F32/E30*180)","v":344},{"$f":"L30*10000000+P30*L10029*10000000+P30*1000-Q30","v":10263656},{"$f":"IF(J30=\"\",\"\",RANK(R30:R32,R30:R32,0))","v":2},null,{"$f":"$A$5","v":"兵庫"},null,{"$f":"●【進行】結果入力表!D46","v":"平井　洸志"},null,{"$f":"【準備】登録!E23","v":180},null,null,{"$f":"IF(●【進行】結果入力表!F46=\"\",\"\",●【進行】結果入力表!F46)","v":"W"},null,{"$f":"IF(●【進行】結果入力表!F38=\"\",\"\",●【進行】結果入力表!F38)","v":"W"},null,{"$f":"IF(AD30=\"\",\"\",COUNTIF(Z30:AE30,\"w\"))","v":2},{"$f":"IF(AD30=\"\",\"\",COUNT(AB30,AD30))","v":0},{"$f":"SUM(Z30:AE30)+AF30*Y30","v":360},null,{"$f":"IF(AD30=\"\",\"\",AH30/Y30*180)","v":360},{"$f":"IF(Z31=\"w\",180,Z31/Y30*180)+IF(Z32=\"w\",180,Z32/Y30*180)","v":179},{"$f":"AF30*10000000+AJ30*AF10029*10000000+AJ30*1000-AK30","v":20359821},{"$f":"IF(AD30=\"\",\"\",RANK(AL30:AL32,AL30:AL32,0))","v":1},null,{"$f":"$A$5","v":"兵庫"},null,{"$f":"●【進行】結果入力表!D70","v":"鐵山　泰三"},null,{"$f":"【準備】登録!E21","v":180},null,null,{"$f":"IF(●【進行】結果入力表!F70=\"\",\"\",●【進行】結果入力表!F70)","v":178},null,{"$f":"IF(●【進行】結果入力表!F62=\"\",\"\",●【進行】結果入力表!F62)","v":"W"},null,{"$f":"IF(AX30=\"\",\"\",COUNTIF(AT30:AY30,\"w\"))","v":1},{"$f":"IF(AX30=\"\",\"\",COUNT(AV30,AX30))","v":1},{"$f":"SUM(AT30:AY30)+AZ30*AS30","v":358},null,{"$f":"IF(AX30=\"\",\"\",BB30/AS30*180)","v":358},{"$f":"IF(AT31=\"w\",180,AT31/AS30*180)+IF(AT32=\"w\",180,AT32/AS30*180)","v":238},{"$f":"AZ30*10000000+BD30*AZ10029*10000000+BD30*1000-BE30","v":10357762},{"$f":"IF(AX30=\"\",\"\",RANK(BF30:BF32,BF30:BF32,0))","v":1}]
[{"$f":"$A$6","v":"滋賀"},null,{"$f":"●【進行】結果入力表!I22","v":"高島　太一"},null,{"$f":"【準備】登録!H25","v":180},{"$f":"IF(●【進行】結果入力表!G22=\"\",\"\",●【進行】結果入力表!G22)","v":"W"},null,null,null,{"$f":"IF(●【進行】結果入力表!F30=\"\",\"\",●【進行】結果入力表!F30)","v":"W"},null,{"$f":"IF(J30=\"\",\"\",COUNTIF(F31:K31,\"w\"))","v":2},{"$f":"IF(J30=\"\",\"\",COUNT(F31,J31))","v":0},{"$f":"SUM(F31:K31)+L31*E31","v":360},null,{"$f":"IF(J30=\"\",\"\",N31/E31*180)","v":360},{"$f":"IF(H30=\"w\",180,H30/E31*180)+IF(H32=\"w\",180,H32/E31*180)","v":192},{"$f":"L31*10000000+P31*L10030*10000000+P31*1000-Q31","v":20359808},{"$f":"IF(J30=\"\",\"\",RANK(R30:R32,R30:R32,0))","v":1},null,{"$f":"$A$6","v":"滋賀"},null,{"$f":"●【進行】結果入力表!I46","v":"御手洗　茂"},null,{"$f":"【準備】登録!H24","v":180},{"$f":"IF(●【進行】結果入力表!G46=\"\",\"\",●【進行】結果入力表!G46)","v":88},null,null,null,{"$f":"IF(●【進行】結果入力表!F54=\"\",\"\",●【進行】結果入力表!F54)","v":96},null,{"$f":"IF(AD30=\"\",\"\",COUNTIF(Z31:AE31,\"w\"))","v":0},{"$f":"IF(AD30=\"\",\"\",COUNT(Z31,AD31))","v":2},{"$f":"SUM(Z31:AE31)+AF31*Y31","v":184},null,{"$f":"IF(AD30=\"\",\"\",AH31/Y31*180)","v":184},{"$f":"IF(AB30=\"w\",180,AB30/Y31*180)+IF(AB32=\"w\",180,AB32/Y31*180)","v":360},{"$f":"AF31*10000000+AJ31*AF10030*10000000+AJ31*1000-AK31","v":183640},{"$f":"IF(AD30=\"\",\"\",RANK(AL30:AL32,AL30:AL32,0))","v":3},null,{"$f":"$A$6","v":"滋賀"},null,{"$f":"●【進行】結果入力表!I70","v":"山中　康寛"},null,{"$f":"【準備】登録!H23","v":180},{"$f":"IF(●【進行】結果入力表!G70=\"\",\"\",●【進行】結果入力表!G70)","v":"W"},null,null,null,{"$f":"IF(●【進行】結果入力表!F78=\"\",\"\",●【進行】結果入力表!F78)","v":80},null,{"$f":"IF(AX30=\"\",\"\",COUNTIF(AT31:AY31,\"w\"))","v":1},{"$f":"IF(AX30=\"\",\"\",COUNT(AT31,AX31))","v":1},{"$f":"SUM(AT31:AY31)+AZ31*AS31","v":260},null,{"$f":"IF(AX30=\"\",\"\",BB31/AS31*180)","v":260},{"$f":"IF(AV30=\"w\",180,AV30/AS31*180)+IF(AV32=\"w\",180,AV32/AS31*180)","v":358},{"$f":"AZ31*10000000+BD31*AZ10030*10000000+BD31*1000-BE31","v":10259642},{"$f":"IF(AX30=\"\",\"\",RANK(BF30:BF32,BF30:BF32,0))","v":2}]
[{"$f":"$A$7","v":"奈良"},null,{"$f":"●【進行】結果入力表!I14","v":"長谷川　進"},null,{"$f":"【準備】登録!K25","v":180},{"$f":"IF(●【進行】結果入力表!G14=\"\",\"\",●【進行】結果入力表!G14)","v":164},null,{"$f":"IF(●【進行】結果入力表!G30=\"\",\"\",●【進行】結果入力表!G30)","v":108},null,null,null,{"$f":"IF(J30=\"\",\"\",COUNTIF(F32:K32,\"w\"))","v":0},{"$f":"IF(J30=\"\",\"\",COUNT(F32,H32))","v":2},{"$f":"SUM(F32:K32)+L32*E32","v":272},null,{"$f":"IF(J30=\"\",\"\",N32/E32*180)","v":272},{"$f":"IF(J30=\"w\",180,J30/E32*180)+IF(J31=\"w\",180,J31/E32*180)","v":360},{"$f":"L32*10000000+P32*L10031*10000000+P32*1000-Q32","v":271640},{"$f":"IF(J30=\"\",\"\",RANK(R30:R32,R30:R32,0))","v":3},null,{"$f":"$A$7","v":"奈良"},null,{"$f":"●【進行】結果入力表!I38","v":"巽　大地"},null,{"$f":"【準備】登録!K25","v":180},{"$f":"IF(●【進行】結果入力表!G38=\"\",\"\",●【進行】結果入力表!G38)","v":91},null,{"$f":"IF(●【進行】結果入力表!G54=\"\",\"\",●【進行】結果入力表!G54)","v":"W"},null,null,null,{"$f":"IF(AD30=\"\",\"\",COUNTIF(Z32:AE32,\"w\"))","v":1},{"$f":"IF(AD30=\"\",\"\",COUNT(Z32,AB32))","v":1},{"$f":"SUM(Z32:AE32)+AF32*Y32","v":271},null,{"$f":"IF(AD30=\"\",\"\",AH32/Y32*180)","v":271},{"$f":"IF(AD30=\"w\",180,AD30/Y32*180)+IF(AD31=\"w\",180,AD31/Y32*180)","v":276},{"$f":"AF32*10000000+AJ32*AF10031*10000000+AJ32*1000-AK32","v":10270724},{"$f":"IF(AD30=\"\",\"\",RANK(AL30:AL32,AL30:AL32,0))","v":2},null,{"$f":"$A$7","v":"奈良"},null,{"$f":"●【進行】結果入力表!I62","v":"長谷川　進"},null,{"$f":"【準備】登録!K25","v":180},{"$f":"IF(●【進行】結果入力表!G62=\"\",\"\",●【進行】結果入力表!G62)","v":58},null,{"$f":"IF(●【進行】結果入力表!G78=\"\",\"\",●【進行】結果入力表!G78)","v":"W"},null,null,null,{"$f":"IF(AX30=\"\",\"\",COUNTIF(AT32:AY32,\"w\"))","v":1},{"$f":"IF(AX30=\"\",\"\",COUNT(AT32,AV32))","v":1},{"$f":"SUM(AT32:AY32)+AZ32*AS32","v":238},null,{"$f":"IF(AX30=\"\",\"\",BB32/AS32*180)","v":238},{"$f":"IF(AX30=\"w\",180,AX30/AS32*180)+IF(AX31=\"w\",180,AX31/AS32*180)","v":260},{"$f":"AZ32*10000000+BD32*AZ10031*10000000+BD32*1000-BE32","v":10237740},{"$f":"IF(AX30=\"\",\"\",RANK(BF30:BF32,BF30:BF32,0))","v":3}]
[]
[7,null,"Name",null,{"$f":"E$4","v":"持点"},{"$f":"A35","v":""},null,{"$f":"A36","v":""},null,{"$f":"A37","v":""},null,"W","L","TP",null,"TP","LP","R_P","R",null,7,null,"Name",null,{"$f":"$E$4","v":"持点"},{"$f":"$A$5","v":"兵庫"},null,{"$f":"$A$6","v":"滋賀"},null,{"$f":"$A$7","v":"奈良"},null,"W","L","TP",null,"TP","LP","R_P","R",null,7,null,"Name",null,{"$f":"$E$4","v":"持点"},{"$f":"$A$5","v":"兵庫"},null,{"$f":"$A$6","v":"滋賀"},null,{"$f":"$A$7","v":"奈良"},null,"W","L","TP",null,"TP","LP","R_P","R"]
[{"$f":"IF(【準備】登録!C26=\"\",\"\",$A$5)","v":""},null,{"$f":"●【進行】結果入力表!D15","v":0},null,{"$f":"【準備】登録!E26","v":0},null,null,{"$f":"IF(●【進行】結果入力表!F23=\"\",\"\",●【進行】結果入力表!F23)","v":""},null,{"$f":"IF(●【進行】結果入力表!F15=\"\",\"\",●【進行】結果入力表!F15)","v":""},null,{"$f":"IF(J35=\"\",\"\",COUNTIF(F35:K35,\"w\"))","v":""},{"$f":"IF(J35=\"\",\"\",COUNT(H35,J35))","v":""},{"$f":"SUM(F35:K35)+L35*E35","v":{"$error":"#VALUE!"}},null,{"$f":"IF(J35=\"\",\"\",N35/E35*180)","v":""},{"$f":"IF(F36=\"w\",180,F36/E35*180)+IF(F37=\"w\",180,F37/E35*180)","v":{"$error":"#VALUE!"}},{"$f":"L35*10000000+P35*L10034*10000000+P35*1000-Q35","v":{"$error":"#VALUE!"}},{"$f":"IF(J35=\"\",\"\",RANK(R35:R37,R35:R37,0))","v":""},null,{"$f":"$A$35","v":""},null,{"$f":"●【進行】結果入力表!D47","v":0},null,{"$f":"【準備】登録!E24","v":180},null,null,{"$f":"IF(●【進行】結果入力表!F47=\"\",\"\",●【進行】結果入力表!F47)","v":""},null,{"$f":"IF(●【進行】結果入力表!F39=\"\",\"\",●【進行】結果入力表!F39)","v":""},null,{"$f":"IF(AD35=\"\",\"\",COUNTIF(Z35:AE35,\"w\"))","v":""},{"$f":"IF(AD35=\"\",\"\",COUNT(AB35,AD35))","v":""},{"$f":"SUM(Z35:AE35)+AF35*Y35","v":{"$error":"#VALUE!"}},null,{"$f":"IF(AD35=\"\",\"\",AH35/Y35*180)","v":""},{"$f":"IF(Z36=\"w\",180,Z36/Y35*180)+IF(Z37=\"w\",180,Z37/Y35*180)","v":{"$error":"#VALUE!"}},{"$f":"AF35*10000000+AJ35*AF10034*10000000+AJ35*1000-AK35","v":{"$error":"#VALUE!"}},{"$f":"IF(AD35=\"\",\"\",RANK(AL35:AL37,AL35:AL37,0))","v":""},null,{"$f":"$A$35","v":""},null,{"$f":"●【進行】結果入力表!D71","v":0},null,{"$f":"【準備】登録!E22","v":180},null,null,{"$f":"IF(●【進行】結果入力表!F71=\"\",\"\",●【進行】結果入力表!F71)","v":""},null,{"$f":"IF(●【進行】結果入力表!F63=\"\",\"\",●【進行】結果入力表!F63)","v":""},null,{"$f":"IF(AX35=\"\",\"\",COUNTIF(AT35:AY35,\"w\"))","v":""},{"$f":"IF(AX35=\"\",\"\",COUNT(AV35,AX35))","v":""},{"$f":"SUM(AT35:AY35)+AZ35*AS35","v":{"$error":"#VALUE!"}},null,{"$f":"IF(AX35=\"\",\"\",BB35/AS35*180)","v":""},{"$f":"IF(AT36=\"w\",180,AT36/AS35*180)+IF(AT37=\"w\",180,AT37/AS35*180)","v":{"$error":"#VALUE!"}},{"$f":"AZ35*10000000+BD35*AZ10034*10000000+BD35*1000-BE35","v":{"$error":"#VALUE!"}},{"$f":"IF(AX35=\"\",\"\",RANK(BF35:BF37,BF35:BF37,0))","v":""}]
[{"$f":"IF(【準備】登録!F26=\"\",\"\",$A$6)","v":""},null,{"$f":"●【進行】結果入力表!I23","v":0},null,{"$f":"【準備】登録!H26","v":0},{"$f":"IF(●【進行】結果入力表!G23=\"\",\"\",●【進行】結果入力表!G23)","v":""},null,null,null,{"$f":"IF(●【進行】結果入力表!F31=\"\",\"\",●【進行】結果入力表!F31)","v":""},null,{"$f":"IF(J35=\"\",\"\",COUNTIF(F36:K36,\"w\"))","v":""},{"$f":"IF(J35=\"\",\"\",COUNT(F36,J36))","v":""},{"$f":"SUM(F36:K36)+L36*E36","v":{"$error":"#VALUE!"}},null,{"$f":"IF(J35=\"\",\"\",N36/E36*180)","v":""},{"$f":"IF(H35=\"w\",180,H35/E36*180)+IF(H37=\"w\",180,H37/E36*180)","v":{"$error":"#VALUE!"}},{"$f":"L36*10000000+P36*L10035*10000000+P36*1000-Q36","v":{"$error":"#VALUE!"}},{"$f":"IF(J35=\"\",\"\",RANK(R35:R37,R35:R37,0))","v":""},null,{"$f":"$A$36","v":""},null,{"$f":"●【進行】結果入力表!I47","v":0},null,{"$f":"【準備】登録!H25","v":180},{"$f":"IF(●【進行】結果入力表!G47=\"\",\"\",●【進行】結果入力表!G47)","v":""},null,null,null,{"$f":"IF(●【進行】結果入力表!F55=\"\",\"\",●【進行】結果入力表!F55)","v":""},null,{"$f":"IF(AD35=\"\",\"\",COUNTIF(Z36:AE36,\"w\"))","v":""},{"$f":"IF(AD35=\"\",\"\",COUNT(Z36,AD36))","v":""},{"$f":"SUM(Z36:AE36)+AF36*Y36","v":{"$error":"#VALUE!"}},null,{"$f":"IF(AD35=\"\",\"\",AH36/Y36*180)","v":""},{"$f":"IF(AB35=\"w\",180,AB35/Y36*180)+IF(AB37=\"w\",180,AB37/Y36*180)","v":{"$error":"#VALUE!"}},{"$f":"AF36*10000000+AJ36*AF10035*10000000+AJ36*1000-AK36","v":{"$error":"#VALUE!"}},{"$f":"IF(AD35=\"\",\"\",RANK(AL35:AL37,AL35:AL37,0))","v":""},null,{"$f":"$A$36","v":""},null,{"$f":"●【進行】結果入力表!I71","v":0},null,{"$f":"【準備】登録!H24","v":180},{"$f":"IF(●【進行】結果入力表!G71=\"\",\"\",●【進行】結果入力表!G71)","v":""},null,null,null,{"$f":"IF(●【進行】結果入力表!F79=\"\",\"\",●【進行】結果入力表!F79)","v":""},null,{"$f":"IF(AX35=\"\",\"\",COUNTIF(AT36:AY36,\"w\"))","v":""},{"$f":"IF(AX35=\"\",\"\",COUNT(AT36,AX36))","v":""},{"$f":"SUM(AT36:AY36)+AZ36*AS36","v":{"$error":"#VALUE!"}},null,{"$f":"IF(AX35=\"\",\"\",BB36/AS36*180)","v":""},{"$f":"IF(AV35=\"w\",180,AV35/AS36*180)+IF(AV37=\"w\",180,AV37/AS36*180)","v":{"$error":"#VALUE!"}},{"$f":"AZ36*10000000+BD36*AZ10035*10000000+BD36*1000-BE36","v":{"$error":"#VALUE!"}},{"$f":"IF(AX35=\"\",\"\",RANK(BF35:BF37,BF35:BF37,0))","v":""}]
[{"$f":"IF(【準備】登録!I26=\"\",\"\",$A$7)","v":""},null,{"$f":"●【進行】結果入力表!I15","v":0},null,{"$f":"【準備】登録!K26","v":0},{"$f":"IF(●【進行】結果入力表!G15=\"\",\"\",●【進行】結果入力表!G15)","v":""},null,{"$f":"IF(●【進行】結果入力表!G31=\"\",\"\",●【進行】結果入力表!G31)","v":""},null,null,null,{"$f":"IF(J35=\"\",\"\",COUNTIF(F37:K37,\"w\"))","v":""},{"$f":"IF(J35=\"\",\"\",COUNT(F37,H37))","v":""},{"$f":"SUM(F37:K37)+L37*E37","v":{"$error":"#VALUE!"}},null,{"$f":"IF(J35=\"\",\"\",N37/E37*180)","v":""},{"$f":"IF(J35=\"w\",180,J35/E37*180)+IF(J36=\"w\",180,J36/E37*180)","v":{"$error":"#VALUE!"}},{"$f":"L37*10000000+P37*L10036*10000000+P37*1000-Q37","v":{"$error":"#VALUE!"}},{"$f":"IF(J35=\"\",\"\",RANK(R35:R37,R35:R37,0))","v":""},null,{"$f":"$A$37","v":""},null,{"$f":"●【進行】結果入力表!I39","v":0},null,{"$f":"【準備】登録!K26","v":0},{"$f":"IF(●【進行】結果入力表!G39=\"\",\"\",●【進行】結果入力表!G39)","v":""},null,{"$f":"IF(●【進行】結果入力表!G55=\"\",\"\",●【進行】結果入力表!G55)","v":""},null,null,null,{"$f":"IF(AD35=\"\",\"\",COUNTIF(Z37:AE37,\"w\"))","v":""},{"$f":"IF(AD35=\"\",\"\",COUNT(Z37,AB37))","v":""},{"$f":"SUM(Z37:AE37)+AF37*Y37","v":{"$error":"#VALUE!"}},null,{"$f":"IF(AD35=\"\",\"\",AH37/Y37*180)","v":""},{"$f":"IF(AD35=\"w\",180,AD35/Y37*180)+IF(AD36=\"w\",180,AD36/Y37*180)","v":{"$error":"#VALUE!"}},{"$f":"AF37*10000000+AJ37*AF10036*10000000+AJ37*1000-AK37","v":{"$error":"#VALUE!"}},{"$f":"IF(AD35=\"\",\"\",RANK(AL35:AL37,AL35:AL37,0))","v":""},null,{"$f":"$A$37","v":""},null,{"$f":"●【進行】結果入力表!I63","v":0},null,{"$f":"【準備】登録!K26","v":0},{"$f":"IF(●【進行】結果入力表!G63=\"\",\"\",●【進行】結果入力表!G63)","v":""},null,{"$f":"IF(●【進行】結果入力表!G79=\"\",\"\",●【進行】結果入力表!G79)","v":""},null,null,null,{"$f":"IF(AX35=\"\",\"\",COUNTIF(AT37:AY37,\"w\"))","v":""},{"$f":"IF(AX35=\"\",\"\",COUNT(AT37,AV37))","v":""},{"$f":"SUM(AT37:AY37)+AZ37*AS37","v":{"$error":"#VALUE!"}},null,{"$f":"IF(AX35=\"\",\"\",BB37/AS37*180)","v":""},{"$f":"IF(AX35=\"w\",180,AX35/AS37*180)+IF(AX36=\"w\",180,AX36/AS37*180)","v":{"$error":"#VALUE!"}},{"$f":"AZ37*10000000+BD37*AZ10036*10000000+BD37*1000-BE37","v":{"$error":"#VALUE!"}},{"$f":"IF(AX35=\"\",\"\",RANK(BF35:BF37,BF35:BF37,0))","v":""}]
[]
[{"$f":"IF(【準備】登録!C27=\"\",\"\",【準備】登録!A27)","v":""},null,"Name",null,{"$f":"E$4","v":"持点"},{"$f":"A40","v":""},null,{"$f":"A41","v":""},null,{"$f":"A42","v":""},null,"W","L","TP",null,"TP","LP","R_P","R",null,{"$f":"A39","v":""},null,"Name",null,{"$f":"$E$4","v":"持点"},{"$f":"$A$40","v":""},null,{"$f":"$A$41","v":""},null,{"$f":"$A$42","v":""},null,"W","L","TP",null,"TP","LP","R_P","R",null,{"$f":"A39","v":""},null,"Name",null,{"$f":"$E$4","v":"持点"},{"$f":"$A$40","v":""},null,{"$f":"$A$41","v":""},null,{"$f":"$A$42","v":""},null,"W","L","TP",null,"TP","LP","R_P","R"]
[{"$f":"IF(【準備】登録!C27=\"\",\"\",$A$5)","v":""},null,{"$f":"●【進行】結果入力表!D16","v":0},null,{"$f":"【準備】登録!E27","v":0},null,null,{"$f":"IF(●【進行】結果入力表!F24=\"\",\"\",●【進行】結果入力表!F24)","v":""},null,{"$f":"IF(●【進行】結果入力表!F16=\"\",\"\",●【進行】結果入力表!F16)","v":""},null,{"$f":"IF(J40=\"\",\"\",COUNTIF(F40:K40,\"w\"))","v":""},{"$f":"IF(J40=\"\",\"\",COUNT(H40,J40))","v":""},{"$f":"SUM(F40:K40)+L40*E40","v":{"$error":"#VALUE!"}},null,{"$f":"IF(J40=\"\",\"\",N40/E40*180)","v":""},{"$f":"IF(F41=\"w\",180,F41/E40*180)+IF(F42=\"w\",180,F42/E40*180)","v":{"$error":"#VALUE!"}},{"$f":"L40*10000000+P40*L10039*10000000+P40*1000-Q40","v":{"$error":"#VALUE!"}},{"$f":"IF(J40=\"\",\"\",RANK(R40:R42,R40:R42,0))","v":""},null,{"$f":"$A40","v":""},null,{"$f":"●【進行】結果入力表!D48","v":0},null,{"$f":"【準備】登録!E25","v":180},null,null,{"$f":"IF(●【進行】結果入力表!F48=\"\",\"\",●【進行】結果入力表!F48)","v":""},null,{"$f":"IF(●【進行】結果入力表!F40=\"\",\"\",●【進行】結果入力表!F40)","v":""},null,{"$f":"IF(AD40=\"\",\"\",COUNTIF(Z40:AE40,\"w\"))","v":""},{"$f":"IF(AD40=\"\",\"\",COUNT(AB40,AD40))","v":""},{"$f":"SUM(Z40:AE40)+AF40*Y40","v":{"$error":"#VALUE!"}},null,{"$f":"IF(AD40=\"\",\"\",AH40/Y40*180)","v":""},{"$f":"IF(Z41=\"w\",180,Z41/Y40*180)+IF(Z42=\"w\",180,Z42/Y40*180)","v":{"$error":"#VALUE!"}},{"$f":"AF40*10000000+AJ40*AF10039*10000000+AJ40*1000-AK40","v":{"$error":"#VALUE!"}},{"$f":"IF(AD40=\"\",\"\",RANK(AL40:AL42,AL40:AL42,0))","v":""},null,{"$f":"$A40","v":""},null,{"$f":"●【進行】結果入力表!D72","v":0},null,{"$f":"【準備】登録!E23","v":180},null,null,{"$f":"IF(●【進行】結果入力表!F72=\"\",\"\",●【進行】結果入力表!F72)","v":""},null,{"$f":"IF(●【進行】結果入力表!F64=\"\",\"\",●【進行】結果入力表!F64)","v":""},null,{"$f":"IF(AX40=\"\",\"\",COUNTIF(AT40:AY40,\"w\"))","v":""},{"$f":"IF(AX40=\"\",\"\",COUNT(AV40,AX40))","v":""},{"$f":"SUM(AT40:AY40)+AZ40*AS40","v":{"$error":"#VALUE!"}},null,{"$f":"IF(AX40=\"\",\"\",BB40/AS40*180)","v":""},{"$f":"IF(AT41=\"w\",180,AT41/AS40*180)+IF(AT42=\"w\",180,AT42/AS40*180)","v":{"$error":"#VALUE!"}},{"$f":"AZ40*10000000+BD40*AZ10039*10000000+BD40*1000-BE40","v":{"$error":"#VALUE!"}},{"$f":"IF(AX40=\"\",\"\",RANK(BF40:BF42,BF40:BF42,0))","v":""}]
[{"$f":"IF(【準備】登録!F27=\"\",\"\",$A$6)","v":""},null,{"$f":"●【進行】結果入力表!I24","v":0},null,{"$f":"【準備】登録!H27","v":0},{"$f":"IF(●【進行】結果入力表!G24=\"\",\"\",●【進行】結果入力表!G24)","v":""},null,null,null,{"$f":"IF(●【進行】結果入力表!F32=\"\",\"\",●【進行】結果入力表!F32)","v":""},null,{"$f":"IF(J40=\"\",\"\",COUNTIF(F41:K41,\"w\"))","v":""},{"$f":"IF(J40=\"\",\"\",COUNT(F41,J41))","v":""},{"$f":"SUM(F41:K41)+L41*E41","v":{"$error":"#VALUE!"}},null,{"$f":"IF(J40=\"\",\"\",N41/E41*180)","v":""},{"$f":"IF(H40=\"w\",180,H40/E41*180)+IF(H42=\"w\",180,H42/E41*180)","v":{"$error":"#VALUE!"}},{"$f":"L41*10000000+P41*L10040*10000000+P41*1000-Q41","v":{"$error":"#VALUE!"}},{"$f":"IF(J40=\"\",\"\",RANK(R40:R42,R40:R42,0))","v":""},null,{"$f":"$A41","v":""},null,{"$f":"●【進行】結果入力表!I48","v":0},null,{"$f":"【準備】登録!H26","v":0},{"$f":"IF(●【進行】結果入力表!G48=\"\",\"\",●【進行】結果入力表!G48)","v":""},null,null,null,{"$f":"IF(●【進行】結果入力表!F56=\"\",\"\",●【進行】結果入力表!F56)","v":""},null,{"$f":"IF(AD40=\"\",\"\",COUNTIF(Z41:AE41,\"w\"))","v":""},{"$f":"IF(AD40=\"\",\"\",COUNT(Z41,AD41))","v":""},{"$f":"SUM(Z41:AE41)+AF41*Y41","v":{"$error":"#VALUE!"}},null,{"$f":"IF(AD40=\"\",\"\",AH41/Y41*180)","v":""},{"$f":"IF(AB40=\"w\",180,AB40/Y41*180)+IF(AB42=\"w\",180,AB42/Y41*180)","v":{"$error":"#VALUE!"}},{"$f":"AF41*10000000+AJ41*AF10040*10000000+AJ41*1000-AK41","v":{"$error":"#VALUE!"}},{"$f":"IF(AD40=\"\",\"\",RANK(AL40:AL42,AL40:AL42,0))","v":""},null,{"$f":"$A41","v":""},null,{"$f":"●【進行】結果入力表!I72","v":0},null,{"$f":"【準備】登録!H25","v":180},{"$f":"IF(●【進行】結果入力表!G72=\"\",\"\",●【進行】結果入力表!G72)","v":""},null,null,null,{"$f":"IF(●【進行】結果入力表!F80=\"\",\"\",●【進行】結果入力表!F80)","v":""},null,{"$f":"IF(AX40=\"\",\"\",COUNTIF(AT41:AY41,\"w\"))","v":""},{"$f":"IF(AX40=\"\",\"\",COUNT(AT41,AX41))","v":""},{"$f":"SUM(AT41:AY41)+AZ41*AS41","v":{"$error":"#VALUE!"}},null,{"$f":"IF(AX40=\"\",\"\",BB41/AS41*180)","v":""},{"$f":"IF(AV40=\"w\",180,AV40/AS41*180)+IF(AV42=\"w\",180,AV42/AS41*180)","v":{"$error":"#VALUE!"}},{"$f":"AZ41*10000000+BD41*AZ10040*10000000+BD41*1000-BE41","v":{"$error":"#VALUE!"}},{"$f":"IF(AX40=\"\",\"\",RANK(BF40:BF42,BF40:BF42,0))","v":""}]
[{"$f":"IF(【準備】登録!I27=\"\",\"\",$A$7)","v":""},null,{"$f":"●【進行】結果入力表!I16","v":0},null,{"$f":"【準備】登録!K27","v":0},{"$f":"IF(●【進行】結果入力表!G16=\"\",\"\",●【進行】結果入力表!G16)","v":""},null,{"$f":"IF(C40=\"\",\"\",●【進行】結果入力表!G32)","v":0},null,null,null,{"$f":"IF(J40=\"\",\"\",COUNTIF(F42:K42,\"w\"))","v":""},{"$f":"IF(J40=\"\",\"\",COUNT(F42,H42))","v":""},{"$f":"SUM(F42:K42)+L42*E42","v":{"$error":"#VALUE!"}},null,{"$f":"IF(J40=\"\",\"\",N42/E42*180)","v":""},{"$f":"IF(J40=\"w\",180,J40/E42*180)+IF(J41=\"w\",180,J41/E42*180)","v":{"$error":"#VALUE!"}},{"$f":"L42*10000000+P42*L10041*10000000+P42*1000-Q42","v":{"$error":"#VALUE!"}},{"$f":"IF(J40=\"\",\"\",RANK(R40:R42,R40:R42,0))","v":""},null,{"$f":"$A42","v":""},null,{"$f":"●【進行】結果入力表!I40","v":0},null,{"$f":"【準備】登録!K27","v":0},{"$f":"IF(●【進行】結果入力表!G40=\"\",\"\",●【進行】結果入力表!G40)","v":""},null,{"$f":"IF(●【進行】結果入力表!G56=\"\",\"\",●【進行】結果入力表!G56)","v":""},null,null,null,{"$f":"IF(AD40=\"\",\"\",COUNTIF(Z42:AE42,\"w\"))","v":""},{"$f":"IF(AD40=\"\",\"\",COUNT(Z42,AB42))","v":""},{"$f":"SUM(Z42:AE42)+AF42*Y42","v":{"$error":"#VALUE!"}},null,{"$f":"IF(AD40=\"\",\"\",AH42/Y42*180)","v":""},{"$f":"IF(AD40=\"w\",180,AD40/Y42*180)+IF(AD41=\"w\",180,AD41/Y42*180)","v":{"$error":"#VALUE!"}},{"$f":"AF42*10000000+AJ42*AF10041*10000000+AJ42*1000-AK42","v":{"$error":"#VALUE!"}},{"$f":"IF(AD40=\"\",\"\",RANK(AL40:AL42,AL40:AL42,0))","v":""},null,{"$f":"$A42","v":""},null,{"$f":"●【進行】結果入力表!I64","v":0},null,{"$f":"【準備】登録!K27","v":0},{"$f":"IF(●【進行】結果入力表!G64=\"\",\"\",●【進行】結果入力表!G64)","v":""},null,{"$f":"IF(●【進行】結果入力表!G80=\"\",\"\",●【進行】結果入力表!G80)","v":""},null,null,null,{"$f":"IF(AX40=\"\",\"\",COUNTIF(AT42:AY42,\"w\"))","v":""},{"$f":"IF(AX40=\"\",\"\",COUNT(AT42,AV42))","v":""},{"$f":"SUM(AT42:AY42)+AZ42*AS42","v":{"$error":"#VALUE!"}},null,{"$f":"IF(AX40=\"\",\"\",BB42/AS42*180)","v":""},{"$f":"IF(AX40=\"w\",180,AX40/AS42*180)+IF(AX41=\"w\",180,AX41/AS42*180)","v":{"$error":"#VALUE!"}},{"$f":"AZ42*10000000+BD42*AZ10041*10000000+BD42*1000-BE42","v":{"$error":"#VALUE!"}},{"$f":"IF(AX40=\"\",\"\",RANK(BF40:BF42,BF40:BF42,0))","v":""}]
[null,"※","TPの数字は、ハンデによる換算後の得点を示す。"]

{"sheet":"結果リスト","index":5,"n_rows":144,"n_cols":7,"rows_kept":144,"cut":false,"hidden":false,"merged":[]}
[{"$f":"B1&C1&D1&E1","v":"第1節兵庫奈良宮本　一"},{"$f":"●【進行】結果入力表!A9","v":"第1節"},{"$f":"●【進行】結果入力表!C9","v":"兵庫"},{"$f":"●【進行】結果入力表!J9","v":"奈良"},{"$f":"●【進行】結果入力表!D9","v":"宮本　一"},{"$f":"IF(●【進行】結果入力表!F9=\"\",\"\",●【進行】結果入力表!F9)","v":"W"},{"$f":"●【進行】結果入力表!E9","v":0}]
["第1節兵庫奈良鐵山　泰三",{"$f":"●【進行】結果入力表!A10","v":"第1節"},{"$f":"●【進行】結果入力表!C10","v":"兵庫"},{"$f":"●【進行】結果入力表!J10","v":"奈良"},{"$f":"●【進行】結果入力表!D10","v":"鐵山　泰三"},{"$f":"IF(●【進行】結果入力表!F10=\"\",\"\",●【進行】結果入力表!F10)","v":26},{"$f":"●【進行】結果入力表!E10","v":0}]
["第1節兵庫奈良中尾　亮太",{"$f":"●【進行】結果入力表!A11","v":"第1節"},{"$f":"●【進行】結果入力表!C11","v":"兵庫"},{"$f":"●【進行】結果入力表!J11","v":"奈良"},{"$f":"●【進行】結果入力表!D11","v":"中尾　亮太"},{"$f":"IF(●【進行】結果入力表!F11=\"\",\"\",●【進行】結果入力表!F11)","v":24},{"$f":"●【進行】結果入力表!E11","v":0}]
["第1節兵庫奈良平井　洸志",{"$f":"●【進行】結果入力表!A12","v":"第1節"},{"$f":"●【進行】結果入力表!C12","v":"兵庫"},{"$f":"●【進行】結果入力表!J12","v":"奈良"},{"$f":"●【進行】結果入力表!D12","v":"平井　洸志"},{"$f":"IF(●【進行】結果入力表!F12=\"\",\"\",●【進行】結果入力表!F12)","v":24},{"$f":"●【進行】結果入力表!E12","v":0}]
["第1節兵庫奈良堂園　雅也",{"$f":"●【進行】結果入力表!A13","v":"第1節"},{"$f":"●【進行】結果入力表!C13","v":"兵庫"},{"$f":"●【進行】結果入力表!J13","v":"奈良"},{"$f":"●【進行】結果入力表!D13","v":"堂園　雅也"},{"$f":"IF(●【進行】結果入力表!F13=\"\",\"\",●【進行】結果入力表!F13)","v":"W"},{"$f":"●【進行】結果入力表!E13","v":0}]
["第1節兵庫奈良藤中　健太郎",{"$f":"●【進行】結果入力表!A14","v":"第1節"},{"$f":"●【進行】結果入力表!C14","v":"兵庫"},{"$f":"●【進行】結果入力表!J14","v":"奈良"},{"$f":"●【進行】結果入力表!D14","v":"藤中　健太郎"},{"$f":"IF(●【進行】結果入力表!F14=\"\",\"\",●【進行】結果入力表!F14)","v":"W"},{"$f":"●【進行】結果入力表!E14","v":0}]
["第1節兵庫奈良0",{"$f":"●【進行】結果入力表!A15","v":"第1節"},{"$f":"●【進行】結果入力表!C15","v":"兵庫"},{"$f":"●【進行】結果入力表!J15","v":"奈良"},{"$f":"●【進行】結果入力表!D15","v":0},{"$f":"IF(●【進行】結果入力表!F15=\"\",\"\",●【進行】結果入力表!F15)","v":""},{"$f":"●【進行】結果入力表!E15","v":0}]
["第1節兵庫奈良0",{"$f":"●【進行】結果入力表!A16","v":"第1節"},{"$f":"●【進行】結果入力表!C16","v":"兵庫"},{"$f":"●【進行】結果入力表!J16","v":"奈良"},{"$f":"●【進行】結果入力表!D16","v":0},{"$f":"IF(●【進行】結果入力表!F16=\"\",\"\",●【進行】結果入力表!F16)","v":""},{"$f":"●【進行】結果入力表!E16","v":0}]
["第1節兵庫滋賀宮本　一",{"$f":"●【進行】結果入力表!A17","v":"第1節"},{"$f":"●【進行】結果入力表!C17","v":"兵庫"},{"$f":"●【進行】結果入力表!J17","v":"滋賀"},{"$f":"●【進行】結果入力表!D17","v":"宮本　一"},{"$f":"IF(●【進行】結果入力表!F17=\"\",\"\",●【進行】結果入力表!F17)","v":"W"},{"$f":"●【進行】結果入力表!E17","v":0}]
["第1節兵庫滋賀鐵山　泰三",{"$f":"●【進行】結果入力表!A18","v":"第1節"},{"$f":"●【進行】結果入力表!C18","v":"兵庫"},{"$f":"●【進行】結果入力表!J18","v":"滋賀"},{"$f":"●【進行】結果入力表!D18","v":"鐵山　泰三"},{"$f":"IF(●【進行】結果入力表!F18=\"\",\"\",●【進行】結果入力表!F18)","v":"W"},{"$f":"●【進行】結果入力表!E18","v":0}]
["第1節兵庫滋賀中尾　亮太",{"$f":"●【進行】結果入力表!A19","v":"第1節"},{"$f":"●【進行】結果入力表!C19","v":"兵庫"},{"$f":"●【進行】結果入力表!J19","v":"滋賀"},{"$f":"●【進行】結果入力表!D19","v":"中尾　亮太"},{"$f":"IF(●【進行】結果入力表!F19=\"\",\"\",●【進行】結果入力表!F19)","v":153},{"$f":"●【進行】結果入力表!E19","v":0}]
["第1節兵庫滋賀平井　洸志",{"$f":"●【進行】結果入力表!A20","v":"第1節"},{"$f":"●【進行】結果入力表!C20","v":"兵庫"},{"$f":"●【進行】結果入力表!J20","v":"滋賀"},{"$f":"●【進行】結果入力表!D20","v":"平井　洸志"},{"$f":"IF(●【進行】結果入力表!F20=\"\",\"\",●【進行】結果入力表!F20)","v":102},{"$f":"●【進行】結果入力表!E20","v":0}]
["第1節兵庫滋賀堂園　雅也",{"$f":"●【進行】結果入力表!A21","v":"第1節"},{"$f":"●【進行】結果入力表!C21","v":"兵庫"},{"$f":"●【進行】結果入力表!J21","v":"滋賀"},{"$f":"●【進行】結果入力表!D21","v":"堂園　雅也"},{"$f":"IF(●【進行】結果入力表!F21=\"\",\"\",●【進行】結果入力表!F21)","v":"W"},{"$f":"●【進行】結果入力表!E21","v":0}]
["第1節兵庫滋賀藤中　健太郎",{"$f":"●【進行】結果入力表!A22","v":"第1節"},{"$f":"●【進行】結果入力表!C22","v":"兵庫"},{"$f":"●【進行】結果入力表!J22","v":"滋賀"},{"$f":"●【進行】結果入力表!D22","v":"藤中　健太郎"},{"$f":"IF(●【進行】結果入力表!F22=\"\",\"\",●【進行】結果入力表!F22)","v":84},{"$f":"●【進行】結果入力表!E22","v":0}]
["第1節兵庫滋賀0",{"$f":"●【進行】結果入力表!A23","v":"第1節"},{"$f":"●【進行】結果入力表!C23","v":"兵庫"},{"$f":"●【進行】結果入力表!J23","v":"滋賀"},{"$f":"●【進行】結果入力表!D23","v":0},{"$f":"IF(●【進行】結果入力表!F23=\"\",\"\",●【進行】結果入力表!F23)","v":""},{"$f":"●【進行】結果入力表!E23","v":0}]
["第1節兵庫滋賀0",{"$f":"●【進行】結果入力表!A24","v":"第1節"},{"$f":"●【進行】結果入力表!C24","v":"兵庫"},{"$f":"●【進行】結果入力表!J24","v":"滋賀"},{"$f":"●【進行】結果入力表!D24","v":0},{"$f":"IF(●【進行】結果入力表!F24=\"\",\"\",●【進行】結果入力表!F24)","v":""},{"$f":"●【進行】結果入力表!E24","v":0}]
["第1節滋賀奈良大橋　義治",{"$f":"●【進行】結果入力表!A25","v":"第1節"},{"$f":"●【進行】結果入力表!C25","v":"滋賀"},{"$f":"●【進行】結果入力表!J25","v":"奈良"},{"$f":"●【進行】結果入力表!D25","v":"大橋　義治"},{"$f":"IF(●【進行】結果入力表!F25=\"\",\"\",●【進行】結果入力表!F25)","v":"W"},{"$f":"●【進行】結果入力表!E25","v":0}]
["第1節滋賀奈良大橋　正寛",{"$f":"●【進行】結果入力表!A26","v":"第1節"},{"$f":"●【進行】結果入力表!C26","v":"滋賀"},{"$f":"●【進行】結果入力表!J26","v":"奈良"},{"$f":"●【進行】結果入力表!D26","v":"大橋　正寛"},{"$f":"IF(●【進行】結果入力表!F26=\"\",\"\",●【進行】結果入力表!F26)","v":"W"},{"$f":"●【進行】結果入力表!E26","v":0}]
["第1節滋賀奈良西峰　久祐",{"$f":"●【進行】結果入力表!A27","v":"第1節"},{"$f":"●【進行】結果入力表!C27","v":"滋賀"},{"$f":"●【進行】結果入力表!J27","v":"奈良"},{"$f":"●【進行】結果入力表!D27","v":"西峰　久祐"},{"$f":"IF(●【進行】結果入力表!F27=\"\",\"\",●【進行】結果入力表!F27)","v":"W"},{"$f":"●【進行】結果入力表!E27","v":0}]
["第1節滋賀奈良山中　康寛",{"$f":"●【進行】結果入力表!A28","v":"第1節"},{"$f":"●【進行】結果入力表!C28","v":"滋賀"},{"$f":"●【進行】結果入力表!J28","v":"奈良"},{"$f":"●【進行】結果入力表!D28","v":"山中　康寛"},{"$f":"IF(●【進行】結果入力表!F28=\"\",\"\",●【進行】結果入力表!F28)","v":78},{"$f":"●【進行】結果入力表!E28","v":0}]
["第1節滋賀奈良御手洗　茂",{"$f":"●【進行】結果入力表!A29","v":"第1節"},{"$f":"●【進行】結果入力表!C29","v":"滋賀"},{"$f":"●【進行】結果入力表!J29","v":"奈良"},{"$f":"●【進行】結果入力表!D29","v":"御手洗　茂"},{"$f":"IF(●【進行】結果入力表!F29=\"\",\"\",●【進行】結果入力表!F29)","v":31},{"$f":"●【進行】結果入力表!E29","v":0}]
["第1節滋賀奈良高島　太一",{"$f":"●【進行】結果入力表!A30","v":"第1節"},{"$f":"●【進行】結果入力表!C30","v":"滋賀"},{"$f":"●【進行】結果入力表!J30","v":"奈良"},{"$f":"●【進行】結果入力表!D30","v":"高島　太一"},{"$f":"IF(●【進行】結果入力表!F30=\"\",\"\",●【進行】結果入力表!F30)","v":"W"},{"$f":"●【進行】結果入力表!E30","v":0}]
["第1節滋賀奈良0",{"$f":"●【進行】結果入力表!A31","v":"第1節"},{"$f":"●【進行】結果入力表!C31","v":"滋賀"},{"$f":"●【進行】結果入力表!J31","v":"奈良"},{"$f":"●【進行】結果入力表!D31","v":0},{"$f":"IF(●【進行】結果入力表!F31=\"\",\"\",●【進行】結果入力表!F31)","v":""},{"$f":"●【進行】結果入力表!E31","v":0}]
["第1節滋賀奈良0",{"$f":"●【進行】結果入力表!A32","v":"第1節"},{"$f":"●【進行】結果入力表!C32","v":"滋賀"},{"$f":"●【進行】結果入力表!J32","v":"奈良"},{"$f":"●【進行】結果入力表!D32","v":0},{"$f":"IF(●【進行】結果入力表!F32=\"\",\"\",●【進行】結果入力表!F32)","v":""},{"$f":"●【進行】結果入力表!E32","v":0}]
["第2節兵庫奈良堂園　雅也",{"$f":"●【進行】結果入力表!A33","v":"第2節"},{"$f":"●【進行】結果入力表!C33","v":"兵庫"},{"$f":"●【進行】結果入力表!J33","v":"奈良"},{"$f":"●【進行】結果入力表!D33","v":"堂園　雅也"},{"$f":"IF(●【進行】結果入力表!F33=\"\",\"\",●【進行】結果入力表!F33)","v":"W"},{"$f":"●【進行】結果入力表!E33","v":0}]
["第2節兵庫奈良藤中　健太郎",{"$f":"●【進行】結果入力表!A34","v":"第2節"},{"$f":"●【進行】結果入力表!C34","v":"兵庫"},{"$f":"●【進行】結果入力表!J34","v":"奈良"},{"$f":"●【進行】結果入力表!D34","v":"藤中　健太郎"},{"$f":"IF(●【進行】結果入力表!F34=\"\",\"\",●【進行】結果入力表!F34)","v":88},{"$f":"●【進行】結果入力表!E34","v":0}]
["第2節兵庫奈良宮本　一",{"$f":"●【進行】結果入力表!A35","v":"第2節"},{"$f":"●【進行】結果入力表!C35","v":"兵庫"},{"$f":"●【進行】結果入力表!J35","v":"奈良"},{"$f":"●【進行】結果入力表!D35","v":"宮本　一"},{"$f":"IF(●【進行】結果入力表!F35=\"\",\"\",●【進行】結果入力表!F35)","v":"W"},{"$f":"●【進行】結果入力表!E35","v":108}]
["第2節兵庫奈良鐵山　泰三",{"$f":"●【進行】結果入力表!A36","v":"第2節"},{"$f":"●【進行】結果入力表!C36","v":"兵庫"},{"$f":"●【進行】結果入力表!J36","v":"奈良"},{"$f":"●【進行】結果入力表!D36","v":"鐵山　泰三"},{"$f":"IF(●【進行】結果入力表!F36=\"\",\"\",●【進行】結果入力表!F36)","v":"W"},{"$f":"●【進行】結果入力表!E36","v":100}]
["第2節兵庫奈良中尾　亮太",{"$f":"●【進行】結果入力表!A37","v":"第2節"},{"$f":"●【進行】結果入力表!C37","v":"兵庫"},{"$f":"●【進行】結果入力表!J37","v":"奈良"},{"$f":"●【進行】結果入力表!D37","v":"中尾　亮太"},{"$f":"IF(●【進行】結果入力表!F37=\"\",\"\",●【進行】結果入力表!F37)","v":53},{"$f":"●【進行】結果入力表!E37","v":0}]
["第2節兵庫奈良平井　洸志",{"$f":"●【進行】結果入力表!A38","v":"第2節"},{"$f":"●【進行】結果入力表!C38","v":"兵庫"},{"$f":"●【進行】結果入力表!J38","v":"奈良"},{"$f":"●【進行】結果入力表!D38","v":"平井　洸志"},{"$f":"IF(●【進行】結果入力表!F38=\"\",\"\",●【進行】結果入力表!F38)","v":"W"},{"$f":"●【進行】結果入力表!E38","v":0}]
["第2節兵庫奈良0",{"$f":"●【進行】結果入力表!A39","v":"第2節"},{"$f":"●【進行】結果入力表!C39","v":"兵庫"},{"$f":"●【進行】結果入力表!J39","v":"奈良"},{"$f":"●【進行】結果入力表!D39","v":0},{"$f":"IF(●【進行】結果入力表!F39=\"\",\"\",●【進行】結果入力表!F39)","v":""},{"$f":"●【進行】結果入力表!E39","v":0}]
["第2節兵庫奈良0",{"$f":"●【進行】結果入力表!A40","v":"第2節"},{"$f":"●【進行】結果入力表!C40","v":"兵庫"},{"$f":"●【進行】結果入力表!J40","v":"奈良"},{"$f":"●【進行】結果入力表!D40","v":0},{"$f":"IF(●【進行】結果入力表!F40=\"\",\"\",●【進行】結果入力表!F40)","v":""},{"$f":"●【進行】結果入力表!E40","v":0}]
[{"$f":"B33&C33&D33&E33","v":"第2節兵庫滋賀堂園　雅也"},{"$f":"●【進行】結果入力表!A41","v":"第2節"},{"$f":"●【進行】結果入力表!C41","v":"兵庫"},{"$f":"●【進行】結果入力表!J41","v":"滋賀"},{"$f":"●【進行】結果入力表!D41","v":"堂園　雅也"},{"$f":"IF(●【進行】結果入力表!F41=\"\",\"\",●【進行】結果入力表!F41)","v":156},{"$f":"●【進行】結果入力表!E41","v":0}]
["第2節兵庫滋賀藤中　健太郎",{"$f":"●【進行】結果入力表!A42","v":"第2節"},{"$f":"●【進行】結果入力表!C42","v":"兵庫"},{"$f":"●【進行】結果入力表!J42","v":"滋賀"},{"$f":"●【進行】結果入力表!D42","v":"藤中　健太郎"},{"$f":"IF(●【進行】結果入力表!F42=\"\",\"\",●【進行】結果入力表!F42)","v":24},{"$f":"●【進行】結果入力表!E42","v":0}]
["第2節兵庫滋賀宮本　一",{"$f":"●【進行】結果入力表!A43","v":"第2節"},{"$f":"●【進行】結果入力表!C43","v":"兵庫"},{"$f":"●【進行】結果入力表!J43","v":"滋賀"},{"$f":"●【進行】結果入力表!D43","v":"宮本　一"},{"$f":"IF(●【進行】結果入力表!F43=\"\",\"\",●【進行】結果入力表!F43)","v":"W"},{"$f":"●【進行】結果入力表!E43","v":0}]
["第2節兵庫滋賀鐵山　泰三",{"$f":"●【進行】結果入力表!A44","v":"第2節"},{"$f":"●【進行】結果入力表!C44","v":"兵庫"},{"$f":"●【進行】結果入力表!J44","v":"滋賀"},{"$f":"●【進行】結果入力表!D44","v":"鐵山　泰三"},{"$f":"IF(●【進行】結果入力表!F44=\"\",\"\",●【進行】結果入力表!F44)","v":"W"},{"$f":"●【進行】結果入力表!E44","v":0}]
["第2節兵庫滋賀中尾　亮太",{"$f":"●【進行】結果入力表!A45","v":"第2節"},{"$f":"●【進行】結果入力表!C45","v":"兵庫"},{"$f":"●【進行】結果入力表!J45","v":"滋賀"},{"$f":"●【進行】結果入力表!D45","v":"中尾　亮太"},{"$f":"IF(●【進行】結果入力表!F45=\"\",\"\",●【進行】結果入力表!F45)","v":149},{"$f":"●【進行】結果入力表!E45","v":0}]
["第2節兵庫滋賀平井　洸志",{"$f":"●【進行】結果入力表!A46","v":"第2節"},{"$f":"●【進行】結果入力表!C46","v":"兵庫"},{"$f":"●【進行】結果入力表!J46","v":"滋賀"},{"$f":"●【進行】結果入力表!D46","v":"平井　洸志"},{"$f":"IF(●【進行】結果入力表!F46=\"\",\"\",●【進行】結果入力表!F46)","v":"W"},{"$f":"●【進行】結果入力表!E46","v":0}]
["第2節兵庫滋賀0",{"$f":"●【進行】結果入力表!A47","v":"第2節"},{"$f":"●【進行】結果入力表!C47","v":"兵庫"},{"$f":"●【進行】結果入力表!J47","v":"滋賀"},{"$f":"●【進行】結果入力表!D47","v":0},{"$f":"IF(●【進行】結果入力表!F47=\"\",\"\",●【進行】結果入力表!F47)","v":""},{"$f":"●【進行】結果入力表!E47","v":0}]
["第2節兵庫滋賀0",{"$f":"●【進行】結果入力表!A48","v":"第2節"},{"$f":"●【進行】結果入力表!C48","v":"兵庫"},{"$f":"●【進行】結果入力表!J48","v":"滋賀"},{"$f":"●【進行】結果入力表!D48","v":0},{"$f":"IF(●【進行】結果入力表!F48=\"\",\"\",●【進行】結果入力表!F48)","v":""},{"$f":"●【進行】結果入力表!E48","v":0}]
["第2節滋賀奈良高島　太一",{"$f":"●【進行】結果入力表!A49","v":"第2節"},{"$f":"●【進行】結果入力表!C49","v":"滋賀"},{"$f":"●【進行】結果入力表!J49","v":"奈良"},{"$f":"●【進行】結果入力表!D49","v":"高島　太一"},{"$f":"IF(●【進行】結果入力表!F49=\"\",\"\",●【進行】結果入力表!F49)","v":100},{"$f":"●【進行】結果入力表!E49","v":0}]
["第2節滋賀奈良大橋　義治",{"$f":"●【進行】結果入力表!A50","v":"第2節"},{"$f":"●【進行】結果入力表!C50","v":"滋賀"},{"$f":"●【進行】結果入力表!J50","v":"奈良"},{"$f":"●【進行】結果入力表!D50","v":"大橋　義治"},{"$f":"IF(●【進行】結果入力表!F50=\"\",\"\",●【進行】結果入力表!F50)","v":"W"},{"$f":"●【進行】結果入力表!E50","v":0}]
["第2節滋賀奈良大橋　正寛",{"$f":"●【進行】結果入力表!A51","v":"第2節"},{"$f":"●【進行】結果入力表!C51","v":"滋賀"},{"$f":"●【進行】結果入力表!J51","v":"奈良"},{"$f":"●【進行】結果入力表!D51","v":"大橋　正寛"},{"$f":"IF(●【進行】結果入力表!F51=\"\",\"\",●【進行】結果入力表!F51)","v":"W"},{"$f":"●【進行】結果入力表!E51","v":0}]
["第2節滋賀奈良西峰　久祐",{"$f":"●【進行】結果入力表!A52","v":"第2節"},{"$f":"●【進行】結果入力表!C52","v":"滋賀"},{"$f":"●【進行】結果入力表!J52","v":"奈良"},{"$f":"●【進行】結果入力表!D52","v":"西峰　久祐"},{"$f":"IF(●【進行】結果入力表!F52=\"\",\"\",●【進行】結果入力表!F52)","v":"W"},{"$f":"●【進行】結果入力表!E52","v":0}]
["第2節滋賀奈良山中　康寛",{"$f":"●【進行】結果入力表!A53","v":"第2節"},{"$f":"●【進行】結果入力表!C53","v":"滋賀"},{"$f":"●【進行】結果入力表!J53","v":"奈良"},{"$f":"●【進行】結果入力表!D53","v":"山中　康寛"},{"$f":"IF(●【進行】結果入力表!F53=\"\",\"\",●【進行】結果入力表!F53)","v":135},{"$f":"●【進行】結果入力表!E53","v":0}]
["第2節滋賀奈良御手洗　茂",{"$f":"●【進行】結果入力表!A54","v":"第2節"},{"$f":"●【進行】結果入力表!C54","v":"滋賀"},{"$f":"●【進行】結果入力表!J54","v":"奈良"},{"$f":"●【進行】結果入力表!D54","v":"御手洗　茂"},{"$f":"IF(●【進行】結果入力表!F54=\"\",\"\",●【進行】結果入力表!F54)","v":96},{"$f":"●【進行】結果入力表!E54","v":0}]
["第2節滋賀奈良0",{"$f":"●【進行】結果入力表!A55","v":"第2節"},{"$f":"●【進行】結果入力表!C55","v":"滋賀"},{"$f":"●【進行】結果入力表!J55","v":"奈良"},{"$f":"●【進行】結果入力表!D55","v":0},{"$f":"IF(●【進行】結果入力表!F55=\"\",\"\",●【進行】結果入力表!F55)","v":""},{"$f":"●【進行】結果入力表!E55","v":0}]
["第2節滋賀奈良0",{"$f":"●【進行】結果入力表!A56","v":"第2節"},{"$f":"●【進行】結果入力表!C56","v":"滋賀"},{"$f":"●【進行】結果入力表!J56","v":"奈良"},{"$f":"●【進行】結果入力表!D56","v":0},{"$f":"IF(●【進行】結果入力表!F56=\"\",\"\",●【進行】結果入力表!F56)","v":""},{"$f":"●【進行】結果入力表!E56","v":0}]
["第3節兵庫奈良中尾　亮太",{"$f":"●【進行】結果入力表!A57","v":"第3節"},{"$f":"●【進行】結果入力表!C57","v":"兵庫"},{"$f":"●【進行】結果入力表!J57","v":"奈良"},{"$f":"●【進行】結果入力表!D57","v":"中尾　亮太"},{"$f":"IF(●【進行】結果入力表!F57=\"\",\"\",●【進行】結果入力表!F57)","v":"W"},{"$f":"●【進行】結果入力表!E57","v":0}]
["第3節兵庫奈良平井　洸志",{"$f":"●【進行】結果入力表!A58","v":"第3節"},{"$f":"●【進行】結果入力表!C58","v":"兵庫"},{"$f":"●【進行】結果入力表!J58","v":"奈良"},{"$f":"●【進行】結果入力表!D58","v":"平井　洸志"},{"$f":"IF(●【進行】結果入力表!F58=\"\",\"\",●【進行】結果入力表!F58)","v":"W"},{"$f":"●【進行】結果入力表!E58","v":0}]
["第3節兵庫奈良堂園　雅也",{"$f":"●【進行】結果入力表!A59","v":"第3節"},{"$f":"●【進行】結果入力表!C59","v":"兵庫"},{"$f":"●【進行】結果入力表!J59","v":"奈良"},{"$f":"●【進行】結果入力表!D59","v":"堂園　雅也"},{"$f":"IF(●【進行】結果入力表!F59=\"\",\"\",●【進行】結果入力表!F59)","v":"W"},{"$f":"●【進行】結果入力表!E59","v":110}]
["第3節兵庫奈良藤中　健太郎",{"$f":"●【進行】結果入力表!A60","v":"第3節"},{"$f":"●【進行】結果入力表!C60","v":"兵庫"},{"$f":"●【進行】結果入力表!J60","v":"奈良"},{"$f":"●【進行】結果入力表!D60","v":"藤中　健太郎"},{"$f":"IF(●【進行】結果入力表!F60=\"\",\"\",●【進行】結果入力表!F60)","v":"W"},{"$f":"●【進行】結果入力表!E60","v":107}]
["第3節兵庫奈良宮本　一",{"$f":"●【進行】結果入力表!A61","v":"第3節"},{"$f":"●【進行】結果入力表!C61","v":"兵庫"},{"$f":"●【進行】結果入力表!J61","v":"奈良"},{"$f":"●【進行】結果入力表!D61","v":"宮本　一"},{"$f":"IF(●【進行】結果入力表!F61=\"\",\"\",●【進行】結果入力表!F61)","v":"W"},{"$f":"●【進行】結果入力表!E61","v":0}]
["第3節兵庫奈良鐵山　泰三",{"$f":"●【進行】結果入力表!A62","v":"第3節"},{"$f":"●【進行】結果入力表!C62","v":"兵庫"},{"$f":"●【進行】結果入力表!J62","v":"奈良"},{"$f":"●【進行】結果入力表!D62","v":"鐵山　泰三"},{"$f":"IF(●【進行】結果入力表!F62=\"\",\"\",●【進行】結果入力表!F62)","v":"W"},{"$f":"●【進行】結果入力表!E62","v":0}]
["第3節兵庫奈良0",{"$f":"●【進行】結果入力表!A63","v":"第3節"},{"$f":"●【進行】結果入力表!C63","v":"兵庫"},{"$f":"●【進行】結果入力表!J63","v":"奈良"},{"$f":"●【進行】結果入力表!D63","v":0},{"$f":"IF(●【進行】結果入力表!F63=\"\",\"\",●【進行】結果入力表!F63)","v":""},{"$f":"●【進行】結果入力表!E63","v":0}]
["第3節兵庫奈良0",{"$f":"●【進行】結果入力表!A64","v":"第3節"},{"$f":"●【進行】結果入力表!C64","v":"兵庫"},{"$f":"●【進行】結果入力表!J64","v":"奈良"},{"$f":"●【進行】結果入力表!D64","v":0},{"$f":"IF(●【進行】結果入力表!F64=\"\",\"\",●【進行】結果入力表!F64)","v":""},{"$f":"●【進行】結果入力表!E64","v":0}]
["第3節兵庫滋賀中尾　亮太",{"$f":"●【進行】結果入力表!A65","v":"第3節"},{"$f":"●【進行】結果入力表!C65","v":"兵庫"},{"$f":"●【進行】結果入力表!J65","v":"滋賀"},{"$f":"●【進行】結果入力表!D65","v":"中尾　亮太"},{"$f":"IF(●【進行】結果入力表!F65=\"\",\"\",●【進行】結果入力表!F65)","v":"W"},{"$f":"●【進行】結果入力表!E65","v":0}]
["第3節兵庫滋賀平井　洸志",{"$f":"●【進行】結果入力表!A66","v":"第3節"},{"$f":"●【進行】結果入力表!C66","v":"兵庫"},{"$f":"●【進行】結果入力表!J66","v":"滋賀"},{"$f":"●【進行】結果入力表!D66","v":"平井　洸志"},{"$f":"IF(●【進行】結果入力表!F66=\"\",\"\",●【進行】結果入力表!F66)","v":45},{"$f":"●【進行】結果入力表!E66","v":0}]
["第3節兵庫滋賀堂園　雅也",{"$f":"●【進行】結果入力表!A67","v":"第3節"},{"$f":"●【進行】結果入力表!C67","v":"兵庫"},{"$f":"●【進行】結果入力表!J67","v":"滋賀"},{"$f":"●【進行】結果入力表!D67","v":"堂園　雅也"},{"$f":"IF(●【進行】結果入力表!F67=\"\",\"\",●【進行】結果入力表!F67)","v":88},{"$f":"●【進行】結果入力表!E67","v":0}]
["第3節兵庫滋賀藤中　健太郎",{"$f":"●【進行】結果入力表!A68","v":"第3節"},{"$f":"●【進行】結果入力表!C68","v":"兵庫"},{"$f":"●【進行】結果入力表!J68","v":"滋賀"},{"$f":"●【進行】結果入力表!D68","v":"藤中　健太郎"},{"$f":"IF(●【進行】結果入力表!F68=\"\",\"\",●【進行】結果入力表!F68)","v":"W"},{"$f":"●【進行】結果入力表!E68","v":0}]
["第3節兵庫滋賀宮本　一",{"$f":"●【進行】結果入力表!A69","v":"第3節"},{"$f":"●【進行】結果入力表!C69","v":"兵庫"},{"$f":"●【進行】結果入力表!J69","v":"滋賀"},{"$f":"●【進行】結果入力表!D69","v":"宮本　一"},{"$f":"IF(●【進行】結果入力表!F69=\"\",\"\",●【進行】結果入力表!F69)","v":"W"},{"$f":"●【進行】結果入力表!E69","v":0}]
["第3節兵庫滋賀鐵山　泰三",{"$f":"●【進行】結果入力表!A70","v":"第3節"},{"$f":"●【進行】結果入力表!C70","v":"兵庫"},{"$f":"●【進行】結果入力表!J70","v":"滋賀"},{"$f":"●【進行】結果入力表!D70","v":"鐵山　泰三"},{"$f":"IF(●【進行】結果入力表!F70=\"\",\"\",●【進行】結果入力表!F70)","v":178},{"$f":"●【進行】結果入力表!E70","v":0}]
["第3節兵庫滋賀0",{"$f":"●【進行】結果入力表!A71","v":"第3節"},{"$f":"●【進行】結果入力表!C71","v":"兵庫"},{"$f":"●【進行】結果入力表!J71","v":"滋賀"},{"$f":"●【進行】結果入力表!D71","v":0},{"$f":"IF(●【進行】結果入力表!F71=\"\",\"\",●【進行】結果入力表!F71)","v":""},{"$f":"●【進行】結果入力表!E71","v":0}]
["第3節兵庫滋賀0",{"$f":"●【進行】結果入力表!A72","v":"第3節"},{"$f":"●【進行】結果入力表!C72","v":"兵庫"},{"$f":"●【進行】結果入力表!J72","v":"滋賀"},{"$f":"●【進行】結果入力表!D72","v":0},{"$f":"IF(●【進行】結果入力表!F72=\"\",\"\",●【進行】結果入力表!F72)","v":""},{"$f":"●【進行】結果入力表!E72","v":0}]
[{"$f":"B65&C65&D65&E65","v":"第3節滋賀奈良御手洗　茂"},{"$f":"●【進行】結果入力表!A73","v":"第3節"},{"$f":"●【進行】結果入力表!C73","v":"滋賀"},{"$f":"●【進行】結果入力表!J73","v":"奈良"},{"$f":"●【進行】結果入力表!D73","v":"御手洗　茂"},{"$f":"IF(●【進行】結果入力表!F73=\"\",\"\",●【進行】結果入力表!F73)","v":134},{"$f":"●【進行】結果入力表!E73","v":0}]
["第3節滋賀奈良高島　太一",{"$f":"●【進行】結果入力表!A74","v":"第3節"},{"$f":"●【進行】結果入力表!C74","v":"滋賀"},{"$f":"●【進行】結果入力表!J74","v":"奈良"},{"$f":"●【進行】結果入力表!D74","v":"高島　太一"},{"$f":"IF(●【進行】結果入力表!F74=\"\",\"\",●【進行】結果入力表!F74)","v":132},{"$f":"●【進行】結果入力表!E74","v":0}]
["第3節滋賀奈良大橋　義治",{"$f":"●【進行】結果入力表!A75","v":"第3節"},{"$f":"●【進行】結果入力表!C75","v":"滋賀"},{"$f":"●【進行】結果入力表!J75","v":"奈良"},{"$f":"●【進行】結果入力表!D75","v":"大橋　義治"},{"$f":"IF(●【進行】結果入力表!F75=\"\",\"\",●【進行】結果入力表!F75)","v":"W"},{"$f":"●【進行】結果入力表!E75","v":0}]
["第3節滋賀奈良大橋　正寛",{"$f":"●【進行】結果入力表!A76","v":"第3節"},{"$f":"●【進行】結果入力表!C76","v":"滋賀"},{"$f":"●【進行】結果入力表!J76","v":"奈良"},{"$f":"●【進行】結果入力表!D76","v":"大橋　正寛"},{"$f":"IF(●【進行】結果入力表!F76=\"\",\"\",●【進行】結果入力表!F76)","v":75},{"$f":"●【進行】結果入力表!E76","v":0}]
["第3節滋賀奈良西峰　久祐",{"$f":"●【進行】結果入力表!A77","v":"第3節"},{"$f":"●【進行】結果入力表!C77","v":"滋賀"},{"$f":"●【進行】結果入力表!J77","v":"奈良"},{"$f":"●【進行】結果入力表!D77","v":"西峰　久祐"},{"$f":"IF(●【進行】結果入力表!F77=\"\",\"\",●【進行】結果入力表!F77)","v":"W"},{"$f":"●【進行】結果入力表!E77","v":0}]
["第3節滋賀奈良山中　康寛",{"$f":"●【進行】結果入力表!A78","v":"第3節"},{"$f":"●【進行】結果入力表!C78","v":"滋賀"},{"$f":"●【進行】結果入力表!J78","v":"奈良"},{"$f":"●【進行】結果入力表!D78","v":"山中　康寛"},{"$f":"IF(●【進行】結果入力表!F78=\"\",\"\",●【進行】結果入力表!F78)","v":80},{"$f":"●【進行】結果入力表!E78","v":0}]
["第3節滋賀奈良0",{"$f":"●【進行】結果入力表!A79","v":"第3節"},{"$f":"●【進行】結果入力表!C79","v":"滋賀"},{"$f":"●【進行】結果入力表!J79","v":"奈良"},{"$f":"●【進行】結果入力表!D79","v":0},{"$f":"IF(●【進行】結果入力表!F79=\"\",\"\",●【進行】結果入力表!F79)","v":""},{"$f":"●【進行】結果入力表!E79","v":0}]
["第3節滋賀奈良0",{"$f":"●【進行】結果入力表!A80","v":"第3節"},{"$f":"●【進行】結果入力表!C80","v":"滋賀"},{"$f":"●【進行】結果入力表!J80","v":"奈良"},{"$f":"●【進行】結果入力表!D80","v":0},{"$f":"IF(●【進行】結果入力表!F80=\"\",\"\",●【進行】結果入力表!F80)","v":""},{"$f":"●【進行】結果入力表!E80","v":0}]
["第1節奈良兵庫田尻　哲司",{"$f":"●【進行】結果入力表!A9","v":"第1節"},{"$f":"●【進行】結果入力表!J9","v":"奈良"},{"$f":"●【進行】結果入力表!C9","v":"兵庫"},{"$f":"●【進行】結果入力表!I9","v":"田尻　哲司"},{"$f":"IF(●【進行】結果入力表!G9=\"\",\"\",●【進行】結果入力表!G9)","v":52},{"$f":"●【進行】結果入力表!H9","v":0}]
["第1節奈良兵庫吉向　翔平",{"$f":"●【進行】結果入力表!A10","v":"第1節"},{"$f":"●【進行】結果入力表!J10","v":"奈良"},{"$f":"●【進行】結果入力表!C10","v":"兵庫"},{"$f":"●【進行】結果入力表!I10","v":"吉向　翔平"},{"$f":"IF(●【進行】結果入力表!G10=\"\",\"\",●【進行】結果入力表!G10)","v":"W"},{"$f":"●【進行】結果入力表!H10","v":0}]
["第1節奈良兵庫巽　大地",{"$f":"●【進行】結果入力表!A11","v":"第1節"},{"$f":"●【進行】結果入力表!J11","v":"奈良"},{"$f":"●【進行】結果入力表!C11","v":"兵庫"},{"$f":"●【進行】結果入力表!I11","v":"巽　大地"},{"$f":"IF(●【進行】結果入力表!G11=\"\",\"\",●【進行】結果入力表!G11)","v":"W"},{"$f":"●【進行】結果入力表!H11","v":0}]
["第1節奈良兵庫山田　晃司",{"$f":"●【進行】結果入力表!A12","v":"第1節"},{"$f":"●【進行】結果入力表!J12","v":"奈良"},{"$f":"●【進行】結果入力表!C12","v":"兵庫"},{"$f":"●【進行】結果入力表!I12","v":"山田　晃司"},{"$f":"IF(●【進行】結果入力表!G12=\"\",\"\",●【進行】結果入力表!G12)","v":"W"},{"$f":"●【進行】結果入力表!H12","v":0}]
["第1節奈良兵庫鷲尾　隆杜",{"$f":"●【進行】結果入力表!A13","v":"第1節"},{"$f":"●【進行】結果入力表!J13","v":"奈良"},{"$f":"●【進行】結果入力表!C13","v":"兵庫"},{"$f":"●【進行】結果入力表!I13","v":"鷲尾　隆杜"},{"$f":"IF(●【進行】結果入力表!G13=\"\",\"\",●【進行】結果入力表!G13)","v":155},{"$f":"●【進行】結果入力表!H13","v":0}]
["第1節奈良兵庫長谷川　進",{"$f":"●【進行】結果入力表!A14","v":"第1節"},{"$f":"●【進行】結果入力表!J14","v":"奈良"},{"$f":"●【進行】結果入力表!C14","v":"兵庫"},{"$f":"●【進行】結果入力表!I14","v":"長谷川　進"},{"$f":"IF(●【進行】結果入力表!G14=\"\",\"\",●【進行】結果入力表!G14)","v":164},{"$f":"●【進行】結果入力表!H14","v":0}]
["第1節奈良兵庫0",{"$f":"●【進行】結果入力表!A15","v":"第1節"},{"$f":"●【進行】結果入力表!J15","v":"奈良"},{"$f":"●【進行】結果入力表!C15","v":"兵庫"},{"$f":"●【進行】結果入力表!I15","v":0},{"$f":"IF(●【進行】結果入力表!G15=\"\",\"\",●【進行】結果入力表!G15)","v":""},{"$f":"●【進行】結果入力表!H15","v":0}]
["第1節奈良兵庫0",{"$f":"●【進行】結果入力表!A16","v":"第1節"},{"$f":"●【進行】結果入力表!J16","v":"奈良"},{"$f":"●【進行】結果入力表!C16","v":"兵庫"},{"$f":"●【進行】結果入力表!I16","v":0},{"$f":"IF(●【進行】結果入力表!G16=\"\",\"\",●【進行】結果入力表!G16)","v":""},{"$f":"●【進行】結果入力表!H16","v":0}]
["第1節滋賀兵庫大橋　義治",{"$f":"●【進行】結果入力表!A17","v":"第1節"},{"$f":"●【進行】結果入力表!J17","v":"滋賀"},{"$f":"●【進行】結果入力表!C17","v":"兵庫"},{"$f":"●【進行】結果入力表!I17","v":"大橋　義治"},{"$f":"IF(●【進行】結果入力表!G17=\"\",\"\",●【進行】結果入力表!G17)","v":176},{"$f":"●【進行】結果入力表!H17","v":0}]
["第1節滋賀兵庫大橋　正寛",{"$f":"●【進行】結果入力表!A18","v":"第1節"},{"$f":"●【進行】結果入力表!J18","v":"滋賀"},{"$f":"●【進行】結果入力表!C18","v":"兵庫"},{"$f":"●【進行】結果入力表!I18","v":"大橋　正寛"},{"$f":"IF(●【進行】結果入力表!G18=\"\",\"\",●【進行】結果入力表!G18)","v":159},{"$f":"●【進行】結果入力表!H18","v":0}]
["第1節滋賀兵庫西峰　久祐",{"$f":"●【進行】結果入力表!A19","v":"第1節"},{"$f":"●【進行】結果入力表!J19","v":"滋賀"},{"$f":"●【進行】結果入力表!C19","v":"兵庫"},{"$f":"●【進行】結果入力表!I19","v":"西峰　久祐"},{"$f":"IF(●【進行】結果入力表!G19=\"\",\"\",●【進行】結果入力表!G19)","v":"W"},{"$f":"●【進行】結果入力表!H19","v":0}]
["第1節滋賀兵庫山中　康寛",{"$f":"●【進行】結果入力表!A20","v":"第1節"},{"$f":"●【進行】結果入力表!J20","v":"滋賀"},{"$f":"●【進行】結果入力表!C20","v":"兵庫"},{"$f":"●【進行】結果入力表!I20","v":"山中　康寛"},{"$f":"IF(●【進行】結果入力表!G20=\"\",\"\",●【進行】結果入力表!G20)","v":"W"},{"$f":"●【進行】結果入力表!H20","v":0}]
["第1節滋賀兵庫御手洗　茂",{"$f":"●【進行】結果入力表!A21","v":"第1節"},{"$f":"●【進行】結果入力表!J21","v":"滋賀"},{"$f":"●【進行】結果入力表!C21","v":"兵庫"},{"$f":"●【進行】結果入力表!I21","v":"御手洗　茂"},{"$f":"IF(●【進行】結果入力表!G21=\"\",\"\",●【進行】結果入力表!G21)","v":95},{"$f":"●【進行】結果入力表!H21","v":0}]
["第1節滋賀兵庫高島　太一",{"$f":"●【進行】結果入力表!A22","v":"第1節"},{"$f":"●【進行】結果入力表!J22","v":"滋賀"},{"$f":"●【進行】結果入力表!C22","v":"兵庫"},{"$f":"●【進行】結果入力表!I22","v":"高島　太一"},{"$f":"IF(●【進行】結果入力表!G22=\"\",\"\",●【進行】結果入力表!G22)","v":"W"},{"$f":"●【進行】結果入力表!H22","v":0}]
["第1節滋賀兵庫0",{"$f":"●【進行】結果入力表!A23","v":"第1節"},{"$f":"●【進行】結果入力表!J23","v":"滋賀"},{"$f":"●【進行】結果入力表!C23","v":"兵庫"},{"$f":"●【進行】結果入力表!I23","v":0},{"$f":"IF(●【進行】結果入力表!G23=\"\",\"\",●【進行】結果入力表!G23)","v":""},{"$f":"●【進行】結果入力表!H23","v":0}]
["第1節滋賀兵庫0",{"$f":"●【進行】結果入力表!A24","v":"第1節"},{"$f":"●【進行】結果入力表!J24","v":"滋賀"},{"$f":"●【進行】結果入力表!C24","v":"兵庫"},{"$f":"●【進行】結果入力表!I24","v":0},{"$f":"IF(●【進行】結果入力表!G24=\"\",\"\",●【進行】結果入力表!G24)","v":""},{"$f":"●【進行】結果入力表!H24","v":0}]
["第1節奈良滋賀田尻　哲司",{"$f":"●【進行】結果入力表!A25","v":"第1節"},{"$f":"●【進行】結果入力表!J25","v":"奈良"},{"$f":"●【進行】結果入力表!C25","v":"滋賀"},{"$f":"●【進行】結果入力表!I25","v":"田尻　哲司"},{"$f":"IF(●【進行】結果入力表!G25=\"\",\"\",●【進行】結果入力表!G25)","v":172},{"$f":"●【進行】結果入力表!H25","v":0}]
["第1節奈良滋賀吉向　翔平",{"$f":"●【進行】結果入力表!A26","v":"第1節"},{"$f":"●【進行】結果入力表!J26","v":"奈良"},{"$f":"●【進行】結果入力表!C26","v":"滋賀"},{"$f":"●【進行】結果入力表!I26","v":"吉向　翔平"},{"$f":"IF(●【進行】結果入力表!G26=\"\",\"\",●【進行】結果入力表!G26)","v":137},{"$f":"●【進行】結果入力表!H26","v":0}]
["第1節奈良滋賀巽　大地",{"$f":"●【進行】結果入力表!A27","v":"第1節"},{"$f":"●【進行】結果入力表!J27","v":"奈良"},{"$f":"●【進行】結果入力表!C27","v":"滋賀"},{"$f":"●【進行】結果入力表!I27","v":"巽　大地"},{"$f":"IF(●【進行】結果入力表!G27=\"\",\"\",●【進行】結果入力表!G27)","v":160},{"$f":"●【進行】結果入力表!H27","v":0}]
["第1節奈良滋賀山田　晃司",{"$f":"●【進行】結果入力表!A28","v":"第1節"},{"$f":"●【進行】結果入力表!J28","v":"奈良"},{"$f":"●【進行】結果入力表!C28","v":"滋賀"},{"$f":"●【進行】結果入力表!I28","v":"山田　晃司"},{"$f":"IF(●【進行】結果入力表!G28=\"\",\"\",●【進行】結果入力表!G28)","v":"W"},{"$f":"●【進行】結果入力表!H28","v":102}]
["第1節奈良滋賀鷲尾　隆杜",{"$f":"●【進行】結果入力表!A29","v":"第1節"},{"$f":"●【進行】結果入力表!J29","v":"奈良"},{"$f":"●【進行】結果入力表!C29","v":"滋賀"},{"$f":"●【進行】結果入力表!I29","v":"鷲尾　隆杜"},{"$f":"IF(●【進行】結果入力表!G29=\"\",\"\",●【進行】結果入力表!G29)","v":"W"},{"$f":"●【進行】結果入力表!H29","v":105}]
["第1節奈良滋賀長谷川　進",{"$f":"●【進行】結果入力表!A30","v":"第1節"},{"$f":"●【進行】結果入力表!J30","v":"奈良"},{"$f":"●【進行】結果入力表!C30","v":"滋賀"},{"$f":"●【進行】結果入力表!I30","v":"長谷川　進"},{"$f":"IF(●【進行】結果入力表!G30=\"\",\"\",●【進行】結果入力表!G30)","v":108},{"$f":"●【進行】結果入力表!H30","v":0}]
["第1節奈良滋賀0",{"$f":"●【進行】結果入力表!A31","v":"第1節"},{"$f":"●【進行】結果入力表!J31","v":"奈良"},{"$f":"●【進行】結果入力表!C31","v":"滋賀"},{"$f":"●【進行】結果入力表!I31","v":0},{"$f":"IF(●【進行】結果入力表!G31=\"\",\"\",●【進行】結果入力表!G31)","v":""},{"$f":"●【進行】結果入力表!H31","v":0}]
["第1節奈良滋賀0",{"$f":"●【進行】結果入力表!A32","v":"第1節"},{"$f":"●【進行】結果入力表!J32","v":"奈良"},{"$f":"●【進行】結果入力表!C32","v":"滋賀"},{"$f":"●【進行】結果入力表!I32","v":0},{"$f":"IF(●【進行】結果入力表!G32=\"\",\"\",●【進行】結果入力表!G32)","v":""},{"$f":"●【進行】結果入力表!H32","v":0}]
[{"$f":"B97&C97&D97&E97","v":"第2節奈良兵庫山田　晃司"},{"$f":"●【進行】結果入力表!A33","v":"第2節"},{"$f":"●【進行】結果入力表!J33","v":"奈良"},{"$f":"●【進行】結果入力表!C33","v":"兵庫"},{"$f":"●【進行】結果入力表!I33","v":"山田　晃司"},{"$f":"IF(●【進行】結果入力表!G33=\"\",\"\",●【進行】結果入力表!G33)","v":73},{"$f":"●【進行】結果入力表!H33","v":0}]
["第2節奈良兵庫鷲尾　隆杜",{"$f":"●【進行】結果入力表!A34","v":"第2節"},{"$f":"●【進行】結果入力表!J34","v":"奈良"},{"$f":"●【進行】結果入力表!C34","v":"兵庫"},{"$f":"●【進行】結果入力表!I34","v":"鷲尾　隆杜"},{"$f":"IF(●【進行】結果入力表!G34=\"\",\"\",●【進行】結果入力表!G34)","v":"W"},{"$f":"●【進行】結果入力表!H34","v":0}]
["第2節奈良兵庫長谷川　進",{"$f":"●【進行】結果入力表!A35","v":"第2節"},{"$f":"●【進行】結果入力表!J35","v":"奈良"},{"$f":"●【進行】結果入力表!C35","v":"兵庫"},{"$f":"●【進行】結果入力表!I35","v":"長谷川　進"},{"$f":"IF(●【進行】結果入力表!G35=\"\",\"\",●【進行】結果入力表!G35)","v":50},{"$f":"●【進行】結果入力表!H35","v":0}]
["第2節奈良兵庫田尻　哲司",{"$f":"●【進行】結果入力表!A36","v":"第2節"},{"$f":"●【進行】結果入力表!J36","v":"奈良"},{"$f":"●【進行】結果入力表!C36","v":"兵庫"},{"$f":"●【進行】結果入力表!I36","v":"田尻　哲司"},{"$f":"IF(●【進行】結果入力表!G36=\"\",\"\",●【進行】結果入力表!G36)","v":53},{"$f":"●【進行】結果入力表!H36","v":0}]
["第2節奈良兵庫吉向　翔平",{"$f":"●【進行】結果入力表!A37","v":"第2節"},{"$f":"●【進行】結果入力表!J37","v":"奈良"},{"$f":"●【進行】結果入力表!C37","v":"兵庫"},{"$f":"●【進行】結果入力表!I37","v":"吉向　翔平"},{"$f":"IF(●【進行】結果入力表!G37=\"\",\"\",●【進行】結果入力表!G37)","v":"W"},{"$f":"●【進行】結果入力表!H37","v":0}]
["第2節奈良兵庫巽　大地",{"$f":"●【進行】結果入力表!A38","v":"第2節"},{"$f":"●【進行】結果入力表!J38","v":"奈良"},{"$f":"●【進行】結果入力表!C38","v":"兵庫"},{"$f":"●【進行】結果入力表!I38","v":"巽　大地"},{"$f":"IF(●【進行】結果入力表!G38=\"\",\"\",●【進行】結果入力表!G38)","v":91},{"$f":"●【進行】結果入力表!H38","v":0}]
["第2節奈良兵庫0",{"$f":"●【進行】結果入力表!A39","v":"第2節"},{"$f":"●【進行】結果入力表!J39","v":"奈良"},{"$f":"●【進行】結果入力表!C39","v":"兵庫"},{"$f":"●【進行】結果入力表!I39","v":0},{"$f":"IF(●【進行】結果入力表!G39=\"\",\"\",●【進行】結果入力表!G39)","v":""},{"$f":"●【進行】結果入力表!H39","v":0}]
["第2節奈良兵庫0",{"$f":"●【進行】結果入力表!A40","v":"第2節"},{"$f":"●【進行】結果入力表!J40","v":"奈良"},{"$f":"●【進行】結果入力表!C40","v":"兵庫"},{"$f":"●【進行】結果入力表!I40","v":0},{"$f":"IF(●【進行】結果入力表!G40=\"\",\"\",●【進行】結果入力表!G40)","v":""},{"$f":"●【進行】結果入力表!H40","v":0}]
["第2節滋賀兵庫高島　太一",{"$f":"●【進行】結果入力表!A41","v":"第2節"},{"$f":"●【進行】結果入力表!J41","v":"滋賀"},{"$f":"●【進行】結果入力表!C41","v":"兵庫"},{"$f":"●【進行】結果入力表!I41","v":"高島　太一"},{"$f":"IF(●【進行】結果入力表!G41=\"\",\"\",●【進行】結果入力表!G41)","v":"W"},{"$f":"●【進行】結果入力表!H41","v":0}]
["第2節滋賀兵庫大橋　義治",{"$f":"●【進行】結果入力表!A42","v":"第2節"},{"$f":"●【進行】結果入力表!J42","v":"滋賀"},{"$f":"●【進行】結果入力表!C42","v":"兵庫"},{"$f":"●【進行】結果入力表!I42","v":"大橋　義治"},{"$f":"IF(●【進行】結果入力表!G42=\"\",\"\",●【進行】結果入力表!G42)","v":"W"},{"$f":"●【進行】結果入力表!H42","v":0}]
["第2節滋賀兵庫大橋　正寛",{"$f":"●【進行】結果入力表!A43","v":"第2節"},{"$f":"●【進行】結果入力表!J43","v":"滋賀"},{"$f":"●【進行】結果入力表!C43","v":"兵庫"},{"$f":"●【進行】結果入力表!I43","v":"大橋　正寛"},{"$f":"IF(●【進行】結果入力表!G43=\"\",\"\",●【進行】結果入力表!G43)","v":156},{"$f":"●【進行】結果入力表!H43","v":0}]
["第2節滋賀兵庫西峰　久祐",{"$f":"●【進行】結果入力表!A44","v":"第2節"},{"$f":"●【進行】結果入力表!J44","v":"滋賀"},{"$f":"●【進行】結果入力表!C44","v":"兵庫"},{"$f":"●【進行】結果入力表!I44","v":"西峰　久祐"},{"$f":"IF(●【進行】結果入力表!G44=\"\",\"\",●【進行】結果入力表!G44)","v":62},{"$f":"●【進行】結果入力表!H44","v":0}]
["第2節滋賀兵庫山中　康寛",{"$f":"●【進行】結果入力表!A45","v":"第2節"},{"$f":"●【進行】結果入力表!J45","v":"滋賀"},{"$f":"●【進行】結果入力表!C45","v":"兵庫"},{"$f":"●【進行】結果入力表!I45","v":"山中　康寛"},{"$f":"IF(●【進行】結果入力表!G45=\"\",\"\",●【進行】結果入力表!G45)","v":"W"},{"$f":"●【進行】結果入力表!H45","v":0}]
["第2節滋賀兵庫御手洗　茂",{"$f":"●【進行】結果入力表!A46","v":"第2節"},{"$f":"●【進行】結果入力表!J46","v":"滋賀"},{"$f":"●【進行】結果入力表!C46","v":"兵庫"},{"$f":"●【進行】結果入力表!I46","v":"御手洗　茂"},{"$f":"IF(●【進行】結果入力表!G46=\"\",\"\",●【進行】結果入力表!G46)","v":88},{"$f":"●【進行】結果入力表!H46","v":0}]
["第2節滋賀兵庫0",{"$f":"●【進行】結果入力表!A47","v":"第2節"},{"$f":"●【進行】結果入力表!J47","v":"滋賀"},{"$f":"●【進行】結果入力表!C47","v":"兵庫"},{"$f":"●【進行】結果入力表!I47","v":0},{"$f":"IF(●【進行】結果入力表!G47=\"\",\"\",●【進行】結果入力表!G47)","v":""},{"$f":"●【進行】結果入力表!H47","v":0}]
["第2節滋賀兵庫0",{"$f":"●【進行】結果入力表!A48","v":"第2節"},{"$f":"●【進行】結果入力表!J48","v":"滋賀"},{"$f":"●【進行】結果入力表!C48","v":"兵庫"},{"$f":"●【進行】結果入力表!I48","v":0},{"$f":"IF(●【進行】結果入力表!G48=\"\",\"\",●【進行】結果入力表!G48)","v":""},{"$f":"●【進行】結果入力表!H48","v":0}]
["第2節奈良滋賀山田　晃司",{"$f":"●【進行】結果入力表!A49","v":"第2節"},{"$f":"●【進行】結果入力表!J49","v":"奈良"},{"$f":"●【進行】結果入力表!C49","v":"滋賀"},{"$f":"●【進行】結果入力表!I49","v":"山田　晃司"},{"$f":"IF(●【進行】結果入力表!G49=\"\",\"\",●【進行】結果入力表!G49)","v":"W"},{"$f":"●【進行】結果入力表!H49","v":0}]
["第2節奈良滋賀鷲尾　隆杜",{"$f":"●【進行】結果入力表!A50","v":"第2節"},{"$f":"●【進行】結果入力表!J50","v":"奈良"},{"$f":"●【進行】結果入力表!C50","v":"滋賀"},{"$f":"●【進行】結果入力表!I50","v":"鷲尾　隆杜"},{"$f":"IF(●【進行】結果入力表!G50=\"\",\"\",●【進行】結果入力表!G50)","v":57},{"$f":"●【進行】結果入力表!H50","v":0}]
["第2節奈良滋賀長谷川　進",{"$f":"●【進行】結果入力表!A51","v":"第2節"},{"$f":"●【進行】結果入力表!J51","v":"奈良"},{"$f":"●【進行】結果入力表!C51","v":"滋賀"},{"$f":"●【進行】結果入力表!I51","v":"長谷川　進"},{"$f":"IF(●【進行】結果入力表!G51=\"\",\"\",●【進行】結果入力表!G51)","v":96},{"$f":"●【進行】結果入力表!H51","v":0}]
["第2節奈良滋賀田尻　哲司",{"$f":"●【進行】結果入力表!A52","v":"第2節"},{"$f":"●【進行】結果入力表!J52","v":"奈良"},{"$f":"●【進行】結果入力表!C52","v":"滋賀"},{"$f":"●【進行】結果入力表!I52","v":"田尻　哲司"},{"$f":"IF(●【進行】結果入力表!G52=\"\",\"\",●【進行】結果入力表!G52)","v":65},{"$f":"●【進行】結果入力表!H52","v":0}]
["第2節奈良滋賀吉向　翔平",{"$f":"●【進行】結果入力表!A53","v":"第2節"},{"$f":"●【進行】結果入力表!J53","v":"奈良"},{"$f":"●【進行】結果入力表!C53","v":"滋賀"},{"$f":"●【進行】結果入力表!I53","v":"吉向　翔平"},{"$f":"IF(●【進行】結果入力表!G53=\"\",\"\",●【進行】結果入力表!G53)","v":"W"},{"$f":"●【進行】結果入力表!H53","v":0}]
["第2節奈良滋賀巽　大地",{"$f":"●【進行】結果入力表!A54","v":"第2節"},{"$f":"●【進行】結果入力表!J54","v":"奈良"},{"$f":"●【進行】結果入力表!C54","v":"滋賀"},{"$f":"●【進行】結果入力表!I54","v":"巽　大地"},{"$f":"IF(●【進行】結果入力表!G54=\"\",\"\",●【進行】結果入力表!G54)","v":"W"},{"$f":"●【進行】結果入力表!H54","v":0}]
["第2節奈良滋賀0",{"$f":"●【進行】結果入力表!A55","v":"第2節"},{"$f":"●【進行】結果入力表!J55","v":"奈良"},{"$f":"●【進行】結果入力表!C55","v":"滋賀"},{"$f":"●【進行】結果入力表!I55","v":0},{"$f":"IF(●【進行】結果入力表!G55=\"\",\"\",●【進行】結果入力表!G55)","v":""},{"$f":"●【進行】結果入力表!H55","v":0}]
["第2節奈良滋賀0",{"$f":"●【進行】結果入力表!A56","v":"第2節"},{"$f":"●【進行】結果入力表!J56","v":"奈良"},{"$f":"●【進行】結果入力表!C56","v":"滋賀"},{"$f":"●【進行】結果入力表!I56","v":0},{"$f":"IF(●【進行】結果入力表!G56=\"\",\"\",●【進行】結果入力表!G56)","v":""},{"$f":"●【進行】結果入力表!H56","v":0}]
["第3節奈良兵庫田尻　哲司",{"$f":"●【進行】結果入力表!A57","v":"第3節"},{"$f":"●【進行】結果入力表!J57","v":"奈良"},{"$f":"●【進行】結果入力表!C57","v":"兵庫"},{"$f":"●【進行】結果入力表!I57","v":"田尻　哲司"},{"$f":"IF(●【進行】結果入力表!G57=\"\",\"\",●【進行】結果入力表!G57)","v":99},{"$f":"●【進行】結果入力表!H57","v":0}]
["第3節奈良兵庫吉向　翔平",{"$f":"●【進行】結果入力表!A58","v":"第3節"},{"$f":"●【進行】結果入力表!J58","v":"奈良"},{"$f":"●【進行】結果入力表!C58","v":"兵庫"},{"$f":"●【進行】結果入力表!I58","v":"吉向　翔平"},{"$f":"IF(●【進行】結果入力表!G58=\"\",\"\",●【進行】結果入力表!G58)","v":124},{"$f":"●【進行】結果入力表!H58","v":0}]
["第3節奈良兵庫巽　大地",{"$f":"●【進行】結果入力表!A59","v":"第3節"},{"$f":"●【進行】結果入力表!J59","v":"奈良"},{"$f":"●【進行】結果入力表!C59","v":"兵庫"},{"$f":"●【進行】結果入力表!I59","v":"巽　大地"},{"$f":"IF(●【進行】結果入力表!G59=\"\",\"\",●【進行】結果入力表!G59)","v":42},{"$f":"●【進行】結果入力表!H59","v":0}]
["第3節奈良兵庫山田　晃司",{"$f":"●【進行】結果入力表!A60","v":"第3節"},{"$f":"●【進行】結果入力表!J60","v":"奈良"},{"$f":"●【進行】結果入力表!C60","v":"兵庫"},{"$f":"●【進行】結果入力表!I60","v":"山田　晃司"},{"$f":"IF(●【進行】結果入力表!G60=\"\",\"\",●【進行】結果入力表!G60)","v":164},{"$f":"●【進行】結果入力表!H60","v":0}]
["第3節奈良兵庫鷲尾　隆杜",{"$f":"●【進行】結果入力表!A61","v":"第3節"},{"$f":"●【進行】結果入力表!J61","v":"奈良"},{"$f":"●【進行】結果入力表!C61","v":"兵庫"},{"$f":"●【進行】結果入力表!I61","v":"鷲尾　隆杜"},{"$f":"IF(●【進行】結果入力表!G61=\"\",\"\",●【進行】結果入力表!G61)","v":112},{"$f":"●【進行】結果入力表!H61","v":0}]
["第3節奈良兵庫長谷川　進",{"$f":"●【進行】結果入力表!A62","v":"第3節"},{"$f":"●【進行】結果入力表!J62","v":"奈良"},{"$f":"●【進行】結果入力表!C62","v":"兵庫"},{"$f":"●【進行】結果入力表!I62","v":"長谷川　進"},{"$f":"IF(●【進行】結果入力表!G62=\"\",\"\",●【進行】結果入力表!G62)","v":58},{"$f":"●【進行】結果入力表!H62","v":0}]
["第3節奈良兵庫0",{"$f":"●【進行】結果入力表!A63","v":"第3節"},{"$f":"●【進行】結果入力表!J63","v":"奈良"},{"$f":"●【進行】結果入力表!C63","v":"兵庫"},{"$f":"●【進行】結果入力表!I63","v":0},{"$f":"IF(●【進行】結果入力表!G63=\"\",\"\",●【進行】結果入力表!G63)","v":""},{"$f":"●【進行】結果入力表!H63","v":0}]
["第3節奈良兵庫0",{"$f":"●【進行】結果入力表!A64","v":"第3節"},{"$f":"●【進行】結果入力表!J64","v":"奈良"},{"$f":"●【進行】結果入力表!C64","v":"兵庫"},{"$f":"●【進行】結果入力表!I64","v":0},{"$f":"IF(●【進行】結果入力表!G64=\"\",\"\",●【進行】結果入力表!G64)","v":""},{"$f":"●【進行】結果入力表!H64","v":0}]
[{"$f":"B129&C129&D129&E129","v":"第3節滋賀兵庫御手洗　茂"},{"$f":"●【進行】結果入力表!A65","v":"第3節"},{"$f":"●【進行】結果入力表!J65","v":"滋賀"},{"$f":"●【進行】結果入力表!C65","v":"兵庫"},{"$f":"●【進行】結果入力表!I65","v":"御手洗　茂"},{"$f":"IF(●【進行】結果入力表!G65=\"\",\"\",●【進行】結果入力表!G65)","v":61},{"$f":"●【進行】結果入力表!H65","v":0}]
["第3節滋賀兵庫高島　太一",{"$f":"●【進行】結果入力表!A66","v":"第3節"},{"$f":"●【進行】結果入力表!J66","v":"滋賀"},{"$f":"●【進行】結果入力表!C66","v":"兵庫"},{"$f":"●【進行】結果入力表!I66","v":"高島　太一"},{"$f":"IF(●【進行】結果入力表!G66=\"\",\"\",●【進行】結果入力表!G66)","v":"W"},{"$f":"●【進行】結果入力表!H66","v":0}]
["第3節滋賀兵庫大橋　義治",{"$f":"●【進行】結果入力表!A67","v":"第3節"},{"$f":"●【進行】結果入力表!J67","v":"滋賀"},{"$f":"●【進行】結果入力表!C67","v":"兵庫"},{"$f":"●【進行】結果入力表!I67","v":"大橋　義治"},{"$f":"IF(●【進行】結果入力表!G67=\"\",\"\",●【進行】結果入力表!G67)","v":"W"},{"$f":"●【進行】結果入力表!H67","v":0}]
["第3節滋賀兵庫大橋　正寛",{"$f":"●【進行】結果入力表!A68","v":"第3節"},{"$f":"●【進行】結果入力表!J68","v":"滋賀"},{"$f":"●【進行】結果入力表!C68","v":"兵庫"},{"$f":"●【進行】結果入力表!I68","v":"大橋　正寛"},{"$f":"IF(●【進行】結果入力表!G68=\"\",\"\",●【進行】結果入力表!G68)","v":17},{"$f":"●【進行】結果入力表!H68","v":0}]
["第3節滋賀兵庫西峰　久祐",{"$f":"●【進行】結果入力表!A69","v":"第3節"},{"$f":"●【進行】結果入力表!J69","v":"滋賀"},{"$f":"●【進行】結果入力表!C69","v":"兵庫"},{"$f":"●【進行】結果入力表!I69","v":"西峰　久祐"},{"$f":"IF(●【進行】結果入力表!G69=\"\",\"\",●【進行】結果入力表!G69)","v":120},{"$f":"●【進行】結果入力表!H69","v":0}]
["第3節滋賀兵庫山中　康寛",{"$f":"●【進行】結果入力表!A70","v":"第3節"},{"$f":"●【進行】結果入力表!J70","v":"滋賀"},{"$f":"●【進行】結果入力表!C70","v":"兵庫"},{"$f":"●【進行】結果入力表!I70","v":"山中　康寛"},{"$f":"IF(●【進行】結果入力表!G70=\"\",\"\",●【進行】結果入力表!G70)","v":"W"},{"$f":"●【進行】結果入力表!H70","v":0}]
["第3節滋賀兵庫0",{"$f":"●【進行】結果入力表!A71","v":"第3節"},{"$f":"●【進行】結果入力表!J71","v":"滋賀"},{"$f":"●【進行】結果入力表!C71","v":"兵庫"},{"$f":"●【進行】結果入力表!I71","v":0},{"$f":"IF(●【進行】結果入力表!G71=\"\",\"\",●【進行】結果入力表!G71)","v":""},{"$f":"●【進行】結果入力表!H71","v":0}]
["第3節滋賀兵庫0",{"$f":"●【進行】結果入力表!A72","v":"第3節"},{"$f":"●【進行】結果入力表!J72","v":"滋賀"},{"$f":"●【進行】結果入力表!C72","v":"兵庫"},{"$f":"●【進行】結果入力表!I72","v":0},{"$f":"IF(●【進行】結果入力表!G72=\"\",\"\",●【進行】結果入力表!G72)","v":""},{"$f":"●【進行】結果入力表!H72","v":0}]
["第3節奈良滋賀田尻　哲司",{"$f":"●【進行】結果入力表!A73","v":"第3節"},{"$f":"●【進行】結果入力表!J73","v":"奈良"},{"$f":"●【進行】結果入力表!C73","v":"滋賀"},{"$f":"●【進行】結果入力表!I73","v":"田尻　哲司"},{"$f":"IF(●【進行】結果入力表!G73=\"\",\"\",●【進行】結果入力表!G73)","v":"W"},{"$f":"●【進行】結果入力表!H73","v":0}]
["第3節奈良滋賀吉向　翔平",{"$f":"●【進行】結果入力表!A74","v":"第3節"},{"$f":"●【進行】結果入力表!J74","v":"奈良"},{"$f":"●【進行】結果入力表!C74","v":"滋賀"},{"$f":"●【進行】結果入力表!I74","v":"吉向　翔平"},{"$f":"IF(●【進行】結果入力表!G74=\"\",\"\",●【進行】結果入力表!G74)","v":"W"},{"$f":"●【進行】結果入力表!H74","v":0}]
["第3節奈良滋賀巽　大地",{"$f":"●【進行】結果入力表!A75","v":"第3節"},{"$f":"●【進行】結果入力表!J75","v":"奈良"},{"$f":"●【進行】結果入力表!C75","v":"滋賀"},{"$f":"●【進行】結果入力表!I75","v":"巽　大地"},{"$f":"IF(●【進行】結果入力表!G75=\"\",\"\",●【進行】結果入力表!G75)","v":39},{"$f":"●【進行】結果入力表!H75","v":0}]
["第3節奈良滋賀山田　晃司",{"$f":"●【進行】結果入力表!A76","v":"第3節"},{"$f":"●【進行】結果入力表!J76","v":"奈良"},{"$f":"●【進行】結果入力表!C76","v":"滋賀"},{"$f":"●【進行】結果入力表!I76","v":"山田　晃司"},{"$f":"IF(●【進行】結果入力表!G76=\"\",\"\",●【進行】結果入力表!G76)","v":"W"},{"$f":"●【進行】結果入力表!H76","v":0}]
["第3節奈良滋賀鷲尾　隆杜",{"$f":"●【進行】結果入力表!A77","v":"第3節"},{"$f":"●【進行】結果入力表!J77","v":"奈良"},{"$f":"●【進行】結果入力表!C77","v":"滋賀"},{"$f":"●【進行】結果入力表!I77","v":"鷲尾　隆杜"},{"$f":"IF(●【進行】結果入力表!G77=\"\",\"\",●【進行】結果入力表!G77)","v":89},{"$f":"●【進行】結果入力表!H77","v":0}]
["第3節奈良滋賀長谷川　進",{"$f":"●【進行】結果入力表!A78","v":"第3節"},{"$f":"●【進行】結果入力表!J78","v":"奈良"},{"$f":"●【進行】結果入力表!C78","v":"滋賀"},{"$f":"●【進行】結果入力表!I78","v":"長谷川　進"},{"$f":"IF(●【進行】結果入力表!G78=\"\",\"\",●【進行】結果入力表!G78)","v":"W"},{"$f":"●【進行】結果入力表!H78","v":0}]
["第3節奈良滋賀0",{"$f":"●【進行】結果入力表!A79","v":"第3節"},{"$f":"●【進行】結果入力表!J79","v":"奈良"},{"$f":"●【進行】結果入力表!C79","v":"滋賀"},{"$f":"●【進行】結果入力表!I79","v":0},{"$f":"IF(●【進行】結果入力表!G79=\"\",\"\",●【進行】結果入力表!G79)","v":""},{"$f":"●【進行】結果入力表!H79","v":0}]
["第3節奈良滋賀0",{"$f":"●【進行】結果入力表!A80","v":"第3節"},{"$f":"●【進行】結果入力表!J80","v":"奈良"},{"$f":"●【進行】結果入力表!C80","v":"滋賀"},{"$f":"●【進行】結果入力表!I80","v":0},{"$f":"IF(●【進行】結果入力表!G80=\"\",\"\",●【進行】結果入力表!G80)","v":""},{"$f":"●【進行】結果入力表!H80","v":0}]

{"sheet":"【準備】対戦カード","index":6,"n_rows":98,"n_cols":72,"rows_kept":98,"cut":false,"hidden":false,"merged":[]}
[null,null,null,null,null,null,null,null,null," ",{"$f":"●【結果】個人成績表!$A$1","v":"第8回　神奈滋対抗戦　　　(奈良；キングスポット)"}]
[]
[null,"印刷範囲の設定",null,null,null,null,null,null,null,null,"G-No",null,null,null,"T-No"]
[]
[null,null,null,null,null,null,null,null,null,null,null,null,null,"所属"]
[null,null,null,null,null,null,null,null,null,null,null,null,null,"氏名"]
[null,null,null,null,null,null,null,null,null,null,null,null,null,"得点"]
[null,null,null,null,null,null,null,null,null,null,null,null,null,"HR"]
[]
[null,null,null,null,null,null,null,null,null,null,null,null,null,null,"レフリー"]
[null,{"$f":"●【結果】個人成績表!$A$1","v":"第8回　神奈滋対抗戦　　　(奈良；キングスポット)"},null,null,null,null,null,null,null,null,{"$f":"●【結果】個人成績表!$A$1","v":"第8回　神奈滋対抗戦　　　(奈良；キングスポット)"},null,null,null,null,null,null,null,null,{"$f":"●【結果】個人成績表!$A$1","v":"第8回　神奈滋対抗戦　　　(奈良；キングスポット)"},null,null,null,null,null,null,null,null,{"$f":"●【結果】個人成績表!$A$1","v":"第8回　神奈滋対抗戦　　　(奈良；キングスポット)"},null,null,null,null,null,null,null,null,{"$f":"●【結果】個人成績表!$A$1","v":"第8回　神奈滋対抗戦　　　(奈良；キングスポット)"},null,null,null,null,null,null,null,null,{"$f":"●【結果】個人成績表!$A$1","v":"第8回　神奈滋対抗戦　　　(奈良；キングスポット)"},null,null,null,null,null,null,null,null,{"$f":"●【結果】個人成績表!$A$1","v":"第8回　神奈滋対抗戦　　　(奈良；キングスポット)"},null,null,null,null,null,null,null,null,{"$f":"●【結果】個人成績表!$A$1","v":"第8回　神奈滋対抗戦　　　(奈良；キングスポット)"},null,null,null,null,null,null," "]
[]
[null,"G-No",{"$f":"●【進行】結果入力表!B9","v":1},null,null,"T-No",null,null,null,null,"G-No",{"$f":"●【進行】結果入力表!B10","v":2},null,null,"T-No",null,null,null,null,"G-No",{"$f":"●【進行】結果入力表!B11","v":3},null,null,"T-No",null,null,null,null,"G-No",{"$f":"●【進行】結果入力表!B12","v":4},null,null,"T-No",null,null,null,null,"G-No",{"$f":"●【進行】結果入力表!B13","v":5},null,null,"T-No",null,null,null,null,"G-No",{"$f":"●【進行】結果入力表!B14","v":6},null,null,"T-No",null,null,null,null,"G-No",{"$f":"●【進行】結果入力表!B15","v":""},null,null,"T-No",null,null,null,null,"G-No",{"$f":"●【進行】結果入力表!B16","v":""},null,null,"T-No"]
[]
[null,{"$f":"VLOOKUP(C13,●【進行】結果入力表!$B$9:$J$80,2,FALSE)","v":"兵庫"},null,null,"所属",{"$f":"VLOOKUP(C13,●【進行】結果入力表!$B$9:$J$80,9,FALSE)","v":"奈良"},null,null,null,null,{"$f":"VLOOKUP(L13,●【進行】結果入力表!$B$9:$J$80,2,FALSE)","v":"兵庫"},null,null,"所属",{"$f":"VLOOKUP(L13,●【進行】結果入力表!$B$9:$J$80,9,FALSE)","v":"奈良"},null,null,null,null,{"$f":"VLOOKUP(U13,●【進行】結果入力表!$B$9:$J$80,2,FALSE)","v":"兵庫"},null,null,"所属",{"$f":"VLOOKUP(U13,●【進行】結果入力表!$B$9:$J$80,9,FALSE)","v":"奈良"},null,null,null,null,{"$f":"VLOOKUP(AD13,●【進行】結果入力表!$B$9:$J$80,2,FALSE)","v":"兵庫"},null,null,"所属",{"$f":"VLOOKUP(AD13,●【進行】結果入力表!$B$9:$J$80,9,FALSE)","v":"奈良"},null,null,null,null,{"$f":"VLOOKUP(AM13,●【進行】結果入力表!$B$9:$J$80,2,FALSE)","v":"兵庫"},null,null,"所属",{"$f":"VLOOKUP(AM13,●【進行】結果入力表!$B$9:$J$80,9,FALSE)","v":"奈良"},null,null,null,null,{"$f":"VLOOKUP(AV13,●【進行】結果入力表!$B$9:$J$80,2,FALSE)","v":"兵庫"},null,null,"所属",{"$f":"VLOOKUP(AV13,●【進行】結果入力表!$B$9:$J$80,9,FALSE)","v":"奈良"},null,null,null,null,{"$f":"VLOOKUP(BE13,●【進行】結果入力表!$B$9:$J$80,2,FALSE)","v":"兵庫"},null,null,"所属",{"$f":"VLOOKUP(BE13,●【進行】結果入力表!$B$9:$J$80,9,FALSE)","v":"奈良"},null,null,null,null,{"$f":"VLOOKUP(BN13,●【進行】結果入力表!$B$9:$J$80,2,FALSE)","v":"兵庫"},null,null,"所属",{"$f":"VLOOKUP(BN13,●【進行】結果入力表!$B$9:$J$80,9,FALSE)","v":"奈良"}]
[null,{"$f":"VLOOKUP(C13,●【進行】結果入力表!$B$9:$J$80,3,FALSE)","v":"宮本　一"},null,null,"氏名",{"$f":"VLOOKUP(C13,●【進行】結果入力表!$B$9:$J$80,8,FALSE)","v":"田尻　哲司"},null,null,null,null,{"$f":"VLOOKUP(L13,●【進行】結果入力表!$B$9:$J$80,3,FALSE)","v":"鐵山　泰三"},null,null,"氏名",{"$f":"VLOOKUP(L13,●【進行】結果入力表!$B$9:$J$80,8,FALSE)","v":"吉向　翔平"},null,null,null,null,{"$f":"VLOOKUP(U13,●【進行】結果入力表!$B$9:$J$80,3,FALSE)","v":"中尾　亮太"},null,null,"氏名",{"$f":"VLOOKUP(U13,●【進行】結果入力表!$B$9:$J$80,8,FALSE)","v":"巽　大地"},null,null,null,null,{"$f":"VLOOKUP(AD13,●【進行】結果入力表!$B$9:$J$80,3,FALSE)","v":"平井　洸志"},null,null,"氏名",{"$f":"VLOOKUP(AD13,●【進行】結果入力表!$B$9:$J$80,8,FALSE)","v":"山田　晃司"},null,null,null,null,{"$f":"VLOOKUP(AM13,●【進行】結果入力表!$B$9:$J$80,3,FALSE)","v":"堂園　雅也"},null,null,"氏名",{"$f":"VLOOKUP(AM13,●【進行】結果入力表!$B$9:$J$80,8,FALSE)","v":"鷲尾　隆杜"},null,null,null,null,{"$f":"VLOOKUP(AV13,●【進行】結果入力表!$B$9:$J$80,3,FALSE)","v":"藤中　健太郎"},null,null,"氏名",{"$f":"VLOOKUP(AV13,●【進行】結果入力表!$B$9:$J$80,8,FALSE)","v":"長谷川　進"},null,null,null,null,{"$f":"VLOOKUP(BE13,●【進行】結果入力表!$B$9:$J$80,3,FALSE)","v":0},null,null,"氏名",{"$f":"VLOOKUP(BE13,●【進行】結果入力表!$B$9:$J$80,8,FALSE)","v":0},null,null,null,null,{"$f":"VLOOKUP(BN13,●【進行】結果入力表!$B$9:$J$80,3,FALSE)","v":0},null,null,"氏名",{"$f":"VLOOKUP(BN13,●【進行】結果入力表!$B$9:$J$80,8,FALSE)","v":0}]
[null,null,null,null,"得点",null,null,null,null,null,null,null,null,"得点",null,null,null,null,null,null,null,null,"得点",null,null,null,null,null,null,null,null,"得点",null,null,null,null,null,null,null,null,"得点",null,null,null,null,null,null,null,null,"得点",null,null,null,null,null,null,null,null,"得点",null,null,null,null,null,null,null,null,"得点"]
[null,null,null,null,"HR",null,null,null,null,null,null,null,null,"HR",null,null,null,null,null,null,null,null,"HR",null,null,null,null,null,null,null,null,"HR",null,null,null,null,null,null,null,null,"HR",null,null,null,null,null,null,null,null,"HR",null,null,null,null,null,null,null,null,"HR",null,null,null,null,null,null,null,null,"HR"]
[]
[]
[null,{"$f":"●【結果】個人成績表!$A$1","v":"第8回　神奈滋対抗戦　　　(奈良；キングスポット)"},null,null,null,null,null,null,null,null,{"$f":"●【結果】個人成績表!$A$1","v":"第8回　神奈滋対抗戦　　　(奈良；キングスポット)"},null,null,null,null,null,null,null,null,{"$f":"●【結果】個人成績表!$A$1","v":"第8回　神奈滋対抗戦　　　(奈良；キングスポット)"},null,null,null,null,null,null,null,null,{"$f":"●【結果】個人成績表!$A$1","v":"第8回　神奈滋対抗戦　　　(奈良；キングスポット)"},null,null,null,null,null,null,null,null,{"$f":"●【結果】個人成績表!$A$1","v":"第8回　神奈滋対抗戦　　　(奈良；キングスポット)"},null,null,null,null,null,null,null,null,{"$f":"●【結果】個人成績表!$A$1","v":"第8回　神奈滋対抗戦　　　(奈良；キングスポット)"},null,null,null,null,null,null,null,null,{"$f":"●【結果】個人成績表!$A$1","v":"第8回　神奈滋対抗戦　　　(奈良；キングスポット)"},null,null,null,null,null,null,null,null,{"$f":"●【結果】個人成績表!$A$1","v":"第8回　神奈滋対抗戦　　　(奈良；キングスポット)"},null,null,null,null,null,null," "]
[]
[null,"G-No",{"$f":"●【進行】結果入力表!B17","v":7},null,null,"T-No",null,null,null,null,"G-No",{"$f":"●【進行】結果入力表!B18","v":8},null,null,"T-No",null,null,null,null,"G-No",{"$f":"●【進行】結果入力表!B19","v":9},null,null,"T-No",null,null,null,null,"G-No",{"$f":"●【進行】結果入力表!B20","v":10},null,null,"T-No",null,null,null,null,"G-No",{"$f":"●【進行】結果入力表!B21","v":11},null,null,"T-No",null,null,null,null,"G-No",{"$f":"●【進行】結果入力表!B22","v":12},null,null,"T-No",null,null,null,null,"G-No",{"$f":"●【進行】結果入力表!B23","v":""},null,null,"T-No",null,null,null,null,"G-No",{"$f":"●【進行】結果入力表!B24","v":""},null,null,"T-No"]
[]
[null,{"$f":"VLOOKUP(C23,●【進行】結果入力表!$B$9:$J$80,2,FALSE)","v":"兵庫"},null,null,"所属",{"$f":"VLOOKUP(C23,●【進行】結果入力表!$B$9:$J$80,9,FALSE)","v":"滋賀"},null,null,null,null,{"$f":"VLOOKUP(L23,●【進行】結果入力表!$B$9:$J$80,2,FALSE)","v":"兵庫"},null,null,"所属",{"$f":"VLOOKUP(L23,●【進行】結果入力表!$B$9:$J$80,9,FALSE)","v":"滋賀"},null,null,null,null,{"$f":"VLOOKUP(U23,●【進行】結果入力表!$B$9:$J$80,2,FALSE)","v":"兵庫"},null,null,"所属",{"$f":"VLOOKUP(U23,●【進行】結果入力表!$B$9:$J$80,9,FALSE)","v":"滋賀"},null,null,null,null,{"$f":"VLOOKUP(AD23,●【進行】結果入力表!$B$9:$J$80,2,FALSE)","v":"兵庫"},null,null,"所属",{"$f":"VLOOKUP(AD23,●【進行】結果入力表!$B$9:$J$80,9,FALSE)","v":"滋賀"},null,null,null,null,{"$f":"VLOOKUP(AM23,●【進行】結果入力表!$B$9:$J$80,2,FALSE)","v":"兵庫"},null,null,"所属",{"$f":"VLOOKUP(AM23,●【進行】結果入力表!$B$9:$J$80,9,FALSE)","v":"滋賀"},null,null,null,null,{"$f":"VLOOKUP(AV23,●【進行】結果入力表!$B$9:$J$80,2,FALSE)","v":"兵庫"},null,null,"所属",{"$f":"VLOOKUP(AV23,●【進行】結果入力表!$B$9:$J$80,9,FALSE)","v":"滋賀"},null,null,null,null,{"$f":"VLOOKUP(BE23,●【進行】結果入力表!$B$9:$J$80,2,FALSE)","v":"兵庫"},null,null,"所属",{"$f":"VLOOKUP(BE23,●【進行】結果入力表!$B$9:$J$80,9,FALSE)","v":"奈良"},null,null,null,null,{"$f":"VLOOKUP(BN23,●【進行】結果入力表!$B$9:$J$80,2,FALSE)","v":"兵庫"},null,null,"所属",{"$f":"VLOOKUP(BN23,●【進行】結果入力表!$B$9:$J$80,9,FALSE)","v":"奈良"}]
[null,{"$f":"VLOOKUP(C23,●【進行】結果入力表!$B$9:$J$80,3,FALSE)","v":"宮本　一"},null,null,"氏名",{"$f":"VLOOKUP(C23,●【進行】結果入力表!$B$9:$J$80,8,FALSE)","v":"大橋　義治"},null,null,null,null,{"$f":"VLOOKUP(L23,●【進行】結果入力表!$B$9:$J$80,3,FALSE)","v":"鐵山　泰三"},null,null,"氏名",{"$f":"VLOOKUP(L23,●【進行】結果入力表!$B$9:$J$80,8,FALSE)","v":"大橋　正寛"},null,null,null,null,{"$f":"VLOOKUP(U23,●【進行】結果入力表!$B$9:$J$80,3,FALSE)","v":"中尾　亮太"},null,null,"氏名",{"$f":"VLOOKUP(U23,●【進行】結果入力表!$B$9:$J$80,8,FALSE)","v":"西峰　久祐"},null,null,null,null,{"$f":"VLOOKUP(AD23,●【進行】結果入力表!$B$9:$J$80,3,FALSE)","v":"平井　洸志"},null,null,"氏名",{"$f":"VLOOKUP(AD23,●【進行】結果入力表!$B$9:$J$80,8,FALSE)","v":"山中　康寛"},null,null,null,null,{"$f":"VLOOKUP(AM23,●【進行】結果入力表!$B$9:$J$80,3,FALSE)","v":"堂園　雅也"},null,null,"氏名",{"$f":"VLOOKUP(AM23,●【進行】結果入力表!$B$9:$J$80,8,FALSE)","v":"御手洗　茂"},null,null,null,null,{"$f":"VLOOKUP(AV23,●【進行】結果入力表!$B$9:$J$80,3,FALSE)","v":"藤中　健太郎"},null,null,"氏名",{"$f":"VLOOKUP(AV23,●【進行】結果入力表!$B$9:$J$80,8,FALSE)","v":"高島　太一"},null,null,null,null,{"$f":"VLOOKUP(BE23,●【進行】結果入力表!$B$9:$J$80,3,FALSE)","v":0},null,null,"氏名",{"$f":"VLOOKUP(BE23,●【進行】結果入力表!$B$9:$J$80,8,FALSE)","v":0},null,null,null,null,{"$f":"VLOOKUP(BN23,●【進行】結果入力表!$B$9:$J$80,3,FALSE)","v":0},null,null,"氏名",{"$f":"VLOOKUP(BN23,●【進行】結果入力表!$B$9:$J$80,8,FALSE)","v":0}]
[null,null,null,null,"得点",null,null,null,null,null,null,null,null,"得点",null,null,null,null,null,null,null,null,"得点",null,null,null,null,null,null,null,null,"得点",null,null,null,null,null,null,null,null,"得点",null,null,null,null,null,null,null,null,"得点",null,null,null,null,null,null,null,null,"得点",null,null,null,null,null,null,null,null,"得点"]
[null,null,null,null,"HR",null,null,null,null,null,null,null,null,"HR",null,null,null,null,null,null,null,null,"HR",null,null,null,null,null,null,null,null,"HR",null,null,null,null,null,null,null,null,"HR",null,null,null,null,null,null,null,null,"HR",null,null,null,null,null,null,null,null,"HR",null,null,null,null,null,null,null,null,"HR"]
[]
[]
[null,{"$f":"●【結果】個人成績表!$A$1","v":"第8回　神奈滋対抗戦　　　(奈良；キングスポット)"},null,null,null,null,null,null,null,null,{"$f":"●【結果】個人成績表!$A$1","v":"第8回　神奈滋対抗戦　　　(奈良；キングスポット)"},null,null,null,null,null,null,null,null,{"$f":"●【結果】個人成績表!$A$1","v":"第8回　神奈滋対抗戦　　　(奈良；キングスポット)"},null,null,null,null,null,null,null,null,{"$f":"●【結果】個人成績表!$A$1","v":"第8回　神奈滋対抗戦　　　(奈良；キングスポット)"},null,null,null,null,null,null,null,null,{"$f":"●【結果】個人成績表!$A$1","v":"第8回　神奈滋対抗戦　　　(奈良；キングスポット)"},null,null,null,null,null,null,null,null,{"$f":"●【結果】個人成績表!$A$1","v":"第8回　神奈滋対抗戦　　　(奈良；キングスポット)"},null,null,null,null,null,null,null,null,{"$f":"●【結果】個人成績表!$A$1","v":"第8回　神奈滋対抗戦　　　(奈良；キングスポット)"},null,null,null,null,null,null,null,null,{"$f":"●【結果】個人成績表!$A$1","v":"第8回　神奈滋対抗戦　　　(奈良；キングスポット)"},null,null,null,null,null,null," "]
[]
[null,"G-No",{"$f":"●【進行】結果入力表!B25","v":13},null,null,"T-No",null,null,null,null,"G-No",{"$f":"●【進行】結果入力表!B26","v":14},null,null,"T-No",null,null,null,null,"G-No",{"$f":"●【進行】結果入力表!B27","v":15},null,null,"T-No",null,null,null,null,"G-No",{"$f":"●【進行】結果入力表!B28","v":16},null,null,"T-No",null,null,null,null,"G-No",{"$f":"●【進行】結果入力表!B29","v":17},null,null,"T-No",null,null,null,null,"G-No",{"$f":"●【進行】結果入力表!B30","v":18},null,null,"T-No",null,null,null,null,"G-No",{"$f":"●【進行】結果入力表!B31","v":""},null,null,"T-No",null,null,null,null,"G-No",{"$f":"●【進行】結果入力表!B32","v":""},null,null,"T-No"]
[]
[null,{"$f":"VLOOKUP(C33,●【進行】結果入力表!$B$9:$J$80,2,FALSE)","v":"滋賀"},null,null,"所属",{"$f":"VLOOKUP(C33,●【進行】結果入力表!$B$9:$J$80,9,FALSE)","v":"奈良"},null,null,null,null,{"$f":"VLOOKUP(L33,●【進行】結果入力表!$B$9:$J$80,2,FALSE)","v":"滋賀"},null,null,"所属",{"$f":"VLOOKUP(L33,●【進行】結果入力表!$B$9:$J$80,9,FALSE)","v":"奈良"},null,null,null,null,{"$f":"VLOOKUP(U33,●【進行】結果入力表!$B$9:$J$80,2,FALSE)","v":"滋賀"},null,null,"所属",{"$f":"VLOOKUP(U33,●【進行】結果入力表!$B$9:$J$80,9,FALSE)","v":"奈良"},null,null,null,null,{"$f":"VLOOKUP(AD33,●【進行】結果入力表!$B$9:$J$80,2,FALSE)","v":"滋賀"},null,null,"所属",{"$f":"VLOOKUP(AD33,●【進行】結果入力表!$B$9:$J$80,9,FALSE)","v":"奈良"},null,null,null,null,{"$f":"VLOOKUP(AM33,●【進行】結果入力表!$B$9:$J$80,2,FALSE)","v":"滋賀"},null,null,"所属",{"$f":"VLOOKUP(AM33,●【進行】結果入力表!$B$9:$J$80,9,FALSE)","v":"奈良"},null,null,null,null,{"$f":"VLOOKUP(AV33,●【進行】結果入力表!$B$9:$J$80,2,FALSE)","v":"滋賀"},null,null,"所属",{"$f":"VLOOKUP(AV33,●【進行】結果入力表!$B$9:$J$80,9,FALSE)","v":"奈良"},null,null,null,null,{"$f":"VLOOKUP(BE33,●【進行】結果入力表!$B$9:$J$80,2,FALSE)","v":"兵庫"},null,null,"所属",{"$f":"VLOOKUP(BE33,●【進行】結果入力表!$B$9:$J$80,9,FALSE)","v":"奈良"},null,null,null,null,{"$f":"VLOOKUP(BN33,●【進行】結果入力表!$B$9:$J$80,2,FALSE)","v":"兵庫"},null,null,"所属",{"$f":"VLOOKUP(BN33,●【進行】結果入力表!$B$9:$J$80,9,FALSE)","v":"奈良"}]
[null,{"$f":"VLOOKUP(C33,●【進行】結果入力表!$B$9:$J$80,3,FALSE)","v":"大橋　義治"},null,null,"氏名",{"$f":"VLOOKUP(C33,●【進行】結果入力表!$B$9:$J$80,8,FALSE)","v":"田尻　哲司"},null,null,null,null,{"$f":"VLOOKUP(L33,●【進行】結果入力表!$B$9:$J$80,3,FALSE)","v":"大橋　正寛"},null,null,"氏名",{"$f":"VLOOKUP(L33,●【進行】結果入力表!$B$9:$J$80,8,FALSE)","v":"吉向　翔平"},null,null,null,null,{"$f":"VLOOKUP(U33,●【進行】結果入力表!$B$9:$J$80,3,FALSE)","v":"西峰　久祐"},null,null,"氏名",{"$f":"VLOOKUP(U33,●【進行】結果入力表!$B$9:$J$80,8,FALSE)","v":"巽　大地"},null,null,null,null,{"$f":"VLOOKUP(AD33,●【進行】結果入力表!$B$9:$J$80,3,FALSE)","v":"山中　康寛"},null,null,"氏名",{"$f":"VLOOKUP(AD33,●【進行】結果入力表!$B$9:$J$80,8,FALSE)","v":"山田　晃司"},null,null,null,null,{"$f":"VLOOKUP(AM33,●【進行】結果入力表!$B$9:$J$80,3,FALSE)","v":"御手洗　茂"},null,null,"氏名",{"$f":"VLOOKUP(AM33,●【進行】結果入力表!$B$9:$J$80,8,FALSE)","v":"鷲尾　隆杜"},null,null,null,null,{"$f":"VLOOKUP(AV33,●【進行】結果入力表!$B$9:$J$80,3,FALSE)","v":"高島　太一"},null,null,"氏名",{"$f":"VLOOKUP(AV33,●【進行】結果入力表!$B$9:$J$80,8,FALSE)","v":"長谷川　進"},null,null,null,null,{"$f":"VLOOKUP(BE33,●【進行】結果入力表!$B$9:$J$80,3,FALSE)","v":0},null,null,"氏名",{"$f":"VLOOKUP(BE33,●【進行】結果入力表!$B$9:$J$80,8,FALSE)","v":0},null,null,null,null,{"$f":"VLOOKUP(BN33,●【進行】結果入力表!$B$9:$J$80,3,FALSE)","v":0},null,null,"氏名",{"$f":"VLOOKUP(BN33,●【進行】結果入力表!$B$9:$J$80,8,FALSE)","v":0}]
[null,null,null,null,"得点",null,null,null,null,null,null,null,null,"得点",null,null,null,null,null,null,null,null,"得点",null,null,null,null,null,null,null,null,"得点",null,null,null,null,null,null,null,null,"得点",null,null,null,null,null,null,null,null,"得点",null,null,null,null,null,null,null,null,"得点",null,null,null,null,null,null,null,null,"得点"]
[null,null,null,null,"HR",null,null,null,null,null,null,null,null,"HR",null,null,null,null,null,null,null,null,"HR",null,null,null,null,null,null,null,null,"HR",null,null,null,null,null,null,null,null,"HR",null,null,null,null,null,null,null,null,"HR",null,null,null,null,null,null,null,null,"HR",null,null,null,null,null,null,null,null,"HR"]
[]
[]
[null,{"$f":"●【結果】個人成績表!$A$1","v":"第8回　神奈滋対抗戦　　　(奈良；キングスポット)"},null,null,null,null,null,null,null,null,{"$f":"●【結果】個人成績表!$A$1","v":"第8回　神奈滋対抗戦　　　(奈良；キングスポット)"},null,null,null,null,null,null,null,null,{"$f":"●【結果】個人成績表!$A$1","v":"第8回　神奈滋対抗戦　　　(奈良；キングスポット)"},null,null,null,null,null,null,null,null,{"$f":"●【結果】個人成績表!$A$1","v":"第8回　神奈滋対抗戦　　　(奈良；キングスポット)"},null,null,null,null,null,null,null,null,{"$f":"●【結果】個人成績表!$A$1","v":"第8回　神奈滋対抗戦　　　(奈良；キングスポット)"},null,null,null,null,null,null,null,null,{"$f":"●【結果】個人成績表!$A$1","v":"第8回　神奈滋対抗戦　　　(奈良；キングスポット)"},null,null,null,null,null,null,null,null,{"$f":"●【結果】個人成績表!$A$1","v":"第8回　神奈滋対抗戦　　　(奈良；キングスポット)"},null,null,null,null,null,null,null,null,{"$f":"●【結果】個人成績表!$A$1","v":"第8回　神奈滋対抗戦　　　(奈良；キングスポット)"},null,null,null,null,null,null," "]
[]
[null,"G-No",{"$f":"●【進行】結果入力表!B33","v":19},null,null,"T-No",null,null,null,null,"G-No",{"$f":"●【進行】結果入力表!B34","v":20},null,null,"T-No",null,null,null,null,"G-No",{"$f":"●【進行】結果入力表!B35","v":21},null,null,"T-No",null,null,null,null,"G-No",{"$f":"●【進行】結果入力表!B36","v":22},null,null,"T-No",null,null,null,null,"G-No",{"$f":"●【進行】結果入力表!B37","v":23},null,null,"T-No",null,null,null,null,"G-No",{"$f":"●【進行】結果入力表!B38","v":24},null,null,"T-No",null,null,null,null,"G-No",{"$f":"●【進行】結果入力表!B39","v":""},null,null,"T-No",null,null,null,null,"G-No",{"$f":"●【進行】結果入力表!B40","v":""},null,null,"T-No"]
[]
[null,{"$f":"VLOOKUP(C43,●【進行】結果入力表!$B$9:$J$80,2,FALSE)","v":"兵庫"},null,null,"所属",{"$f":"VLOOKUP(C43,●【進行】結果入力表!$B$9:$J$80,9,FALSE)","v":"奈良"},null,null,null,null,{"$f":"VLOOKUP(L43,●【進行】結果入力表!$B$9:$J$80,2,FALSE)","v":"兵庫"},null,null,"所属",{"$f":"VLOOKUP(L43,●【進行】結果入力表!$B$9:$J$80,9,FALSE)","v":"奈良"},null,null,null,null,{"$f":"VLOOKUP(U43,●【進行】結果入力表!$B$9:$J$80,2,FALSE)","v":"兵庫"},null,null,"所属",{"$f":"VLOOKUP(U43,●【進行】結果入力表!$B$9:$J$80,9,FALSE)","v":"奈良"},null,null,null,null,{"$f":"VLOOKUP(AD43,●【進行】結果入力表!$B$9:$J$80,2,FALSE)","v":"兵庫"},null,null,"所属",{"$f":"VLOOKUP(AD43,●【進行】結果入力表!$B$9:$J$80,9,FALSE)","v":"奈良"},null,null,null,null,{"$f":"VLOOKUP(AM43,●【進行】結果入力表!$B$9:$J$80,2,FALSE)","v":"兵庫"},null,null,"所属",{"$f":"VLOOKUP(AM43,●【進行】結果入力表!$B$9:$J$80,9,FALSE)","v":"奈良"},null,null,null,null,{"$f":"VLOOKUP(AV43,●【進行】結果入力表!$B$9:$J$80,2,FALSE)","v":"兵庫"},null,null,"所属",{"$f":"VLOOKUP(AV43,●【進行】結果入力表!$B$9:$J$80,9,FALSE)","v":"奈良"},null,null,null,null,{"$f":"VLOOKUP(BE43,●【進行】結果入力表!$B$9:$J$80,2,FALSE)","v":"兵庫"},null,null,"所属",{"$f":"VLOOKUP(BE43,●【進行】結果入力表!$B$9:$J$80,9,FALSE)","v":"奈良"},null,null,null,null,{"$f":"VLOOKUP(BN43,●【進行】結果入力表!$B$9:$J$80,2,FALSE)","v":"兵庫"},null,null,"所属",{"$f":"VLOOKUP(BN43,●【進行】結果入力表!$B$9:$J$80,9,FALSE)","v":"奈良"}]
[null,{"$f":"VLOOKUP(C43,●【進行】結果入力表!$B$9:$J$80,3,FALSE)","v":"堂園　雅也"},null,null,"氏名",{"$f":"VLOOKUP(C43,●【進行】結果入力表!$B$9:$J$80,8,FALSE)","v":"山田　晃司"},null,null,null,null,{"$f":"VLOOKUP(L43,●【進行】結果入力表!$B$9:$J$80,3,FALSE)","v":"藤中　健太郎"},null,null,"氏名",{"$f":"VLOOKUP(L43,●【進行】結果入力表!$B$9:$J$80,8,FALSE)","v":"鷲尾　隆杜"},null,null,null,null,{"$f":"VLOOKUP(U43,●【進行】結果入力表!$B$9:$J$80,3,FALSE)","v":"宮本　一"},null,null,"氏名",{"$f":"VLOOKUP(U43,●【進行】結果入力表!$B$9:$J$80,8,FALSE)","v":"長谷川　進"},null,null,null,null,{"$f":"VLOOKUP(AD43,●【進行】結果入力表!$B$9:$J$80,3,FALSE)","v":"鐵山　泰三"},null,null,"氏名",{"$f":"VLOOKUP(AD43,●【進行】結果入力表!$B$9:$J$80,8,FALSE)","v":"田尻　哲司"},null,null,null,null,{"$f":"VLOOKUP(AM43,●【進行】結果入力表!$B$9:$J$80,3,FALSE)","v":"中尾　亮太"},null,null,"氏名",{"$f":"VLOOKUP(AM43,●【進行】結果入力表!$B$9:$J$80,8,FALSE)","v":"吉向　翔平"},null,null,null,null,{"$f":"VLOOKUP(AV43,●【進行】結果入力表!$B$9:$J$80,3,FALSE)","v":"平井　洸志"},null,null,"氏名",{"$f":"VLOOKUP(AV43,●【進行】結果入力表!$B$9:$J$80,8,FALSE)","v":"巽　大地"},null,null,null,null,{"$f":"VLOOKUP(BE43,●【進行】結果入力表!$B$9:$J$80,3,FALSE)","v":0},null,null,"氏名",{"$f":"VLOOKUP(BE43,●【進行】結果入力表!$B$9:$J$80,8,FALSE)","v":0},null,null,null,null,{"$f":"VLOOKUP(BN43,●【進行】結果入力表!$B$9:$J$80,3,FALSE)","v":0},null,null,"氏名",{"$f":"VLOOKUP(BN43,●【進行】結果入力表!$B$9:$J$80,8,FALSE)","v":0}]
[null,null,null,null,"得点",null,null,null,null,null,null,null,null,"得点",null,null,null,null,null,null,null,null,"得点",null,null,null,null,null,null,null,null,"得点",null,null,null,null,null,null,null,null,"得点",null,null,null,null,null,null,null,null,"得点",null,null,null,null,null,null,null,null,"得点",null,null,null,null,null,null,null,null,"得点"]
[null,null,null,null,"HR",null,null,null,null,null,null,null,null,"HR",null,null,null,null,null,null,null,null,"HR",null,null,null,null,null,null,null,null,"HR",null,null,null,null,null,null,null,null,"HR",null,null,null,null,null,null,null,null,"HR",null,null,null,null,null,null,null,null,"HR",null,null,null,null,null,null,null,null,"HR"]
[]
[]
[null,{"$f":"●【結果】個人成績表!$A$1","v":"第8回　神奈滋対抗戦　　　(奈良；キングスポット)"},null,null,null,null,null,null,null,null,{"$f":"●【結果】個人成績表!$A$1","v":"第8回　神奈滋対抗戦　　　(奈良；キングスポット)"},null,null,null,null,null,null,null,null,{"$f":"●【結果】個人成績表!$A$1","v":"第8回　神奈滋対抗戦　　　(奈良；キングスポット)"},null,null,null,null,null,null,null,null,{"$f":"●【結果】個人成績表!$A$1","v":"第8回　神奈滋対抗戦　　　(奈良；キングスポット)"},null,null,null,null,null,null,null,null,{"$f":"●【結果】個人成績表!$A$1","v":"第8回　神奈滋対抗戦　　　(奈良；キングスポット)"},null,null,null,null,null,null,null,null,{"$f":"●【結果】個人成績表!$A$1","v":"第8回　神奈滋対抗戦　　　(奈良；キングスポット)"},null,null,null,null,null,null,null,null,{"$f":"●【結果】個人成績表!$A$1","v":"第8回　神奈滋対抗戦　　　(奈良；キングスポット)"},null,null,null,null,null,null,null,null,{"$f":"●【結果】個人成績表!$A$1","v":"第8回　神奈滋対抗戦　　　(奈良；キングスポット)"},null,null,null,null,null,null," "]
[]
[null,"G-No",{"$f":"●【進行】結果入力表!B41","v":25},null,null,"T-No",null,null,null,null,"G-No",{"$f":"●【進行】結果入力表!B42","v":26},null,null,"T-No",null,null,null,null,"G-No",{"$f":"●【進行】結果入力表!B43","v":27},null,null,"T-No",null,null,null,null,"G-No",{"$f":"●【進行】結果入力表!B44","v":28},null,null,"T-No",null,null,null,null,"G-No",{"$f":"●【進行】結果入力表!B45","v":29},null,null,"T-No",null,null,null,null,"G-No",{"$f":"●【進行】結果入力表!B46","v":30},null,null,"T-No",null,null,null,null,"G-No",{"$f":"●【進行】結果入力表!B47","v":""},null,null,"T-No",null,null,null,null,"G-No",{"$f":"●【進行】結果入力表!B48","v":""},null,null,"T-No"]
[]
[null,{"$f":"VLOOKUP(C53,●【進行】結果入力表!$B$9:$J$80,2,FALSE)","v":"兵庫"},null,null,"所属",{"$f":"VLOOKUP(C53,●【進行】結果入力表!$B$9:$J$80,9,FALSE)","v":"滋賀"},null,null,null,null,{"$f":"VLOOKUP(L53,●【進行】結果入力表!$B$9:$J$80,2,FALSE)","v":"兵庫"},null,null,"所属",{"$f":"VLOOKUP(L53,●【進行】結果入力表!$B$9:$J$80,9,FALSE)","v":"滋賀"},null,null,null,null,{"$f":"VLOOKUP(U53,●【進行】結果入力表!$B$9:$J$80,2,FALSE)","v":"兵庫"},null,null,"所属",{"$f":"VLOOKUP(U53,●【進行】結果入力表!$B$9:$J$80,9,FALSE)","v":"滋賀"},null,null,null,null,{"$f":"VLOOKUP(AD53,●【進行】結果入力表!$B$9:$J$80,2,FALSE)","v":"兵庫"},null,null,"所属",{"$f":"VLOOKUP(AD53,●【進行】結果入力表!$B$9:$J$80,9,FALSE)","v":"滋賀"},null,null,null,null,{"$f":"VLOOKUP(AM53,●【進行】結果入力表!$B$9:$J$80,2,FALSE)","v":"兵庫"},null,null,"所属",{"$f":"VLOOKUP(AM53,●【進行】結果入力表!$B$9:$J$80,9,FALSE)","v":"滋賀"},null,null,null,null,{"$f":"VLOOKUP(AV53,●【進行】結果入力表!$B$9:$J$80,2,FALSE)","v":"兵庫"},null,null,"所属",{"$f":"VLOOKUP(AV53,●【進行】結果入力表!$B$9:$J$80,9,FALSE)","v":"滋賀"},null,null,null,null,{"$f":"VLOOKUP(BE53,●【進行】結果入力表!$B$9:$J$80,2,FALSE)","v":"兵庫"},null,null,"所属",{"$f":"VLOOKUP(BE53,●【進行】結果入力表!$B$9:$J$80,9,FALSE)","v":"奈良"},null,null,null,null,{"$f":"VLOOKUP(BN53,●【進行】結果入力表!$B$9:$J$80,2,FALSE)","v":"兵庫"},null,null,"所属",{"$f":"VLOOKUP(BN53,●【進行】結果入力表!$B$9:$J$80,9,FALSE)","v":"奈良"}]
[null,{"$f":"VLOOKUP(C53,●【進行】結果入力表!$B$9:$J$80,3,FALSE)","v":"堂園　雅也"},null,null,"氏名",{"$f":"VLOOKUP(C53,●【進行】結果入力表!$B$9:$J$80,8,FALSE)","v":"高島　太一"},null,null,null,null,{"$f":"VLOOKUP(L53,●【進行】結果入力表!$B$9:$J$80,3,FALSE)","v":"藤中　健太郎"},null,null,"氏名",{"$f":"VLOOKUP(L53,●【進行】結果入力表!$B$9:$J$80,8,FALSE)","v":"大橋　義治"},null,null,null,null,{"$f":"VLOOKUP(U53,●【進行】結果入力表!$B$9:$J$80,3,FALSE)","v":"宮本　一"},null,null,"氏名",{"$f":"VLOOKUP(U53,●【進行】結果入力表!$B$9:$J$80,8,FALSE)","v":"大橋　正寛"},null,null,null,null,{"$f":"VLOOKUP(AD53,●【進行】結果入力表!$B$9:$J$80,3,FALSE)","v":"鐵山　泰三"},null,null,"氏名",{"$f":"VLOOKUP(AD53,●【進行】結果入力表!$B$9:$J$80,8,FALSE)","v":"西峰　久祐"},null,null,null,null,{"$f":"VLOOKUP(AM53,●【進行】結果入力表!$B$9:$J$80,3,FALSE)","v":"中尾　亮太"},null,null,"氏名",{"$f":"VLOOKUP(AM53,●【進行】結果入力表!$B$9:$J$80,8,FALSE)","v":"山中　康寛"},null,null,null,null,{"$f":"VLOOKUP(AV53,●【進行】結果入力表!$B$9:$J$80,3,FALSE)","v":"平井　洸志"},null,null,"氏名",{"$f":"VLOOKUP(AV53,●【進行】結果入力表!$B$9:$J$80,8,FALSE)","v":"御手洗　茂"},null,null,null,null,{"$f":"VLOOKUP(BE53,●【進行】結果入力表!$B$9:$J$80,3,FALSE)","v":0},null,null,"氏名",{"$f":"VLOOKUP(BE53,●【進行】結果入力表!$B$9:$J$80,8,FALSE)","v":0},null,null,null,null,{"$f":"VLOOKUP(BN53,●【進行】結果入力表!$B$9:$J$80,3,FALSE)","v":0},null,null,"氏名",{"$f":"VLOOKUP(BN53,●【進行】結果入力表!$B$9:$J$80,8,FALSE)","v":0}]
[null,null,null,null,"得点",null,null,null,null,null,null,null,null,"得点",null,null,null,null,null,null,null,null,"得点",null,null,null,null,null,null,null,null,"得点",null,null,null,null,null,null,null,null,"得点",null,null,null,null,null,null,null,null,"得点",null,null,null,null,null,null,null,null,"得点",null,null,null,null,null,null,null,null,"得点"]
[null,null,null,null,"HR",null,null,null,null,null,null,null,null,"HR",null,null,null,null,null,null,null,null,"HR",null,null,null,null,null,null,null,null,"HR",null,null,null,null,null,null,null,null,"HR",null,null,null,null,null,null,null,null,"HR",null,null,null,null,null,null,null,null,"HR",null,null,null,null,null,null,null,null,"HR"]
[]
[]
[null,{"$f":"●【結果】個人成績表!$A$1","v":"第8回　神奈滋対抗戦　　　(奈良；キングスポット)"},null,null,null,null,null,null,null,null,{"$f":"●【結果】個人成績表!$A$1","v":"第8回　神奈滋対抗戦　　　(奈良；キングスポット)"},null,null,null,null,null,null,null,null,{"$f":"●【結果】個人成績表!$A$1","v":"第8回　神奈滋対抗戦　　　(奈良；キングスポット)"},null,null,null,null,null,null,null,null,{"$f":"●【結果】個人成績表!$A$1","v":"第8回　神奈滋対抗戦　　　(奈良；キングスポット)"},null,null,null,null,null,null,null,null,{"$f":"●【結果】個人成績表!$A$1","v":"第8回　神奈滋対抗戦　　　(奈良；キングスポット)"},null,null,null,null,null,null,null,null,{"$f":"●【結果】個人成績表!$A$1","v":"第8回　神奈滋対抗戦　　　(奈良；キングスポット)"},null,null,null,null,null,null,null,null,{"$f":"●【結果】個人成績表!$A$1","v":"第8回　神奈滋対抗戦　　　(奈良；キングスポット)"},null,null,null,null,null,null,null,null,{"$f":"●【結果】個人成績表!$A$1","v":"第8回　神奈滋対抗戦　　　(奈良；キングスポット)"},null,null,null,null,null,null," "]
[]
[null,"G-No",{"$f":"●【進行】結果入力表!B49","v":31},null,null,"T-No",null,null,null,null,"G-No",{"$f":"●【進行】結果入力表!B50","v":32},null,null,"T-No",null,null,null,null,"G-No",{"$f":"●【進行】結果入力表!B51","v":33},null,null,"T-No",null,null,null,null,"G-No",{"$f":"●【進行】結果入力表!B52","v":34},null,null,"T-No",null,null,null,null,"G-No",{"$f":"●【進行】結果入力表!B53","v":35},null,null,"T-No",null,null,null,null,"G-No",{"$f":"●【進行】結果入力表!B54","v":36},null,null,"T-No",null,null,null,null,"G-No",{"$f":"●【進行】結果入力表!B55","v":""},null,null,"T-No",null,null,null,null,"G-No",{"$f":"●【進行】結果入力表!B56","v":""},null,null,"T-No"]
[]
[null,{"$f":"VLOOKUP(C63,●【進行】結果入力表!$B$9:$J$80,2,FALSE)","v":"滋賀"},null,null,"所属",{"$f":"VLOOKUP(C63,●【進行】結果入力表!$B$9:$J$80,9,FALSE)","v":"奈良"},null,null,null,null,{"$f":"VLOOKUP(L63,●【進行】結果入力表!$B$9:$J$80,2,FALSE)","v":"滋賀"},null,null,"所属",{"$f":"VLOOKUP(L63,●【進行】結果入力表!$B$9:$J$80,9,FALSE)","v":"奈良"},null,null,null,null,{"$f":"VLOOKUP(U63,●【進行】結果入力表!$B$9:$J$80,2,FALSE)","v":"滋賀"},null,null,"所属",{"$f":"VLOOKUP(U63,●【進行】結果入力表!$B$9:$J$80,9,FALSE)","v":"奈良"},null,null,null,null,{"$f":"VLOOKUP(AD63,●【進行】結果入力表!$B$9:$J$80,2,FALSE)","v":"滋賀"},null,null,"所属",{"$f":"VLOOKUP(AD63,●【進行】結果入力表!$B$9:$J$80,9,FALSE)","v":"奈良"},null,null,null,null,{"$f":"VLOOKUP(AM63,●【進行】結果入力表!$B$9:$J$80,2,FALSE)","v":"滋賀"},null,null,"所属",{"$f":"VLOOKUP(AM63,●【進行】結果入力表!$B$9:$J$80,9,FALSE)","v":"奈良"},null,null,null,null,{"$f":"VLOOKUP(AV63,●【進行】結果入力表!$B$9:$J$80,2,FALSE)","v":"滋賀"},null,null,"所属",{"$f":"VLOOKUP(AV63,●【進行】結果入力表!$B$9:$J$80,9,FALSE)","v":"奈良"},null,null,null,null,{"$f":"VLOOKUP(BE63,●【進行】結果入力表!$B$9:$J$80,2,FALSE)","v":"兵庫"},null,null,"所属",{"$f":"VLOOKUP(BE63,●【進行】結果入力表!$B$9:$J$80,9,FALSE)","v":"奈良"},null,null,null,null,{"$f":"VLOOKUP(BN63,●【進行】結果入力表!$B$9:$J$80,2,FALSE)","v":"兵庫"},null,null,"所属",{"$f":"VLOOKUP(BN63,●【進行】結果入力表!$B$9:$J$80,9,FALSE)","v":"奈良"}]
[null,{"$f":"VLOOKUP(C63,●【進行】結果入力表!$B$9:$J$80,3,FALSE)","v":"高島　太一"},null,null,"氏名",{"$f":"VLOOKUP(C63,●【進行】結果入力表!$B$9:$J$80,8,FALSE)","v":"山田　晃司"},null,null,null,null,{"$f":"VLOOKUP(L63,●【進行】結果入力表!$B$9:$J$80,3,FALSE)","v":"大橋　義治"},null,null,"氏名",{"$f":"VLOOKUP(L63,●【進行】結果入力表!$B$9:$J$80,8,FALSE)","v":"鷲尾　隆杜"},null,null,null,null,{"$f":"VLOOKUP(U63,●【進行】結果入力表!$B$9:$J$80,3,FALSE)","v":"大橋　正寛"},null,null,"氏名",{"$f":"VLOOKUP(U63,●【進行】結果入力表!$B$9:$J$80,8,FALSE)","v":"長谷川　進"},null,null,null,null,{"$f":"VLOOKUP(AD63,●【進行】結果入力表!$B$9:$J$80,3,FALSE)","v":"西峰　久祐"},null,null,"氏名",{"$f":"VLOOKUP(AD63,●【進行】結果入力表!$B$9:$J$80,8,FALSE)","v":"田尻　哲司"},null,null,null,null,{"$f":"VLOOKUP(AM63,●【進行】結果入力表!$B$9:$J$80,3,FALSE)","v":"山中　康寛"},null,null,"氏名",{"$f":"VLOOKUP(AM63,●【進行】結果入力表!$B$9:$J$80,8,FALSE)","v":"吉向　翔平"},null,null,null,null,{"$f":"VLOOKUP(AV63,●【進行】結果入力表!$B$9:$J$80,3,FALSE)","v":"御手洗　茂"},null,null,"氏名",{"$f":"VLOOKUP(AV63,●【進行】結果入力表!$B$9:$J$80,8,FALSE)","v":"巽　大地"},null,null,null,null,{"$f":"VLOOKUP(BE63,●【進行】結果入力表!$B$9:$J$80,3,FALSE)","v":0},null,null,"氏名",{"$f":"VLOOKUP(BE63,●【進行】結果入力表!$B$9:$J$80,8,FALSE)","v":0},null,null,null,null,{"$f":"VLOOKUP(BN63,●【進行】結果入力表!$B$9:$J$80,3,FALSE)","v":0},null,null,"氏名",{"$f":"VLOOKUP(BN63,●【進行】結果入力表!$B$9:$J$80,8,FALSE)","v":0}]
[null,null,null,null,"得点",null,null,null,null,null,null,null,null,"得点",null,null,null,null,null,null,null,null,"得点",null,null,null,null,null,null,null,null,"得点",null,null,null,null,null,null,null,null,"得点",null,null,null,null,null,null,null,null,"得点",null,null,null,null,null,null,null,null,"得点",null,null,null,null,null,null,null,null,"得点"]
[null,null,null,null,"HR",null,null,null,null,null,null,null,null,"HR",null,null,null,null,null,null,null,null,"HR",null,null,null,null,null,null,null,null,"HR",null,null,null,null,null,null,null,null,"HR",null,null,null,null,null,null,null,null,"HR",null,null,null,null,null,null,null,null,"HR",null,null,null,null,null,null,null,null,"HR"]
[]
[]
[null,{"$f":"●【結果】個人成績表!$A$1","v":"第8回　神奈滋対抗戦　　　(奈良；キングスポット)"},null,null,null,null,null,null,null,null,{"$f":"●【結果】個人成績表!$A$1","v":"第8回　神奈滋対抗戦　　　(奈良；キングスポット)"},null,null,null,null,null,null,null,null,{"$f":"●【結果】個人成績表!$A$1","v":"第8回　神奈滋対抗戦　　　(奈良；キングスポット)"},null,null,null,null,null,null,null,null,{"$f":"●【結果】個人成績表!$A$1","v":"第8回　神奈滋対抗戦　　　(奈良；キングスポット)"},null,null,null,null,null,null,null,null,{"$f":"●【結果】個人成績表!$A$1","v":"第8回　神奈滋対抗戦　　　(奈良；キングスポット)"},null,null,null,null,null,null,null,null,{"$f":"●【結果】個人成績表!$A$1","v":"第8回　神奈滋対抗戦　　　(奈良；キングスポット)"},null,null,null,null,null,null,null,null,{"$f":"●【結果】個人成績表!$A$1","v":"第8回　神奈滋対抗戦　　　(奈良；キングスポット)"},null,null,null,null,null,null,null,null,{"$f":"●【結果】個人成績表!$A$1","v":"第8回　神奈滋対抗戦　　　(奈良；キングスポット)"},null,null,null,null,null,null," "]
[]
[null,"G-No",{"$f":"●【進行】結果入力表!B57","v":37},null,null,"T-No",null,null,null,null,"G-No",{"$f":"●【進行】結果入力表!B58","v":38},null,null,"T-No",null,null,null,null,"G-No",{"$f":"●【進行】結果入力表!B59","v":39},null,null,"T-No",null,null,null,null,"G-No",{"$f":"●【進行】結果入力表!B60","v":40},null,null,"T-No",null,null,null,null,"G-No",{"$f":"●【進行】結果入力表!B61","v":41},null,null,"T-No",null,null,null,null,"G-No",{"$f":"●【進行】結果入力表!B62","v":42},null,null,"T-No",null,null,null,null,"G-No",{"$f":"●【進行】結果入力表!B63","v":""},null,null,"T-No",null,null,null,null,"G-No",{"$f":"●【進行】結果入力表!B64","v":""},null,null,"T-No"]
[]
[null,{"$f":"VLOOKUP(C73,●【進行】結果入力表!$B$9:$J$80,2,FALSE)","v":"兵庫"},null,null,"所属",{"$f":"VLOOKUP(C73,●【進行】結果入力表!$B$9:$J$80,9,FALSE)","v":"奈良"},null,null,null,null,{"$f":"VLOOKUP(L73,●【進行】結果入力表!$B$9:$J$80,2,FALSE)","v":"兵庫"},null,null,"所属",{"$f":"VLOOKUP(L73,●【進行】結果入力表!$B$9:$J$80,9,FALSE)","v":"奈良"},null,null,null,null,{"$f":"VLOOKUP(U73,●【進行】結果入力表!$B$9:$J$80,2,FALSE)","v":"兵庫"},null,null,"所属",{"$f":"VLOOKUP(U73,●【進行】結果入力表!$B$9:$J$80,9,FALSE)","v":"奈良"},null,null,null,null,{"$f":"VLOOKUP(AD73,●【進行】結果入力表!$B$9:$J$80,2,FALSE)","v":"兵庫"},null,null,"所属",{"$f":"VLOOKUP(AD73,●【進行】結果入力表!$B$9:$J$80,9,FALSE)","v":"奈良"},null,null,null,null,{"$f":"VLOOKUP(AM73,●【進行】結果入力表!$B$9:$J$80,2,FALSE)","v":"兵庫"},null,null,"所属",{"$f":"VLOOKUP(AM73,●【進行】結果入力表!$B$9:$J$80,9,FALSE)","v":"奈良"},null,null,null,null,{"$f":"VLOOKUP(AV73,●【進行】結果入力表!$B$9:$J$80,2,FALSE)","v":"兵庫"},null,null,"所属",{"$f":"VLOOKUP(AV73,●【進行】結果入力表!$B$9:$J$80,9,FALSE)","v":"奈良"},null,null,null,null,{"$f":"VLOOKUP(BE73,●【進行】結果入力表!$B$9:$J$80,2,FALSE)","v":"兵庫"},null,null,"所属",{"$f":"VLOOKUP(BE73,●【進行】結果入力表!$B$9:$J$80,9,FALSE)","v":"奈良"},null,null,null,null,{"$f":"VLOOKUP(BN73,●【進行】結果入力表!$B$9:$J$80,2,FALSE)","v":"兵庫"},null,null,"所属",{"$f":"VLOOKUP(BN73,●【進行】結果入力表!$B$9:$J$80,9,FALSE)","v":"奈良"}]
[null,{"$f":"VLOOKUP(C73,●【進行】結果入力表!$B$9:$J$80,3,FALSE)","v":"中尾　亮太"},null,null,"氏名",{"$f":"VLOOKUP(C73,●【進行】結果入力表!$B$9:$J$80,8,FALSE)","v":"田尻　哲司"},null,null,null,null,{"$f":"VLOOKUP(L73,●【進行】結果入力表!$B$9:$J$80,3,FALSE)","v":"平井　洸志"},null,null,"氏名",{"$f":"VLOOKUP(L73,●【進行】結果入力表!$B$9:$J$80,8,FALSE)","v":"吉向　翔平"},null,null,null,null,{"$f":"VLOOKUP(U73,●【進行】結果入力表!$B$9:$J$80,3,FALSE)","v":"堂園　雅也"},null,null,"氏名",{"$f":"VLOOKUP(U73,●【進行】結果入力表!$B$9:$J$80,8,FALSE)","v":"巽　大地"},null,null,null,null,{"$f":"VLOOKUP(AD73,●【進行】結果入力表!$B$9:$J$80,3,FALSE)","v":"藤中　健太郎"},null,null,"氏名",{"$f":"VLOOKUP(AD73,●【進行】結果入力表!$B$9:$J$80,8,FALSE)","v":"山田　晃司"},null,null,null,null,{"$f":"VLOOKUP(AM73,●【進行】結果入力表!$B$9:$J$80,3,FALSE)","v":"宮本　一"},null,null,"氏名",{"$f":"VLOOKUP(AM73,●【進行】結果入力表!$B$9:$J$80,8,FALSE)","v":"鷲尾　隆杜"},null,null,null,null,{"$f":"VLOOKUP(AV73,●【進行】結果入力表!$B$9:$J$80,3,FALSE)","v":"鐵山　泰三"},null,null,"氏名",{"$f":"VLOOKUP(AV73,●【進行】結果入力表!$B$9:$J$80,8,FALSE)","v":"長谷川　進"},null,null,null,null,{"$f":"VLOOKUP(BE73,●【進行】結果入力表!$B$9:$J$80,3,FALSE)","v":0},null,null,"氏名",{"$f":"VLOOKUP(BE73,●【進行】結果入力表!$B$9:$J$80,8,FALSE)","v":0},null,null,null,null,{"$f":"VLOOKUP(BN73,●【進行】結果入力表!$B$9:$J$80,3,FALSE)","v":0},null,null,"氏名",{"$f":"VLOOKUP(BN73,●【進行】結果入力表!$B$9:$J$80,8,FALSE)","v":0}]
[null,null,null,null,"得点",null,null,null,null,null,null,null,null,"得点",null,null,null,null,null,null,null,null,"得点",null,null,null,null,null,null,null,null,"得点",null,null,null,null,null,null,null,null,"得点",null,null,null,null,null,null,null,null,"得点",null,null,null,null,null,null,null,null,"得点",null,null,null,null,null,null,null,null,"得点"]
[null,null,null,null,"HR",null,null,null,null,null,null,null,null,"HR",null,null,null,null,null,null,null,null,"HR",null,null,null,null,null,null,null,null,"HR",null,null,null,null,null,null,null,null,"HR",null,null,null,null,null,null,null,null,"HR",null,null,null,null,null,null,null,null,"HR",null,null,null,null,null,null,null,null,"HR"]
[]
[]
[null,{"$f":"●【結果】個人成績表!$A$1","v":"第8回　神奈滋対抗戦　　　(奈良；キングスポット)"},null,null,null,null,null,null,null,null,{"$f":"●【結果】個人成績表!$A$1","v":"第8回　神奈滋対抗戦　　　(奈良；キングスポット)"},null,null,null,null,null,null,null,null,{"$f":"●【結果】個人成績表!$A$1","v":"第8回　神奈滋対抗戦　　　(奈良；キングスポット)"},null,null,null,null,null,null,null,null,{"$f":"●【結果】個人成績表!$A$1","v":"第8回　神奈滋対抗戦　　　(奈良；キングスポット)"},null,null,null,null,null,null,null,null,{"$f":"●【結果】個人成績表!$A$1","v":"第8回　神奈滋対抗戦　　　(奈良；キングスポット)"},null,null,null,null,null,null,null,null,{"$f":"●【結果】個人成績表!$A$1","v":"第8回　神奈滋対抗戦　　　(奈良；キングスポット)"},null,null,null,null,null,null,null,null,{"$f":"●【結果】個人成績表!$A$1","v":"第8回　神奈滋対抗戦　　　(奈良；キングスポット)"},null,null,null,null,null,null,null,null,{"$f":"●【結果】個人成績表!$A$1","v":"第8回　神奈滋対抗戦　　　(奈良；キングスポット)"},null,null,null,null,null,null," "]
[]
[null,"G-No",{"$f":"●【進行】結果入力表!B65","v":43},null,null,"T-No",null,null,null,null,"G-No",{"$f":"●【進行】結果入力表!B66","v":44},null,null,"T-No",null,null,null,null,"G-No",{"$f":"●【進行】結果入力表!B67","v":45},null,null,"T-No",null,null,null,null,"G-No",{"$f":"●【進行】結果入力表!B68","v":46},null,null,"T-No",null,null,null,null,"G-No",{"$f":"●【進行】結果入力表!B69","v":47},null,null,"T-No",null,null,null,null,"G-No",{"$f":"●【進行】結果入力表!B70","v":48},null,null,"T-No",null,null,null,null,"G-No",{"$f":"●【進行】結果入力表!B71","v":""},null,null,"T-No",null,null,null,null,"G-No",{"$f":"●【進行】結果入力表!B72","v":""},null,null,"T-No"]
[]
[null,{"$f":"VLOOKUP(C83,●【進行】結果入力表!$B$9:$J$80,2,FALSE)","v":"兵庫"},null,null,"所属",{"$f":"VLOOKUP(C83,●【進行】結果入力表!$B$9:$J$80,9,FALSE)","v":"滋賀"},null,null,null,null,{"$f":"VLOOKUP(L83,●【進行】結果入力表!$B$9:$J$80,2,FALSE)","v":"兵庫"},null,null,"所属",{"$f":"VLOOKUP(L83,●【進行】結果入力表!$B$9:$J$80,9,FALSE)","v":"滋賀"},null,null,null,null,{"$f":"VLOOKUP(U83,●【進行】結果入力表!$B$9:$J$80,2,FALSE)","v":"兵庫"},null,null,"所属",{"$f":"VLOOKUP(U83,●【進行】結果入力表!$B$9:$J$80,9,FALSE)","v":"滋賀"},null,null,null,null,{"$f":"VLOOKUP(AD83,●【進行】結果入力表!$B$9:$J$80,2,FALSE)","v":"兵庫"},null,null,"所属",{"$f":"VLOOKUP(AD83,●【進行】結果入力表!$B$9:$J$80,9,FALSE)","v":"滋賀"},null,null,null,null,{"$f":"VLOOKUP(AM83,●【進行】結果入力表!$B$9:$J$80,2,FALSE)","v":"兵庫"},null,null,"所属",{"$f":"VLOOKUP(AM83,●【進行】結果入力表!$B$9:$J$80,9,FALSE)","v":"滋賀"},null,null,null,null,{"$f":"VLOOKUP(AV83,●【進行】結果入力表!$B$9:$J$80,2,FALSE)","v":"兵庫"},null,null,"所属",{"$f":"VLOOKUP(AV83,●【進行】結果入力表!$B$9:$J$80,9,FALSE)","v":"滋賀"},null,null,null,null,{"$f":"VLOOKUP(BE83,●【進行】結果入力表!$B$9:$J$80,2,FALSE)","v":"兵庫"},null,null,"所属",{"$f":"VLOOKUP(BE83,●【進行】結果入力表!$B$9:$J$80,9,FALSE)","v":"奈良"},null,null,null,null,{"$f":"VLOOKUP(BN83,●【進行】結果入力表!$B$9:$J$80,2,FALSE)","v":"兵庫"},null,null,"所属",{"$f":"VLOOKUP(BN83,●【進行】結果入力表!$B$9:$J$80,9,FALSE)","v":"奈良"}]
[null,{"$f":"VLOOKUP(C83,●【進行】結果入力表!$B$9:$J$80,3,FALSE)","v":"中尾　亮太"},null,null,"氏名",{"$f":"VLOOKUP(C83,●【進行】結果入力表!$B$9:$J$80,8,FALSE)","v":"御手洗　茂"},null,null,null,null,{"$f":"VLOOKUP(L83,●【進行】結果入力表!$B$9:$J$80,3,FALSE)","v":"平井　洸志"},null,null,"氏名",{"$f":"VLOOKUP(L83,●【進行】結果入力表!$B$9:$J$80,8,FALSE)","v":"高島　太一"},null,null,null,null,{"$f":"VLOOKUP(U83,●【進行】結果入力表!$B$9:$J$80,3,FALSE)","v":"堂園　雅也"},null,null,"氏名",{"$f":"VLOOKUP(U83,●【進行】結果入力表!$B$9:$J$80,8,FALSE)","v":"大橋　義治"},null,null,null,null,{"$f":"VLOOKUP(AD83,●【進行】結果入力表!$B$9:$J$80,3,FALSE)","v":"藤中　健太郎"},null,null,"氏名",{"$f":"VLOOKUP(AD83,●【進行】結果入力表!$B$9:$J$80,8,FALSE)","v":"大橋　正寛"},null,null,null,null,{"$f":"VLOOKUP(AM83,●【進行】結果入力表!$B$9:$J$80,3,FALSE)","v":"宮本　一"},null,null,"氏名",{"$f":"VLOOKUP(AM83,●【進行】結果入力表!$B$9:$J$80,8,FALSE)","v":"西峰　久祐"},null,null,null,null,{"$f":"VLOOKUP(AV83,●【進行】結果入力表!$B$9:$J$80,3,FALSE)","v":"鐵山　泰三"},null,null,"氏名",{"$f":"VLOOKUP(AV83,●【進行】結果入力表!$B$9:$J$80,8,FALSE)","v":"山中　康寛"},null,null,null,null,{"$f":"VLOOKUP(BE83,●【進行】結果入力表!$B$9:$J$80,3,FALSE)","v":0},null,null,"氏名",{"$f":"VLOOKUP(BE83,●【進行】結果入力表!$B$9:$J$80,8,FALSE)","v":0},null,null,null,null,{"$f":"VLOOKUP(BN83,●【進行】結果入力表!$B$9:$J$80,3,FALSE)","v":0},null,null,"氏名",{"$f":"VLOOKUP(BN83,●【進行】結果入力表!$B$9:$J$80,8,FALSE)","v":0}]
[null,null,null,null,"得点",null,null,null,null,null,null,null,null,"得点",null,null,null,null,null,null,null,null,"得点",null,null,null,null,null,null,null,null,"得点",null,null,null,null,null,null,null,null,"得点",null,null,null,null,null,null,null,null,"得点",null,null,null,null,null,null,null,null,"得点",null,null,null,null,null,null,null,null,"得点"]
[null,null,null,null,"HR",null,null,null,null,null,null,null,null,"HR",null,null,null,null,null,null,null,null,"HR",null,null,null,null,null,null,null,null,"HR",null,null,null,null,null,null,null,null,"HR",null,null,null,null,null,null,null,null,"HR",null,null,null,null,null,null,null,null,"HR",null,null,null,null,null,null,null,null,"HR"]
[]
[]
[null,{"$f":"●【結果】個人成績表!$A$1","v":"第8回　神奈滋対抗戦　　　(奈良；キングスポット)"},null,null,null,null,null,null,null,null,{"$f":"●【結果】個人成績表!$A$1","v":"第8回　神奈滋対抗戦　　　(奈良；キングスポット)"},null,null,null,null,null,null,null,null,{"$f":"●【結果】個人成績表!$A$1","v":"第8回　神奈滋対抗戦　　　(奈良；キングスポット)"},null,null,null,null,null,null,null,null,{"$f":"●【結果】個人成績表!$A$1","v":"第8回　神奈滋対抗戦　　　(奈良；キングスポット)"},null,null,null,null,null,null,null,null,{"$f":"●【結果】個人成績表!$A$1","v":"第8回　神奈滋対抗戦　　　(奈良；キングスポット)"},null,null,null,null,null,null,null,null,{"$f":"●【結果】個人成績表!$A$1","v":"第8回　神奈滋対抗戦　　　(奈良；キングスポット)"},null,null,null,null,null,null,null,null,{"$f":"●【結果】個人成績表!$A$1","v":"第8回　神奈滋対抗戦　　　(奈良；キングスポット)"},null,null,null,null,null,null,null,null,{"$f":"●【結果】個人成績表!$A$1","v":"第8回　神奈滋対抗戦　　　(奈良；キングスポット)"},null,null,null,null,null,null," "]
[]
[null,"G-No",{"$f":"●【進行】結果入力表!B73","v":49},null,null,"T-No",null,null,null,null,"G-No",{"$f":"●【進行】結果入力表!B74","v":50},null,null,"T-No",null,null,null,null,"G-No",{"$f":"●【進行】結果入力表!B75","v":51},null,null,"T-No",null,null,null,null,"G-No",{"$f":"●【進行】結果入力表!B76","v":52},null,null,"T-No",null,null,null,null,"G-No",{"$f":"●【進行】結果入力表!B77","v":53},null,null,"T-No",null,null,null,null,"G-No",{"$f":"●【進行】結果入力表!B78","v":54},null,null,"T-No",null,null,null,null,"G-No",{"$f":"●【進行】結果入力表!B79","v":""},null,null,"T-No",null,null,null,null,"G-No",{"$f":"●【進行】結果入力表!B80","v":""},null,null,"T-No"]
[]
[null,{"$f":"VLOOKUP(C93,●【進行】結果入力表!$B$9:$J$80,2,FALSE)","v":"滋賀"},null,null,"所属",{"$f":"VLOOKUP(C93,●【進行】結果入力表!$B$9:$J$80,9,FALSE)","v":"奈良"},null,null,null,null,{"$f":"VLOOKUP(L93,●【進行】結果入力表!$B$9:$J$80,2,FALSE)","v":"滋賀"},null,null,"所属",{"$f":"VLOOKUP(L93,●【進行】結果入力表!$B$9:$J$80,9,FALSE)","v":"奈良"},null,null,null,null,{"$f":"VLOOKUP(U93,●【進行】結果入力表!$B$9:$J$80,2,FALSE)","v":"滋賀"},null,null,"所属",{"$f":"VLOOKUP(U93,●【進行】結果入力表!$B$9:$J$80,9,FALSE)","v":"奈良"},null,null,null,null,{"$f":"VLOOKUP(AD93,●【進行】結果入力表!$B$9:$J$80,2,FALSE)","v":"滋賀"},null,null,"所属",{"$f":"VLOOKUP(AD93,●【進行】結果入力表!$B$9:$J$80,9,FALSE)","v":"奈良"},null,null,null,null,{"$f":"VLOOKUP(AM93,●【進行】結果入力表!$B$9:$J$80,2,FALSE)","v":"滋賀"},null,null,"所属",{"$f":"VLOOKUP(AM93,●【進行】結果入力表!$B$9:$J$80,9,FALSE)","v":"奈良"},null,null,null,null,{"$f":"VLOOKUP(AV93,●【進行】結果入力表!$B$9:$J$80,2,FALSE)","v":"滋賀"},null,null,"所属",{"$f":"VLOOKUP(AV93,●【進行】結果入力表!$B$9:$J$80,9,FALSE)","v":"奈良"},null,null,null,null,{"$f":"VLOOKUP(BE93,●【進行】結果入力表!$B$9:$J$80,2,FALSE)","v":"兵庫"},null,null,"所属",{"$f":"VLOOKUP(BE93,●【進行】結果入力表!$B$9:$J$80,9,FALSE)","v":"奈良"},null,null,null,null,{"$f":"VLOOKUP(BN93,●【進行】結果入力表!$B$9:$J$80,2,FALSE)","v":"兵庫"},null,null,"所属",{"$f":"VLOOKUP(BN93,●【進行】結果入力表!$B$9:$J$80,9,FALSE)","v":"奈良"}]
[null,{"$f":"VLOOKUP(C93,●【進行】結果入力表!$B$9:$J$80,3,FALSE)","v":"御手洗　茂"},null,null,"氏名",{"$f":"VLOOKUP(C93,●【進行】結果入力表!$B$9:$J$80,8,FALSE)","v":"田尻　哲司"},null,null,null,null,{"$f":"VLOOKUP(L93,●【進行】結果入力表!$B$9:$J$80,3,FALSE)","v":"高島　太一"},null,null,"氏名",{"$f":"VLOOKUP(L93,●【進行】結果入力表!$B$9:$J$80,8,FALSE)","v":"吉向　翔平"},null,null,null,null,{"$f":"VLOOKUP(U93,●【進行】結果入力表!$B$9:$J$80,3,FALSE)","v":"大橋　義治"},null,null,"氏名",{"$f":"VLOOKUP(U93,●【進行】結果入力表!$B$9:$J$80,8,FALSE)","v":"巽　大地"},null,null,null,null,{"$f":"VLOOKUP(AD93,●【進行】結果入力表!$B$9:$J$80,3,FALSE)","v":"大橋　正寛"},null,null,"氏名",{"$f":"VLOOKUP(AD93,●【進行】結果入力表!$B$9:$J$80,8,FALSE)","v":"山田　晃司"},null,null,null,null,{"$f":"VLOOKUP(AM93,●【進行】結果入力表!$B$9:$J$80,3,FALSE)","v":"西峰　久祐"},null,null,"氏名",{"$f":"VLOOKUP(AM93,●【進行】結果入力表!$B$9:$J$80,8,FALSE)","v":"鷲尾　隆杜"},null,null,null,null,{"$f":"VLOOKUP(AV93,●【進行】結果入力表!$B$9:$J$80,3,FALSE)","v":"山中　康寛"},null,null,"氏名",{"$f":"VLOOKUP(AV93,●【進行】結果入力表!$B$9:$J$80,8,FALSE)","v":"長谷川　進"},null,null,null,null,{"$f":"VLOOKUP(BE93,●【進行】結果入力表!$B$9:$J$80,3,FALSE)","v":0},null,null,"氏名",{"$f":"VLOOKUP(BE93,●【進行】結果入力表!$B$9:$J$80,8,FALSE)","v":0},null,null,null,null,{"$f":"VLOOKUP(BN93,●【進行】結果入力表!$B$9:$J$80,3,FALSE)","v":0},null,null,"氏名",{"$f":"VLOOKUP(BN93,●【進行】結果入力表!$B$9:$J$80,8,FALSE)","v":0}]
[null,null,null,null,"得点",null,null,null,null,null,null,null,null,"得点",null,null,null,null,null,null,null,null,"得点",null,null,null,null,null,null,null,null,"得点",null,null,null,null,null,null,null,null,"得点",null,null,null,null,null,null,null,null,"得点",null,null,null,null,null,null,null,null,"得点",null,null,null,null,null,null,null,null,"得点"]
[null,null,null,null,"HR",null,null,null,null,null,null,null,null,"HR",null,null,null,null,null,null,null,null,"HR",null,null,null,null,null,null,null,null,"HR",null,null,null,null,null,null,null,null,"HR",null,null,null,null,null,null,null,null,"HR",null,null,null,null,null,null,null,null,"HR",null,null,null,null,null,null,null,null,"HR"]

{"sheet":"Sheet1","index":7,"n_rows":32,"n_cols":16,"rows_kept":32,"cut":false,"hidden":false,"merged":[]}
[null,null,"3チーム",null,"1節",null,null,null,null,"4チーム",null,"1節"]
[null,null,null,null,"2節","2節","2節",null,null,null,null,null,"2節","2節","2節"]
[null,null,null,null,"3節",null,"3節","3節",null,null,null,null,null,"3節","3節","3節"]
[null,null,"5名",null,1,2,3,5,null,"5名",null,1,2,3,4,5]
[null,null,null,null,2,3,4,1,null,null,null,2,3,4,5,1]
[null,null,null,null,3,4,5,2,null,null,null,3,4,5,1,2]
[null,null,null,null,4,5,1,3,null,null,null,4,5,1,2,3]
[null,null,null,null,5,1,2,4,null,null,null,5,1,2,3,4]
[]
[null,null,"6名",null,1,2,3,5,null,"6名",null,1,2,3,null,5]
[null,null,null,null,2,3,4,6,null,null,null,2,3,4,null,6]
[null,null,null,null,3,4,5,1,null,null,null,3,4,5,null,1]
[null,null,null,null,4,5,6,2,null,null,null,4,5,6,null,2]
[null,null,null,null,5,6,1,3,null,null,null,5,6,1,null,3]
[null,null,null,null,6,1,2,4,null,null,null,6,1,2,null,4]
[]
[null,null,"7名",null,1,2,3,5,null,"7名",null,1,2,3,null,5]
[null,null,null,null,2,3,4,6,null,null,null,2,3,4,null,6]
[null,null,null,null,3,4,5,7,null,null,null,3,4,5,null,7]
[null,null,null,null,4,5,6,1,null,null,null,4,5,6,null,1]
[null,null,null,null,5,6,7,2,null,null,null,5,6,7,null,2]
[null,null,null,null,6,7,1,3,null,null,null,6,7,1,null,3]
[null,null,null,null,7,1,2,4,null,null,null,7,1,2,null,4]
[]
[null,null,"8名",null,1,2,3,5,null,"8名",null,1,2,3,null,5]
[null,null,null,null,2,3,4,6,null,null,null,2,3,4,null,6]
[null,null,null,null,3,4,5,7,null,null,null,3,4,5,null,7]
[null,null,null,null,4,5,6,8,null,null,null,4,5,6,null,8]
[null,null,null,null,5,6,7,1,null,null,null,5,6,7,null,1]
[null,null,null,null,6,7,8,2,null,null,null,6,7,8,null,2]
[null,null,null,null,7,8,1,3,null,null,null,7,8,1,null,3]
[null,null,null,null,8,1,2,4,null,null,null,8,1,2,null,4]