{"text_format":"1","workbook":"xlsx","n_sheets":6,"sheets":["取扱説明","☆登録touroku","★運営カードcard","進行表shinko","▲成績表seiseki","★(空欄)成績表seiseki"],"not_rendered":{"charts":0,"images":0,"macros":1,"external_links":0,"defined_names":11,"comments":0,"pivot_tables":0},"unopened":[],"bounds":{"document_bytes":16777216,"sheet_cells":100000,"rows_first":2000,"rows_last":500,"rows_between":2000,"halvings":0,"cell_chars":16384,"cell_head_chars":4096},"cells_cut":0,"cells_raw":0,"read":"whole","date_system":"1900"}

{"sheet":"取扱説明","index":0,"n_rows":44,"n_cols":13,"rows_kept":44,"cut":false,"hidden":false,"merged":[]}
[]
[null,"【取扱説明】",null,null,null,null,null,null,null,null,null,"ver.1.6改","by：にんにん"]
[]
[]
[null,"◆","登録"]
[null,null,"まずはじめに、登録シートの表内の白抜きの欄を入力してください。"]
[null,null,"　（対抗戦名、開催日を入力し、会場、基準点、各チーム名と選手名をプルダウンメニューから選んでください。）"]
[null,null,"女子のハンデにも対応しました。（ハンデ者はチーム一覧から”△”を選択してください。）"]
[null,null,"会場、基準点、各チーム名と選手名は新たにプルダウンメニューから選択出来る様にしました。又基準点も変更出来ます。"]
[null,null,"注）同姓同名の場合は違う名前にして登録お願いします。"]
[null,null,"　　例）　山田太郎A　山田太郎B"]
[]
[null,"◆","運営カード"]
[null,null,"運営カードシートで運営カードを印刷してください。"]
[null,null,"A6またはハガキサイズで印刷されます。（offes２００７は大丈夫ですが、２０１３はページがうまくいかないみたい？）"]
[]
[null,"◆","進行表"]
[null,null,"終了した試合の運営カードから、進行表シートに試合結果を入力して下さい。"]
[null,null,"勝者は半角小文字\"w\"、敗者は得点を入力。（半角大文字\"W\"、全角小文字\"ｗ\"、全角大文字\"Ｗ\"は自動で半角小文字に変換）"]
[null,null,"新たにHRを入力出来る様にし、成績表に反映されます。"]
[null,null,"敗者側のスコアを入力後、相手側に”ｗ”が自動表示されます。"]
[null,null,"得点だけを全クリア「Ctrl＋ｆ」"]
[]
[null,"◆","成績表"]
[null,"対戦結果等は成績表シートに自動で入力されます。"]
[null,"各選手のHRはシート左下の欄に自動表示します。HR表示ボタンにて対応"]
[null,"また、MVP、VP、HRの各賞対象者を右上の欄に自動表示します。"]
[null,"MVP、VPは「W数多い＞TP多い（ハンデに対応）＞総失点少ない(”W”を除いた合計、又失点のハンデは未対応)」で判定"]
[null,"同率の場合は手入力でお願いします。"]
[]
[null,null,"女子のハンデにも対応しました。（成績表のＴＰの内訳は、横合計＊180/140　　\"Ｗ\"はハンデ点とします。）"]
[null,null,"例）"]
[null,null,"花子　△","（ハンデ者）","Ｗ　　100","Ｗ　　50","　　→","（140＋100＋140＋50）＊180/140＝552点　（小数点以下切り捨て）"]
[null,null,"太郎",null,"Ｗ　　100","Ｗ　　50","　　→","（180＋100＋180＋50）＊180/180＝510点　（小数点以下切り捨て）"]
[]
[null,"◆","シートの保護"]
[null,null,"保護を解除したい時は　リボン＞校閲＞変更の　シートの解除　"]
[]
[null,"◆","緑色の小さな▲が出る場合"]
[null,null,"excelのオプション＞数式＞エラーチェック＞バックグラウンドでエラーチェックを行う　チェック外す"]
[]
[null,"◆","マクロを使用しています。マクロを有効にして下さい。"]
[null,null,"毎回マクロを有効にするのが手間ならば（このファイルがある場所がディスクトップの場合）"]
[null,null,"excelのオプション＞セキュリティセンター＞セキュリティセンターの設定＞信頼できる場所＞新しい場所の追加＞参照＞ディスクトップ　OK＞OK"]

{"sheet":"☆登録touroku","index":1,"n_rows":61,"n_cols":25,"rows_kept":61,"cut":false,"hidden":false,"merged":[[10,1,10,4],[12,2,12,4],[14,2,14,4],[9,2,9,3]]}
[]
[null,"対抗戦名、開催日を入力して下さい。"]
[null,"会場、勝ゲーム点、チーム名、選手名を選択して下さい。"]
[null,"（ハンデ点、持ち点は自動表示されます。）"]
[]
[null,"セルを選択後▼が表示されてから、\"Alt+↓\"で"]
[null,"　表示されるリストから、↑↓キーで選択しEnterキーで決定して下さい。"]
[null,"　選択時に先頭「Home」へ、末尾「End」で移動します。"]
[]
[null,null,"対 抗 戦 名"]
[null,"第1回　和奈対抗戦"]
[]
[null,"開催日","2016-09-25"]
[]
[null,"会　場","オーシャンドリーム"]
[]
[null,"勝ゲーム点",180,"点（基準点）",{"$f":"IF($C$17=\"\",\"\",INDEX($F$36:$G$39,MATCH($C$17,$F$36:$F$39,0),2))","v":140},"点（ハンデ点）"]
[]
[null,null,"選手名",null,"選手名"]
[null,"チーム名","奈良","持ち点","和歌山","持ち点"]
[null,"選手1","斉藤　裕児",{"$f":"IF($C$20=\"大阪\",IF($C21=\"\",\"\",IF(INDEX($I$36:$J$65,MATCH($C21,$I$36:$I$65,0),2)=\"△\",$E$17,$C$17)),IF($C$20=\"京都\",IF($C21=\"\",\"\",IF(INDEX($L$36:$M$65,MATCH($C21,$L$36:$L$65,0),2)=\"△\",$E$17,$C$17)),IF($C$20=\"兵庫\",IF($C21=\"\",\"\",IF(INDEX($O$36:$P$65,MATCH($C21,$O$36:$O$65,0),2)=\"△\",$E$17,$C$17)),IF($C$20=\"滋賀\",IF($C21=\"\",\"\",IF(INDEX($R$36:$S$65,MATCH($C21,$R$36:$R$65,0),2)=\"△\",$E$17,$C$17)),IF($C$20=\"奈良\",IF($C21=\"\",\"\",IF(INDEX($U$36:$V$65,MATCH($C21,$U$36:$U$65,0),2)=\"△\",$E$17,$C$17)),IF($C$20=\"和歌山\",IF($C21=\"\",\"\",IF(INDEX($X$36:$Y$65,MATCH($C21,$X$36:$X$65,0),2)=\"△\",$E$17,$C$17)),\"\"))))))","v":180},"森田　憲",{"$f":"IF($E$20=\"大阪\",IF($E21=\"\",\"\",IF(INDEX($I$36:$J$65,MATCH($E21,$I$36:$I$65,0),2)=\"△\",$E$17,$C$17)),IF($E$20=\"京都\",IF($E21=\"\",\"\",IF(INDEX($L$36:$M$65,MATCH($E21,$L$36:$L$65,0),2)=\"△\",$E$17,$C$17)),IF($E$20=\"兵庫\",IF($E21=\"\",\"\",IF(INDEX($O$36:$P$65,MATCH($E21,$O$36:$O$65,0),2)=\"△\",$E$17,$C$17)),IF($E$20=\"滋賀\",IF($E21=\"\",\"\",IF(INDEX($R$36:$S$65,MATCH($E21,$R$36:$R$65,0),2)=\"△\",$E$17,$C$17)),IF($E$20=\"奈良\",IF($E21=\"\",\"\",IF(INDEX($U$36:$V$65,MATCH($E21,$U$36:$U$65,0),2)=\"△\",$E$17,$C$17)),IF($E$20=\"和歌山\",IF($E21=\"\",\"\",IF(INDEX($X$36:$Y$65,MATCH($E21,$X$36:$X$65,0),2)=\"△\",$E$17,$C$17)),\"\"))))))","v":180}]
[null,"選手2","近藤　拓馬",{"$f":"IF($C$20=\"大阪\",IF($C22=\"\",\"\",IF(INDEX($I$36:$J$65,MATCH($C22,$I$36:$I$65,0),2)=\"△\",$E$17,$C$17)),IF($C$20=\"京都\",IF($C22=\"\",\"\",IF(INDEX($L$36:$M$65,MATCH($C22,$L$36:$L$65,0),2)=\"△\",$E$17,$C$17)),IF($C$20=\"兵庫\",IF($C22=\"\",\"\",IF(INDEX($O$36:$P$65,MATCH($C22,$O$36:$O$65,0),2)=\"△\",$E$17,$C$17)),IF($C$20=\"滋賀\",IF($C22=\"\",\"\",IF(INDEX($R$36:$S$65,MATCH($C22,$R$36:$R$65,0),2)=\"△\",$E$17,$C$17)),IF($C$20=\"奈良\",IF($C22=\"\",\"\",IF(INDEX($U$36:$V$65,MATCH($C22,$U$36:$U$65,0),2)=\"△\",$E$17,$C$17)),IF($C$20=\"和歌山\",IF($C22=\"\",\"\",IF(INDEX($X$36:$Y$65,MATCH($C22,$X$36:$X$65,0),2)=\"△\",$E$17,$C$17)),\"\"))))))","v":180},"杉本　博章",{"$f":"IF($E$20=\"大阪\",IF($E22=\"\",\"\",IF(INDEX($I$36:$J$65,MATCH($E22,$I$36:$I$65,0),2)=\"△\",$E$17,$C$17)),IF($E$20=\"京都\",IF($E22=\"\",\"\",IF(INDEX($L$36:$M$65,MATCH($E22,$L$36:$L$65,0),2)=\"△\",$E$17,$C$17)),IF($E$20=\"兵庫\",IF($E22=\"\",\"\",IF(INDEX($O$36:$P$65,MATCH($E22,$O$36:$O$65,0),2)=\"△\",$E$17,$C$17)),IF($E$20=\"滋賀\",IF($E22=\"\",\"\",IF(INDEX($R$36:$S$65,MATCH($E22,$R$36:$R$65,0),2)=\"△\",$E$17,$C$17)),IF($E$20=\"奈良\",IF($E22=\"\",\"\",IF(INDEX($U$36:$V$65,MATCH($E22,$U$36:$U$65,0),2)=\"△\",$E$17,$C$17)),IF($E$20=\"和歌山\",IF($E22=\"\",\"\",IF(INDEX($X$36:$Y$65,MATCH($E22,$X$36:$X$65,0),2)=\"△\",$E$17,$C$17)),\"\"))))))","v":180}]
[null,"選手3","吉向　翔平",180,"丹次　力良",{"$f":"IF($E$20=\"大阪\",IF($E23=\"\",\"\",IF(INDEX($I$36:$J$65,MATCH($E23,$I$36:$I$65,0),2)=\"△\",$E$17,$C$17)),IF($E$20=\"京都\",IF($E23=\"\",\"\",IF(INDEX($L$36:$M$65,MATCH($E23,$L$36:$L$65,0),2)=\"△\",$E$17,$C$17)),IF($E$20=\"兵庫\",IF($E23=\"\",\"\",IF(INDEX($O$36:$P$65,MATCH($E23,$O$36:$O$65,0),2)=\"△\",$E$17,$C$17)),IF($E$20=\"滋賀\",IF($E23=\"\",\"\",IF(INDEX($R$36:$S$65,MATCH($E23,$R$36:$R$65,0),2)=\"△\",$E$17,$C$17)),IF($E$20=\"奈良\",IF($E23=\"\",\"\",IF(INDEX($U$36:$V$65,MATCH($E23,$U$36:$U$65,0),2)=\"△\",$E$17,$C$17)),IF($E$20=\"和歌山\",IF($E23=\"\",\"\",IF(INDEX($X$36:$Y$65,MATCH($E23,$X$36:$X$65,0),2)=\"△\",$E$17,$C$17)),\"\"))))))","v":180}]
[null,"選手4","白戸　玲人",180,"和田宗一郎",180]
[null,"選手5","山田　晋之",180,"中本　雅大",180]
[null,"選手6","山田　晃司",180,"末岡　修",180]
[null,"選手7","宮野　早織",140,"松房ゆかり",140]
[]
[]
[]
[]
[null,"注）チームリストは変更出来ません。",null,null,null,null,null,null,"■チーム別一覧表（ハンデ者には”△”を選択してください。）"]
[]
[]
[null,"チームリスト",null,"会　場",null,"基準点","ハンデ点",null,"大阪","ハンデ",null,"京都","ハンデ",null,"兵庫","ハンデ",null,"滋賀","ハンデ",null,"奈良","ハンデ",null,"和歌山","ハンデ"]
[null,"大阪",null,"トップガン",null,180,140,null,"山岡　修二",null,null,"植田　幸司",null,null,"菊川　博功",null,null,"山中　康寛",null,null,"白戸　玲人",null,null,"杉本　博章"]
[null,"京都",null,"キングスポット",null,120,100,null,"村上　泰辰",null,null,"小山　久博",null,null,"堂園　雅也",null,null,"大橋　義治",null,null,"近藤　拓馬",null,null,"末岡　修"]
[null,"兵庫",null,"プールギャング",null,null,null,null,"吉岡　保俊",null,null,"加藤　秀万",null,null,"白澤雄一郎",null,null,"長田　智紀",null,null,"林　隆行",null,null,"和田宗一郎"]
[null,"滋賀",null,"オーシャンドリーム",null,null,null,null,"小森　雅昭　",null,null,"藤本　悟史",null,null,"牛尾　貴之",null,null,"高島　太一",null,null,"金澤　茂昌",null,null,"阿河　直人"]
[null,"奈良",null,null,null,null,null,null,"北村　勇気",null,null,"早川　疏",null,null,"長井　充",null,null,"西峰　久祐",null,null,"斉藤　大輔",null,null,"松房ゆかり","△"]
[null,"和歌山",null,null,null,null,null,null,"河本　一典",null,null,"若松　雄造",null,null,"平井　洸志",null,null,"秋田　倫央",null,null,"植田　慎也",null,null,"中本　雅大"]
[null,null,null,null,null,null,null,null,"野村　宗司",null,null,"森田由佳里","△",null,"栃下　恭子","△",null,"山本小百合","△",null,"宮野　早織","△",null,"森田　憲"]
[null,null,null,null,null,null,null,null,"中川　典久",null,null,"田中　正",null,null,"高山　普任",null,null,"井上　友紀","△",null,"吉向　翔平",null,null,"芝崎　泰生"]
[null,null,null,null,null,null,null,null,"山崎　真紀子","△",null,"平田　正司",null,null,"土井本　紀彦",null,null,"須藤　浩章",null,null,"長谷川　進",null,null,"脇　真一郎"]
[null,null,null,null,null,null,null,null,"安田　純華","△",null,"金沢　亘",null,null,"鈴木　勇介",null,null,"藤田　元気",null,null,"斉藤　裕児",null,null,"丹次　力良"]
[null,null,null,null,null,null,null,null,"上栄　忍","△",null,"菊池　靖正",null,null,"大島　知幸",null,null,null,null,null,"鷲尾　隆杜",null,null,"小山よしお"]
[null,null,null,null,null,null,null,null,"乾　伸綱",null,null,"石川　政広",null,null,"中平　美輪",null,null,null,null,null,"山田　晋之",null,null,"岸上　賢一"]
[null,null,null,null,null,null,null,null,"森山　博紀",null,null,"佐藤　雄吾",null,null,"河内　恵里",null,null,null,null,null,"水田　賢宏"]
[null,null,null,null,null,null,null,null,"松居　勝巳",null,null,"折戸　和幸",null,null,"南　眞任",null,null,null,null,null,"岩本　剛"]
[null,null,null,null,null,null,null,null,"渡邊　孝行",null,null,"松好　太一",null,null,"後藤　拓磨",null,null,null,null,null,"山田　晃司"]
[null,null,null,null,null,null,null,null,null,null,null,"山下　直生",null,null,null,null,null,null,null,null,"谷野　晋平"]
[null,null,null,null,null,null,null,null,null,null,null,"伊庭　保久"]
[null,null,null,null,null,null,null,null,null,null,null,"渡辺　満"]
[null,null,null,null,null,null,null,null,null,null,null,"伊藤　修平"]
[null,null,null,null,null,null,null,null,null,null,null,"阿部　和大"]
[null,null,null,null,null,null,null,null,null,null,null,"上倉　淑敬"]
[null,null,null,null,null,null,null,null,null,null,null,"今村　哲也"]
[null,null,null,null,null,null,null,null,null,null,null,"小堀　泰次郎"]
[null,null,null,null,null,null,null,null,null,null,null,"三木　敏裕"]
[null,null,null,null,null,null,null,null,null,null,null,"高田　裕司"]
[null,null,null,null,null,null,null,null,null,null,null,"川田　準樹"]

{"sheet":"★運営カードcard","index":2,"n_rows":103,"n_cols":15,"rows_kept":103,"cut":false,"hidden":false,"merged":[]}
[]
[null,"１－１","No.",null,null,"１－２","No.",null,null,"１－３","No.",null,null,"１－４","No."]
[null,{"$f":"▲成績表seiseki!C10","v":"斉藤　裕児"},{"$f":"▲成績表seiseki!C15","v":"森田　憲"},null,null,{"$f":"▲成績表seiseki!D10","v":"近藤　拓馬"},{"$f":"▲成績表seiseki!D15","v":"杉本　博章"},null,null,{"$f":"▲成績表seiseki!E10","v":"吉向　翔平"},{"$f":"▲成績表seiseki!E15","v":"丹次　力良"},null,null,{"$f":"▲成績表seiseki!F10","v":"白戸　玲人"},{"$f":"▲成績表seiseki!F15","v":"和田宗一郎"}]
[null,{"$f":"☆登録touroku!C20","v":"奈良"},{"$f":"☆登録touroku!E20","v":"和歌山"},null,null,{"$f":"$B$4","v":"奈良"},{"$f":"$C$4","v":"和歌山"},null,null,{"$f":"$B$4","v":"奈良"},{"$f":"$C$4","v":"和歌山"},null,null,{"$f":"$B$4","v":"奈良"},{"$f":"$C$4","v":"和歌山"}]
[]
[null,"HR","HR",null,null,"HR","HR",null,null,"HR","HR",null,null,"HR","HR"]
[null,"レフリー",null,null,null,"レフリー",null,null,null,"レフリー",null,null,null,"レフリー"]
[]
[]
[null,"１－５","No.",null,null,"１－６","No.",null,null,"１－７","No.",null,null,"２－１","No."]
[null,{"$f":"▲成績表seiseki!G10","v":"山田　晋之"},{"$f":"▲成績表seiseki!G15","v":"中本　雅大"},null,null,{"$f":"▲成績表seiseki!H10","v":"山田　晃司"},{"$f":"▲成績表seiseki!H15","v":"末岡　修"},null,null,{"$f":"▲成績表seiseki!I10","v":"宮野　早織"},{"$f":"▲成績表seiseki!I15","v":"松房ゆかり"},null,null,{"$f":"▲成績表seiseki!M10","v":"斉藤　裕児"},{"$f":"▲成績表seiseki!M15","v":"杉本　博章"}]
[null,{"$f":"$B$4","v":"奈良"},{"$f":"$C$4","v":"和歌山"},null,null,{"$f":"$B$4","v":"奈良"},{"$f":"$C$4","v":"和歌山"},null,null,{"$f":"$B$4","v":"奈良"},{"$f":"$C$4","v":"和歌山"},null,null,{"$f":"$B$4","v":"奈良"},{"$f":"$C$4","v":"和歌山"}]
[]
[null,"HR","HR",null,null,"HR","HR",null,null,"HR","HR",null,null,"HR","HR"]
[null,"レフリー",null,null,null,"レフリー",null,null,null,"レフリー",null,null,null,"レフリー"]
[]
[]
[null,"２－２","No.",null,null,"２－３","No.",null,null,"２－４","No.",null,null,"２－５","No."]
[null,{"$f":"▲成績表seiseki!N10","v":"近藤　拓馬"},{"$f":"▲成績表seiseki!N15","v":"丹次　力良"},null,null,{"$f":"▲成績表seiseki!O10","v":"吉向　翔平"},{"$f":"▲成績表seiseki!O15","v":"和田宗一郎"},null,null,{"$f":"▲成績表seiseki!P10","v":"白戸　玲人"},{"$f":"▲成績表seiseki!P15","v":"中本　雅大"},null,null,{"$f":"▲成績表seiseki!Q10","v":"山田　晋之"},{"$f":"▲成績表seiseki!Q15","v":"末岡　修"}]
[null,{"$f":"$B$4","v":"奈良"},{"$f":"$C$4","v":"和歌山"},null,null,{"$f":"$B$4","v":"奈良"},{"$f":"$C$4","v":"和歌山"},null,null,{"$f":"$B$4","v":"奈良"},{"$f":"$C$4","v":"和歌山"},null,null,{"$f":"$B$4","v":"奈良"},{"$f":"$C$4","v":"和歌山"}]
[]
[null,"HR","HR",null,null,"HR","HR",null,null,"HR","HR",null,null,"HR","HR"]
[null,"レフリー",null,null,null,"レフリー",null,null,null,"レフリー",null,null,null,"レフリー"]
[]
[]
[null,"２－６","No.",null,null,"２－７","No.",null,null,"３－１","No.",null,null,"３－２","No."]
[null,{"$f":"▲成績表seiseki!R10","v":"山田　晃司"},{"$f":"▲成績表seiseki!R15","v":"松房ゆかり"},null,null,{"$f":"▲成績表seiseki!S10","v":"宮野　早織"},{"$f":"▲成績表seiseki!S15","v":"森田　憲"},null,null,{"$f":"▲成績表seiseki!W10","v":"斉藤　裕児"},{"$f":"▲成績表seiseki!W15","v":"丹次　力良"},null,null,{"$f":"▲成績表seiseki!X10","v":"近藤　拓馬"},{"$f":"▲成績表seiseki!X15","v":"和田宗一郎"}]
[null,{"$f":"$B$4","v":"奈良"},{"$f":"$C$4","v":"和歌山"},null,null,{"$f":"$B$4","v":"奈良"},{"$f":"$C$4","v":"和歌山"},null,null,{"$f":"$B$4","v":"奈良"},{"$f":"$C$4","v":"和歌山"},null,null,{"$f":"$B$4","v":"奈良"},{"$f":"$C$4","v":"和歌山"}]
[]
[null,"HR","HR",null,null,"HR","HR",null,null,"HR","HR",null,null,"HR","HR"]
[null,"レフリー",null,null,null,"レフリー",null,null,null,"レフリー",null,null,null,"レフリー"]
[]
[]
[null,"３－３","No.",null,null,"３－４","No.",null,null,"３－５","No.",null,null,"３－６","No."]
[null,{"$f":"▲成績表seiseki!Y10","v":"吉向　翔平"},{"$f":"▲成績表seiseki!Y15","v":"中本　雅大"},null,null,{"$f":"▲成績表seiseki!Z10","v":"白戸　玲人"},{"$f":"▲成績表seiseki!Z15","v":"末岡　修"},null,null,{"$f":"▲成績表seiseki!AA10","v":"山田　晋之"},{"$f":"▲成績表seiseki!AA15","v":"松房ゆかり"},null,null,{"$f":"▲成績表seiseki!AB10","v":"山田　晃司"},{"$f":"▲成績表seiseki!AB15","v":"森田　憲"}]
[null,{"$f":"$B$4","v":"奈良"},{"$f":"$C$4","v":"和歌山"},null,null,{"$f":"$B$4","v":"奈良"},{"$f":"$C$4","v":"和歌山"},null,null,{"$f":"$B$4","v":"奈良"},{"$f":"$C$4","v":"和歌山"},null,null,{"$f":"$B$4","v":"奈良"},{"$f":"$C$4","v":"和歌山"}]
[]
[null,"HR","HR",null,null,"HR","HR",null,null,"HR","HR",null,null,"HR","HR"]
[null,"レフリー",null,null,null,"レフリー",null,null,null,"レフリー",null,null,null,"レフリー"]
[]
[]
[null,"３－７","No.",null,null,"４－１","No.",null,null,"４－２","No.",null,null,"４－３","No."]
[null,{"$f":"▲成績表seiseki!AC10","v":"宮野　早織"},{"$f":"▲成績表seiseki!AC15","v":"杉本　博章"},null,null,{"$f":"▲成績表seiseki!AG10","v":"斉藤　裕児"},{"$f":"▲成績表seiseki!AG15","v":"和田宗一郎"},null,null,{"$f":"▲成績表seiseki!AH10","v":"近藤　拓馬"},{"$f":"▲成績表seiseki!AH15","v":"中本　雅大"},null,null,{"$f":"▲成績表seiseki!AI10","v":"吉向　翔平"},{"$f":"▲成績表seiseki!AI15","v":"末岡　修"}]
[null,{"$f":"$B$4","v":"奈良"},{"$f":"$C$4","v":"和歌山"},null,null,{"$f":"$B$4","v":"奈良"},{"$f":"$C$4","v":"和歌山"},null,null,{"$f":"$B$4","v":"奈良"},{"$f":"$C$4","v":"和歌山"},null,null,{"$f":"$B$4","v":"奈良"},{"$f":"$C$4","v":"和歌山"}]
[]
[null,"HR","HR",null,null,"HR","HR",null,null,"HR","HR",null,null,"HR","HR"]
[null,"レフリー",null,null,null,"レフリー",null,null,null,"レフリー",null,null,null,"レフリー"]
[]
[]
[null,"４－４","No.",null,null,"４－５","No.",null,null,"４－６","No.",null,null,"４－７","No."]
[null,{"$f":"▲成績表seiseki!AJ10","v":"白戸　玲人"},{"$f":"▲成績表seiseki!AJ15","v":"松房ゆかり"},null,null,{"$f":"▲成績表seiseki!AK10","v":"山田　晋之"},{"$f":"▲成績表seiseki!AK15","v":"森田　憲"},null,null,{"$f":"▲成績表seiseki!AL10","v":"山田　晃司"},{"$f":"▲成績表seiseki!AL15","v":"杉本　博章"},null,null,{"$f":"▲成績表seiseki!AM10","v":"宮野　早織"},{"$f":"▲成績表seiseki!AM15","v":"丹次　力良"}]
[null,{"$f":"$B$4","v":"奈良"},{"$f":"$C$4","v":"和歌山"},null,null,{"$f":"$B$4","v":"奈良"},{"$f":"$C$4","v":"和歌山"},null,null,{"$f":"$B$4","v":"奈良"},{"$f":"$C$4","v":"和歌山"},null,null,{"$f":"$B$4","v":"奈良"},{"$f":"$C$4","v":"和歌山"}]
[]
[null,"HR","HR",null,null,"HR","HR",null,null,"HR","HR",null,null,"HR","HR"]
[null,"レフリー",null,null,null,"レフリー",null,null,null,"レフリー",null,null,null,"レフリー"]
[]
[]
[null,"５－１","No.",null,null,"５－２","No.",null,null,"５－３","No.",null,null,"５－４","No."]
[null,{"$f":"▲成績表seiseki!C20","v":"斉藤　裕児"},{"$f":"▲成績表seiseki!C25","v":"中本　雅大"},null,null,{"$f":"▲成績表seiseki!D20","v":"近藤　拓馬"},{"$f":"▲成績表seiseki!D25","v":"末岡　修"},null,null,{"$f":"▲成績表seiseki!E20","v":"吉向　翔平"},{"$f":"▲成績表seiseki!E25","v":"松房ゆかり"},null,null,{"$f":"▲成績表seiseki!F20","v":"白戸　玲人"},{"$f":"▲成績表seiseki!F25","v":"森田　憲"}]
[null,{"$f":"$B$4","v":"奈良"},{"$f":"$C$4","v":"和歌山"},null,null,{"$f":"$B$4","v":"奈良"},{"$f":"$C$4","v":"和歌山"},null,null,{"$f":"$B$4","v":"奈良"},{"$f":"$C$4","v":"和歌山"},null,null,{"$f":"$B$4","v":"奈良"},{"$f":"$C$4","v":"和歌山"}]
[]
[null,"HR","HR",null,null,"HR","HR",null,null,"HR","HR",null,null,"HR","HR"]
[null,"レフリー",null,null,null,"レフリー",null,null,null,"レフリー",null,null,null,"レフリー"]
[]
[]
[null,"５－５","No.",null,null,"５－６","No.",null,null,"５－７","No.",null,null,"６－１","No."]
[null,{"$f":"▲成績表seiseki!G20","v":"山田　晋之"},{"$f":"▲成績表seiseki!G25","v":"杉本　博章"},null,null,{"$f":"▲成績表seiseki!H20","v":"山田　晃司"},{"$f":"▲成績表seiseki!H25","v":"丹次　力良"},null,null,{"$f":"▲成績表seiseki!I20","v":"宮野　早織"},{"$f":"▲成績表seiseki!I25","v":"和田宗一郎"},null,null,{"$f":"▲成績表seiseki!M20","v":"斉藤　裕児"},{"$f":"▲成績表seiseki!M25","v":"末岡　修"}]
[null,{"$f":"$B$4","v":"奈良"},{"$f":"$C$4","v":"和歌山"},null,null,{"$f":"$B$4","v":"奈良"},{"$f":"$C$4","v":"和歌山"},null,null,{"$f":"$B$4","v":"奈良"},{"$f":"$C$4","v":"和歌山"},null,null,{"$f":"$B$4","v":"奈良"},{"$f":"$C$4","v":"和歌山"}]
[]
[null,"HR","HR",null,null,"HR","HR",null,null,"HR","HR",null,null,"HR","HR"]
[null,"レフリー",null,null,null,"レフリー",null,null,null,"レフリー",null,null,null,"レフリー"]
[]
[]
[null,"６－２","No.",null,null,"６－３","No.",null,null,"６－４","No.",null,null,"６－５","No."]
[null,{"$f":"▲成績表seiseki!N20","v":"近藤　拓馬"},{"$f":"▲成績表seiseki!N25","v":"松房ゆかり"},null,null,{"$f":"▲成績表seiseki!O20","v":"吉向　翔平"},{"$f":"▲成績表seiseki!O25","v":"森田　憲"},null,null,{"$f":"▲成績表seiseki!P20","v":"白戸　玲人"},{"$f":"▲成績表seiseki!P25","v":"杉本　博章"},null,null,{"$f":"▲成績表seiseki!Q20","v":"山田　晋之"},{"$f":"▲成績表seiseki!Q25","v":"丹次　力良"}]
[null,{"$f":"$B$4","v":"奈良"},{"$f":"$C$4","v":"和歌山"},null,null,{"$f":"$B$4","v":"奈良"},{"$f":"$C$4","v":"和歌山"},null,null,{"$f":"$B$4","v":"奈良"},{"$f":"$C$4","v":"和歌山"},null,null,{"$f":"$B$4","v":"奈良"},{"$f":"$C$4","v":"和歌山"}]
[]
[null,"HR","HR",null,null,"HR","HR",null,null,"HR","HR",null,null,"HR","HR"]
[null,"レフリー",null,null,null,"レフリー",null,null,null,"レフリー",null,null,null,"レフリー"]
[]
[]
[null,"６－６","No.",null,null,"６－７","No.",null,null,"７－１","No.",null,null,"７－２","No."]
[null,{"$f":"▲成績表seiseki!R20","v":"山田　晃司"},{"$f":"▲成績表seiseki!R25","v":"和田宗一郎"},null,null,{"$f":"▲成績表seiseki!S20","v":"宮野　早織"},{"$f":"▲成績表seiseki!S25","v":"中本　雅大"},null,null,{"$f":"▲成績表seiseki!W20","v":"斉藤　裕児"},{"$f":"▲成績表seiseki!W25","v":"松房ゆかり"},null,null,{"$f":"▲成績表seiseki!X20","v":"近藤　拓馬"},{"$f":"▲成績表seiseki!X25","v":"森田　憲"}]
[null,{"$f":"$B$4","v":"奈良"},{"$f":"$C$4","v":"和歌山"},null,null,{"$f":"$B$4","v":"奈良"},{"$f":"$C$4","v":"和歌山"},null,null,{"$f":"$B$4","v":"奈良"},{"$f":"$C$4","v":"和歌山"},null,null,{"$f":"$B$4","v":"奈良"},{"$f":"$C$4","v":"和歌山"}]
[]
[null,"HR","HR",null,null,"HR","HR",null,null,"HR","HR",null,null,"HR","HR"]
[null,"レフリー",null,null,null,"レフリー",null,null,null,"レフリー",null,null,null,"レフリー"]
[]
[]
[null,"７－３","No.",null,null,"７－４","No.",null,null,"７－５","No.",null,null,"７－６","No."]
[null,{"$f":"▲成績表seiseki!Y20","v":"吉向　翔平"},{"$f":"▲成績表seiseki!Y25","v":"杉本　博章"},null,null,{"$f":"▲成績表seiseki!Z20","v":"白戸　玲人"},{"$f":"▲成績表seiseki!Z25","v":"丹次　力良"},null,null,{"$f":"▲成績表seiseki!AA20","v":"山田　晋之"},{"$f":"▲成績表seiseki!AA25","v":"和田宗一郎"},null,null,{"$f":"▲成績表seiseki!AB20","v":"山田　晃司"},{"$f":"▲成績表seiseki!AB25","v":"中本　雅大"}]
[null,{"$f":"$B$4","v":"奈良"},{"$f":"$C$4","v":"和歌山"},null,null,{"$f":"$B$4","v":"奈良"},{"$f":"$C$4","v":"和歌山"},null,null,{"$f":"$B$4","v":"奈良"},{"$f":"$C$4","v":"和歌山"},null,null,{"$f":"$B$4","v":"奈良"},{"$f":"$C$4","v":"和歌山"}]
[]
[null,"HR","HR",null,null,"HR","HR",null,null,"HR","HR",null,null,"HR","HR"]
[null,"レフリー",null,null,null,"レフリー",null,null,null,"レフリー",null,null,null,"レフリー"]
[]
[]
[null,"７－7","No.",null,null,null,"No.",null,null,null,"No.",null,null,null,"No."]
[null,{"$f":"▲成績表seiseki!AC20","v":"宮野　早織"},{"$f":"▲成績表seiseki!AC25","v":"末岡　修"}]
[null,{"$f":"$B$4","v":"奈良"},{"$f":"$C$4","v":"和歌山"},null,null,{"$f":"$B$4","v":"奈良"},{"$f":"$C$4","v":"和歌山"},null,null,{"$f":"$B$4","v":"奈良"},{"$f":"$C$4","v":"和歌山"},null,null,{"$f":"$B$4","v":"奈良"},{"$f":"$C$4","v":"和歌山"}]
[]
[null,"HR","HR",null,null,"HR","HR",null,null,"HR","HR",null,null,"HR","HR"]
[null,"レフリー",null,null,null,"レフリー",null,null,null,"レフリー",null,null,null,"レフリー"]

{"sheet":"進行表shinko","index":3,"n_rows":80,"n_cols":25,"rows_kept":80,"cut":false,"hidden":false,"merged":[[18,13,19,13],[20,13,21,13],[22,13,23,13],[25,9,25,10],[12,1,13,1],[14,1,15,1],[16,1,17,1],[18,1,19,1],[20,1,21,1],[22,1,23,1],[12,8,13,8],[14,8,15,8],[16,8,17,8],[24,13,25,13],[22,8,23,8],[24,8,25,8],[21,2,21,3],[21,11,21,12],[23,11,23,12],[25,11,25,12],[15,9,15,10],[21,9,21,10],[23,9,23,10],[15,2,15,3],[76,1,77,1],[78,1,79,1],[66,6,67,6],[68,6,69,6],[70,6,71,6],[72,6,73,6],[74,6,75,6],[76,6,77,6],[78,6,79,6],[66,1,67,1],[68,1,69,1],[70,1,71,1],[72,1,73,1],[79,2,79,3],[79,4,79,5],[71,2,71,3],[71,4,71,5],[73,2,73,3],[73,4,73,5],[75,2,75,3],[75,4,75,5],[77,2,77,3],[77,4,77,5],[74,1,75,1],[58,1,59,1],[22,6,23,6],[24,6,25,6],[60,1,61,1],[60,6,61,6],[58,6,59,6],[56,6,57,6],[61,2,61,3],[61,4,61,5],[36,6,37,6],[34,6,35,6],[32,6,33,6],[49,2,49,3],[49,4,49,5],[51,2,51,3],[51,4,51,5],[39,2,39,3],[39,4,39,5],[31,2,31,3],[31,4,31,5],[33,2,33,3],[33,4,33,5],[24,1,25,1],[29,2,29,3],[48,13,49,13],[50,13,51,13],[52,13,53,13],[54,13,55,13],[56,13,57,13],[56,8,57,8],[54,8,55,8],[52,8,53,8],[50,8,51,8],[48,8,49,8],[58,13,59,13],[60,13,61,13],[54,1,55,1],[54,6,55,6],[52,6,53,6],[50,6,51,6],[48,6,49,6],[38,8,39,8],[40,8,41,8],[42,8,43,8],[42,13,43,13],[40,13,41,13],[38,13,39,13],[38,1,39,1],[38,6,39,6],[40,1,41,1],[55,9,55,10],[55,11,55,12],[57,9,57,10],[57,11,57,12],[56,1,57,1],[43,4,43,5],[47,2,47,3],[47,4,47,5],[30,13,31,13],[48,1,49,1],[50,1,51,1],[52,1,53,1],[36,13,37,13],[34,13,35,13],[32,13,33,13],[30,1,31,1],[30,6,31,6],[32,1,33,1],[34,1,35,1],[36,1,37,1],[42,1,43,1],[41,9,41,10],[41,11,41,12],[43,9,43,10],[43,11,43,12],[42,6,43,6],[40,6,41,6],[53,2,53,3],[53,4,53,5],[41,2,41,3],[41,4,41,5],[43,2,43,3],[60,8,61,8],[58,8,59,8],[61,9,61,10],[61,11,61,12],[31,9,31,10],[31,11,31,12],[33,9,33,10],[33,11,33,12],[47,9,47,10],[47,11,47,12],[35,9,35,10],[35,11,35,12],[37,9,37,10],[37,11,37,12],[39,9,39,10],[39,11,39,12],[59,9,59,10],[59,11,59,12],[49,9,49,10],[49,11,49,12],[51,9,51,10],[51,11,51,12],[53,9,53,10],[53,11,53,12],[69,2,69,3],[69,4,69,5],[65,2,65,3],[65,4,65,5],[67,2,67,3],[67,4,67,5],[55,2,55,3],[55,4,55,5],[57,2,57,3],[57,4,57,5],[59,2,59,3],[59,4,59,5],[20,8,21,8],[19,2,19,3],[19,4,19,5],[18,8,19,8],[14,6,15,6],[29,4,29,5],[17,11,17,12],[19,11,19,12],[29,9,29,10],[29,11,29,12],[16,6,17,6],[18,6,19,6],[20,6,21,6],[17,9,17,10],[19,9,19,10],[21,4,21,5],[30,8,31,8],[32,8,33,8],[34,8,35,8],[36,8,37,8],[35,2,35,3],[35,4,35,5],[37,2,37,3],[37,4,37,5],[23,2,23,3],[23,4,23,5],[25,4,25,5],[25,2,25,3],[6,2,6,5],[6,9,6,12],[7,9,7,12],[13,2,13,3],[11,2,11,3],[11,4,11,5],[7,2,7,5],[9,2,9,5],[13,4,13,5],[11,9,11,10],[11,11,11,12],[12,6,13,6],[13,17,13,18],[13,20,13,21],[13,23,13,24],[9,9,9,12],[13,9,13,10],[13,11,13,12],[15,11,15,12],[17,2,17,3],[17,4,17,5],[12,13,13,13],[14,13,15,13],[16,13,17,13],[15,4,15,5]]}
[null,"試合の進行に関する入力は、このシートのみで行ってください。"]
[null,"得点欄に、勝者は半角大文字でW、敗者は半角数字で負点を入力して下さい。"]
[]
[null,"その他の欄は自動で更新されます。"]
[]
[{"$f":"☆登録touroku!B11","v":"第1回　和奈対抗戦"}]
[null,null,{"$f":"☆登録touroku!C20","v":"奈良"},null,null,null,null,null,null,{"$f":"☆登録touroku!E20","v":"和歌山"}]
[null,null,{"$f":"▲成績表seiseki!T41","v":24},null,null,null,"勝",null,null,{"$f":"▲成績表seiseki!AK41","v":25},null,null,null,"勝"]
[null,null,"Total Point",null,null,null,null,null,null,"Total Point"]
[null,null,{"$f":"▲成績表seiseki!V41","v":6480},null,null,null,null,null,null,{"$f":"▲成績表seiseki!AM41","v":6530}]
[null,"1節",null,null,null,null,null,null,"2節"]
[null,{"$f":"☆登録touroku!C20","v":"奈良"},"得点",null,"得点",null,{"$f":"☆登録touroku!E20","v":"和歌山"},null,{"$f":"$B$12","v":"奈良"},"得点",null,"得点",null,{"$f":"$G$12","v":"和歌山"}]
[null,{"$f":"☆登録touroku!C21","v":"斉藤　裕児"},null,null,null,null,{"$f":"☆登録touroku!E21","v":"森田　憲"},null,{"$f":"B13","v":"斉藤　裕児"},null,null,null,null,{"$f":"G15","v":"杉本　博章"},null,null,"記入例","A",110,null,"B",110,null,null,110]
[null,null,23,null,"w",null,null,null,null,28,null,"w",null,null,null,null,null,"ｗ",null,null,"w",null,null,125]
[null,{"$f":"☆登録touroku!C22","v":"近藤　拓馬"},null,null,null,null,{"$f":"☆登録touroku!E22","v":"杉本　博章"},null,{"$f":"B15","v":"近藤　拓馬"},null,null,null,null,{"$f":"G17","v":"丹次　力良"}]
[null,null,"w",null,170,null,null,null,null,"w",null,58,null,null,null,null,null,"勝者は\"w\"半角小文字で入力して下さい。"]
[null,{"$f":"☆登録touroku!C23","v":"吉向　翔平"},null,null,null,null,{"$f":"☆登録touroku!E23","v":"丹次　力良"},null,{"$f":"B17","v":"吉向　翔平"},null,null,null,null,{"$f":"G19","v":"和田宗一郎"}]
[null,null,"w",null,98,null,null,null,null,23,null,"w",null,null,null,null,null,"敗者側のスコアを入力すると相手側に”ｗ”が自動表示されます。"]
[null,{"$f":"☆登録touroku!C24","v":"白戸　玲人"},null,null,null,null,{"$f":"☆登録touroku!E24","v":"和田宗一郎"},null,{"$f":"B19","v":"白戸　玲人"},null,null,null,null,{"$f":"G21","v":"中本　雅大"}]
[null,null,"w",null,117,null,null,null,null,167,null,"w",null,null,null,null,null,"得点だけを全クリア「Ctrl＋ｆ」"]
[null,{"$f":"☆登録touroku!C25","v":"山田　晋之"},null,null,null,null,{"$f":"☆登録touroku!E25","v":"中本　雅大"},null,{"$f":"B21","v":"山田　晋之"},null,null,null,null,{"$f":"G23","v":"末岡　修"}]
[null,null,"w",null,65,null,null,null,null,0,null,"w"]
[null,{"$f":"☆登録touroku!C26","v":"山田　晃司"},null,null,null,null,{"$f":"☆登録touroku!E26","v":"末岡　修"},null,{"$f":"B23","v":"山田　晃司"},null,null,null,null,{"$f":"G25","v":"松房ゆかり"}]
[null,null,19,null,"w",null,null,null,null,80,null,"w"]
[null,{"$f":"☆登録touroku!C27","v":"宮野　早織"},null,null,null,null,{"$f":"☆登録touroku!E27","v":"松房ゆかり"},null,{"$f":"B25","v":"宮野　早織"},null,null,null,null,{"$f":"G13","v":"森田　憲"}]
[null,null,"w",null,69,null,null,null,null,24,null,"w"]
[]
[]
[null,"3節",null,null,null,null,null,null,"4節"]
[null,{"$f":"$B$12","v":"奈良"},"得点",null,"得点",null,{"$f":"$G$12","v":"和歌山"},null,{"$f":"$B$12","v":"奈良"},"得点",null,"得点",null,{"$f":"$G$12","v":"和歌山"}]
[null,{"$f":"B13","v":"斉藤　裕児"},null,null,null,null,{"$f":"N15","v":"丹次　力良"},null,{"$f":"B31","v":"斉藤　裕児"},null,null,null,null,{"$f":"G33","v":"和田宗一郎"}]
[null,null,"w",null,94,null,null,null,null,"w",null,33]
[null,{"$f":"B15","v":"近藤　拓馬"},null,null,null,null,{"$f":"N17","v":"和田宗一郎"},null,{"$f":"B33","v":"近藤　拓馬"},null,null,null,null,{"$f":"G35","v":"中本　雅大"}]
[null,null,"w",null,114,null,null,null,null,"w",null,117]
[null,{"$f":"B17","v":"吉向　翔平"},null,null,null,null,{"$f":"N19","v":"中本　雅大"},null,{"$f":"B35","v":"吉向　翔平"},null,null,null,null,{"$f":"G37","v":"末岡　修"}]
[null,null,"w",null,7,null,null,null,null,"w",null,171]
[null,{"$f":"B19","v":"白戸　玲人"},null,null,null,null,{"$f":"N21","v":"末岡　修"},null,{"$f":"B37","v":"白戸　玲人"},null,null,null,null,{"$f":"G39","v":"松房ゆかり"}]
[null,null,"w",null,21,null,null,null,null,"w",null,88]
[null,{"$f":"B21","v":"山田　晋之"},null,null,null,null,{"$f":"N23","v":"松房ゆかり"},null,{"$f":"B39","v":"山田　晋之"},null,null,null,null,{"$f":"G41","v":"森田　憲"}]
[null,null,"w",null,44,null,null,null,null,155,null,"w"]
[null,{"$f":"B23","v":"山田　晃司"},null,null,null,null,{"$f":"N25","v":"森田　憲"},null,{"$f":"B41","v":"山田　晃司"},null,null,null,null,{"$f":"G43","v":"杉本　博章"}]
[null,null,43,null,"w",null,null,null,null,146,null,"w"]
[null,{"$f":"B25","v":"宮野　早織"},null,null,null,null,{"$f":"N13","v":"杉本　博章"},null,{"$f":"B43","v":"宮野　早織"},null,null,null,null,{"$f":"G31","v":"丹次　力良"}]
[null,null,54,null,"w",null,null,null,null,"w",null,86]
[]
[]
[null,"5節",null,null,null,null,null,null,"6節"]
[null,{"$f":"$B$12","v":"奈良"},"得点",null,"得点",null,{"$f":"$G$12","v":"和歌山"},null,{"$f":"$B$12","v":"奈良"},"得点",null,"得点",null,{"$f":"$G$12","v":"和歌山"}]
[null,{"$f":"B31","v":"斉藤　裕児"},null,null,null,null,{"$f":"N33","v":"中本　雅大"},null,{"$f":"I31","v":"斉藤　裕児"},null,null,null,null,{"$f":"G51","v":"末岡　修"}]
[null,null,167,null,"w",null,null,null,null,158,null,"w"]
[null,{"$f":"B33","v":"近藤　拓馬"},null,null,null,null,{"$f":"N35","v":"末岡　修"},null,{"$f":"I33","v":"近藤　拓馬"},null,null,null,null,{"$f":"G53","v":"松房ゆかり"}]
[null,null,"w",null,79,null,null,null,null,28,null,"w"]
[null,{"$f":"B35","v":"吉向　翔平"},null,null,null,null,{"$f":"N37","v":"松房ゆかり"},null,{"$f":"I35","v":"吉向　翔平"},null,null,null,null,{"$f":"G55","v":"森田　憲"}]
[null,null,"w",null,10,null,null,null,null,"w",null,166]
[null,{"$f":"B37","v":"白戸　玲人"},null,null,null,null,{"$f":"N39","v":"森田　憲"},null,{"$f":"I37","v":"白戸　玲人"},null,null,null,null,{"$f":"G57","v":"杉本　博章"}]
[null,null,37,null,"w",null,null,null,null,"w",null,21]
[null,{"$f":"B39","v":"山田　晋之"},null,null,null,null,{"$f":"N41","v":"杉本　博章"},null,{"$f":"I39","v":"山田　晋之"},null,null,null,null,{"$f":"G59","v":"丹次　力良"}]
[null,null,160,null,"w",null,null,null,null,"w",null,13]
[null,{"$f":"B41","v":"山田　晃司"},null,null,null,null,{"$f":"N43","v":"丹次　力良"},null,{"$f":"I41","v":"山田　晃司"},null,null,null,null,{"$f":"G61","v":"和田宗一郎"}]
[null,null,133,null,"w",null,null,null,null,120,null,"w"]
[null,{"$f":"B43","v":"宮野　早織"},null,null,null,null,{"$f":"N31","v":"和田宗一郎"},null,{"$f":"I43","v":"宮野　早織"},null,null,null,null,{"$f":"G49","v":"中本　雅大"}]
[null,null,43,null,"w",null,null,null,null,128,null,"w"]
[null,null," "]
[]
[null,"7節"]
[null,{"$f":"$B$12","v":"奈良"},"得点",null,"得点",null,{"$f":"$G$12","v":"和歌山"}]
[null,{"$f":"B49","v":"斉藤　裕児"},null,null,null,null,{"$f":"N51","v":"松房ゆかり"}]
[null,null,138,null,"w"]
[null,{"$f":"B51","v":"近藤　拓馬"},null,null,null,null,{"$f":"N53","v":"森田　憲"}]
[null,null,61,null,"w"]
[null,{"$f":"B53","v":"吉向　翔平"},null,null,null,null,{"$f":"N55","v":"杉本　博章"}]
[null,null,103,null,"w"]
[null,{"$f":"B55","v":"白戸　玲人"},null,null,null,null,{"$f":"N57","v":"丹次　力良"}]
[null,null,"w",null,91]
[null,{"$f":"B57","v":"山田　晋之"},null,null,null,null,{"$f":"N59","v":"和田宗一郎"}]
[null,null,"w",null,95]
[null,{"$f":"B59","v":"山田　晃司"},null,null,null,null,{"$f":"N61","v":"中本　雅大"}]
[null,null,"w",null,143]
[null,{"$f":"B61","v":"宮野　早織"},null,null,null,null,{"$f":"N49","v":"末岡　修"}]
[null,null,40,null,"w"]

{"sheet":"▲成績表seiseki","index":4,"n_rows":50,"n_cols":42,"rows_kept":50,"cut":false,"hidden":false,"merged":[[46,36,46,37],[46,38,46,40],[47,36,47,37],[47,38,47,40],[48,36,48,37],[48,38,48,40],[49,38,49,40],[41,36,41,37],[41,38,41,40],[42,36,42,37],[42,38,42,40],[43,36,43,37],[43,38,43,40],[44,36,44,37],[44,38,44,40],[45,36,45,37],[45,38,45,40],[49,21,49,23],[43,21,43,23],[44,21,44,23],[45,21,45,23],[46,21,46,23],[47,21,47,23],[48,21,48,23],[43,19,43,20],[44,19,44,20],[45,19,45,20],[46,19,46,20],[47,19,47,20],[48,19,48,20],[2,1,2,16],[1,1,1,24],[42,21,42,23],[41,21,41,23],[42,19,42,20],[41,19,41,20],[29,8,31,10],[28,36,28,38],[19,18,21,18],[19,19,21,19],[19,14,21,14],[19,15,21,15],[24,9,26,9],[29,20,31,20],[29,21,31,21],[29,19,31,19],[29,22,31,22],[29,23,31,23],[28,19,28,21],[35,25,35,27],[36,25,36,27],[37,25,37,27],[38,25,38,27],[28,1,28,2],[28,3,28,4],[32,25,32,27],[33,25,33,27],[34,25,34,27],[29,25,31,27],[29,1,29,2],[29,4,29,5],[30,1,30,2],[30,4,30,5],[29,15,31,15],[29,17,31,17],[29,16,31,16],[29,11,31,11],[29,12,31,12],[29,14,31,14],[29,13,31,13],[33,1,33,2],[33,4,33,5],[24,12,26,12],[24,13,26,13],[14,2,16,2],[14,3,16,3],[14,4,16,4],[40,1,40,2],[40,4,40,5],[37,4,37,5],[38,1,38,2],[38,4,38,5],[39,1,39,2],[39,4,39,5],[28,5,28,6],[34,1,34,2],[37,1,37,2],[34,4,34,5],[35,1,35,2],[35,4,35,5],[36,1,36,2],[36,4,36,5],[31,1,31,2],[31,4,31,5],[32,1,32,2],[32,4,32,5],[24,2,26,2],[24,3,26,3],[24,4,26,4],[24,5,26,5],[24,6,26,6],[12,1,13,1],[12,11,13,11],[24,7,26,7],[22,1,23,1],[22,11,23,11],[19,8,21,8],[19,9,21,9],[19,7,21,7],[19,2,21,2],[19,3,21,3],[19,5,21,5],[19,4,21,4],[29,40,31,40],[29,34,31,34],[29,35,31,35],[29,36,31,36],[29,37,31,37],[29,38,31,38],[29,39,31,39],[28,39,28,40],[24,17,26,17],[29,28,31,28],[24,18,26,18],[24,19,26,19],[29,18,31,18],[24,29,26,29],[27,38,27,39],[29,29,31,29],[24,24,26,24],[29,30,31,30],[29,31,31,31],[29,32,31,32],[29,33,31,33],[28,22,28,23],[12,21,13,21],[19,22,21,22],[14,22,16,22],[14,23,16,23],[19,23,21,23],[19,26,21,26],[19,28,21,28],[19,27,21,27],[24,28,26,28],[24,27,26,27],[19,25,21,25],[24,26,26,26],[22,21,23,21],[19,24,21,24],[19,29,21,29],[24,23,26,23],[9,8,11,8],[6,36,6,40],[12,31,13,31],[14,39,16,39],[14,37,16,37],[14,34,16,34],[14,33,16,33],[14,29,16,29],[14,32,16,32],[9,39,11,39],[9,36,11,36],[9,37,11,37],[9,29,11,29],[9,35,11,35],[9,38,11,38],[9,34,11,34],[9,32,11,32],[6,22,6,25],[14,24,16,24],[14,25,16,25],[6,29,6,32],[5,1,6,9],[6,10,6,13],[14,5,16,5],[9,2,11,2],[9,3,11,3],[9,4,11,4],[9,5,11,5],[9,28,11,28],[14,28,16,28],[9,19,11,19],[14,16,16,16],[14,17,16,17],[9,14,11,14],[9,15,11,15],[9,16,11,16],[14,19,16,19],[9,22,11,22],[9,23,11,23],[9,24,11,24],[9,25,11,25],[9,26,11,26],[9,27,11,27],[9,17,11,17],[9,6,11,6],[9,7,11,7],[19,13,21,13],[47,25,47,27],[48,25,48,27],[49,8,49,10],[49,25,49,27],[19,6,21,6],[14,12,16,12],[14,13,16,13],[14,14,16,14],[14,15,16,15],[19,16,21,16],[19,17,21,17],[24,8,26,8],[14,7,16,7],[14,8,16,8],[14,9,16,9],[14,26,16,26],[14,18,16,18],[14,27,16,27],[24,25,26,25],[24,22,26,22],[24,14,26,14],[24,15,26,15],[24,16,26,16],[1,29,1,40],[4,1,4,40],[42,8,42,10],[43,8,43,10],[44,8,44,10],[45,8,45,10],[46,8,46,10],[47,8,47,10],[48,8,48,10],[42,25,42,27],[43,25,43,27],[44,25,44,27],[45,25,45,27],[46,25,46,27],[14,38,16,38],[14,35,16,35],[14,36,16,36],[9,33,11,33],[9,9,11,9],[9,12,11,12],[9,13,11,13],[9,18,11,18],[14,6,16,6],[19,12,21,12]]}
[null,"このシートは、左下のHRチェック、および右上のMVP、VP、HRの各賞対象者自動表示。",null,"v"]
[null,"右上のMVP、VP、HRの各賞対象者も自動表示されます。",null,null,null,null,null,null,null,null,null,null,null,null,null,null,null,null,null,null,null,null,null,null,null,null,null,null,null,"：HRを自動表示"]
[]
[]
[null,"MVP、VPは「W数多い＞TP多い（ハンデに対応）＞総失点少ない(”W”を除いた合計、又失点のハンデは未対応)」で判定、同率の場合は手入力でお願いします。"]
[null,{"$f":"☆登録touroku!B11","v":"第1回　和奈対抗戦"}]
[null,null,null,null,null,null,null,null,null,null,{"$f":"☆登録touroku!C13","v":"2016-09-25"},null,null,null,"於",{"$f":"☆登録touroku!C15","v":"オーシャンドリーム"},null,null,null,null,"MVP",null,{"$f":"IF($T$41+$U$41+$AK$41+$AL$41=98,IF(V50>AM50,I50,Z50),\"\")","v":"森田　憲 (和歌山)"},null,null,null,null,"VP",null,{"$f":"IF($T$41+$U$41+$AK$41+$AL$41=98,IF(V50>AM50,Z50,I50),\"\")","v":"白戸　玲人 (奈良)"},null,null,null,null,"HR",null,"和田宗一郎 (和歌山) 444 p"]
[]
[null,null,1,2,3,4,5,6,7,null,null,null,8,9,10,11,12,13,14,null,null,null,15,16,17,18,19,20,21,null,null,null,22,23,24,25,26,27,28]
[null,null,{"$f":"AC30","v":"斉藤　裕児"},"近藤　拓馬","吉向　翔平","白戸　玲人","山田　晋之","山田　晃司","宮野　早織",null,null,null,{"$f":"C10","v":"斉藤　裕児"},"近藤　拓馬","吉向　翔平","白戸　玲人","山田　晋之","山田　晃司","宮野　早織",null,null,null,{"$f":"M10","v":"斉藤　裕児"},"近藤　拓馬","吉向　翔平","白戸　玲人","山田　晋之","山田　晃司","宮野　早織",null,null,null,{"$f":"W10","v":"斉藤　裕児"},"近藤　拓馬","吉向　翔平","白戸　玲人","山田　晋之","山田　晃司","宮野　早織"]
[]
[]
[null,1,{"$f":"IF(L33=\"\",\"\",IF(L33<$AO$28,\"×\",\"○\"))","v":"×"},{"$f":"IF(M34=\"\",\"\",IF(M34<$AO$28,\"×\",\"○\"))","v":"○"},{"$f":"IF(N35=\"\",\"\",IF(N35<$AO$28,\"×\",\"○\"))","v":"○"},{"$f":"IF(O36=\"\",\"\",IF(O36<$AO$28,\"×\",\"○\"))","v":"○"},{"$f":"IF(P37=\"\",\"\",IF(P37<$AO$28,\"×\",\"○\"))","v":"○"},{"$f":"IF(Q38=\"\",\"\",IF(Q38<$AO$28,\"×\",\"○\"))","v":"×"},{"$f":"IF(R39=\"\",\"\",IF(R39<$AO$28,\"×\",\"○\"))","v":"○"},null,null,2,{"$f":"IF(M33=\"\",\"\",IF(M33<$AO$28,\"×\",\"○\"))","v":"×"},{"$f":"IF(N34=\"\",\"\",IF(N34<$AO$28,\"×\",\"○\"))","v":"○"},{"$f":"IF(O35=\"\",\"\",IF(O35<$AO$28,\"×\",\"○\"))","v":"×"},{"$f":"IF(P36=\"\",\"\",IF(P36<$AO$28,\"×\",\"○\"))","v":"×"},{"$f":"IF(Q37=\"\",\"\",IF(Q37<$AO$28,\"×\",\"○\"))","v":"×"},{"$f":"IF(R38=\"\",\"\",IF(R38<$AO$28,\"×\",\"○\"))","v":"×"},{"$f":"IF(L39=\"\",\"\",IF(L39<$AO$28,\"×\",\"○\"))","v":"×"},null,null,3,{"$f":"IF(N33=\"\",\"\",IF(N33<$AO$28,\"×\",\"○\"))","v":"○"},{"$f":"IF(O34=\"\",\"\",IF(O34<$AO$28,\"×\",\"○\"))","v":"○"},{"$f":"IF(P35=\"\",\"\",IF(P35<$AO$28,\"×\",\"○\"))","v":"○"},{"$f":"IF(Q36=\"\",\"\",IF(Q36<$AO$28,\"×\",\"○\"))","v":"○"},{"$f":"IF(R37=\"\",\"\",IF(R37<$AO$28,\"×\",\"○\"))","v":"○"},{"$f":"IF(L38=\"\",\"\",IF(L38<$AO$28,\"×\",\"○\"))","v":"×"},{"$f":"IF(M39=\"\",\"\",IF(M39<$AO$28,\"×\",\"○\"))","v":"×"},null,null,4,{"$f":"IF(O33=\"\",\"\",IF(O33<$AO$28,\"×\",\"○\"))","v":"○"},{"$f":"IF(P34=\"\",\"\",IF(P34<$AO$28,\"×\",\"○\"))","v":"○"},{"$f":"IF(Q35=\"\",\"\",IF(Q35<$AO$28,\"×\",\"○\"))","v":"○"},{"$f":"IF(R36=\"\",\"\",IF(R36<$AO$28,\"×\",\"○\"))","v":"○"},{"$f":"IF(L37=\"\",\"\",IF(L37<$AO$28,\"×\",\"○\"))","v":"×"},{"$f":"IF(M38=\"\",\"\",IF(M38<$AO$28,\"×\",\"○\"))","v":"×"},{"$f":"IF(N39=\"\",\"\",IF(N39<$AO$28,\"×\",\"○\"))","v":"○"}]
[null,null,{"$f":"IF(L33=\"\",\"\",IF(L33<$AO$28,\"○\",\"×\"))","v":"○"},{"$f":"IF(M34=\"\",\"\",IF(M34<$AO$28,\"○\",\"×\"))","v":"×"},{"$f":"IF(N35=\"\",\"\",IF(N35<$AO$28,\"○\",\"×\"))","v":"×"},{"$f":"IF(O36=\"\",\"\",IF(O36<$AO$28,\"○\",\"×\"))","v":"×"},{"$f":"IF(P37=\"\",\"\",IF(P37<$AO$28,\"○\",\"×\"))","v":"×"},{"$f":"IF(Q38=\"\",\"\",IF(Q38<$AO$28,\"○\",\"×\"))","v":"○"},{"$f":"IF(R39=\"\",\"\",IF(R39<$AO$28,\"○\",\"×\"))","v":"×"},null,null,null,{"$f":"IF(M33=\"\",\"\",IF(M33<$AO$28,\"○\",\"×\"))","v":"○"},{"$f":"IF(N34=\"\",\"\",IF(N34<$AO$28,\"○\",\"×\"))","v":"×"},{"$f":"IF(O35=\"\",\"\",IF(O35<$AO$28,\"○\",\"×\"))","v":"○"},{"$f":"IF(P36=\"\",\"\",IF(P36<$AO$28,\"○\",\"×\"))","v":"○"},{"$f":"IF(Q37=\"\",\"\",IF(Q37<$AO$28,\"○\",\"×\"))","v":"○"},{"$f":"IF(R38=\"\",\"\",IF(R38<$AO$28,\"○\",\"×\"))","v":"○"},{"$f":"IF(L39=\"\",\"\",IF(L39<$AO$28,\"○\",\"×\"))","v":"○"},null,null,null,{"$f":"IF(N33=\"\",\"\",IF(N33<$AO$28,\"○\",\"×\"))","v":"×"},{"$f":"IF(O34=\"\",\"\",IF(O34<$AO$28,\"○\",\"×\"))","v":"×"},{"$f":"IF(P35=\"\",\"\",IF(P35<$AO$28,\"○\",\"×\"))","v":"×"},{"$f":"IF(Q36=\"\",\"\",IF(Q36<$AO$28,\"○\",\"×\"))","v":"×"},{"$f":"IF(R37=\"\",\"\",IF(R37<$AO$28,\"○\",\"×\"))","v":"×"},{"$f":"IF(L38=\"\",\"\",IF(L38<$AO$28,\"○\",\"×\"))","v":"○"},{"$f":"IF(M39=\"\",\"\",IF(M39<$AO$28,\"○\",\"×\"))","v":"○"},null,null,null,{"$f":"IF(O33=\"\",\"\",IF(O33<$AO$28,\"○\",\"×\"))","v":"×"},{"$f":"IF(P34=\"\",\"\",IF(P34<$AO$28,\"○\",\"×\"))","v":"×"},{"$f":"IF(Q35=\"\",\"\",IF(Q35<$AO$28,\"○\",\"×\"))","v":"×"},{"$f":"IF(R36=\"\",\"\",IF(R36<$AO$28,\"○\",\"×\"))","v":"×"},{"$f":"IF(L37=\"\",\"\",IF(L37<$AO$28,\"○\",\"×\"))","v":"○"},{"$f":"IF(M38=\"\",\"\",IF(M38<$AO$28,\"○\",\"×\"))","v":"○"},{"$f":"IF(N39=\"\",\"\",IF(N39<$AO$28,\"○\",\"×\"))","v":"×"}]
[null,null,{"$f":"L30","v":"森田　憲"},"杉本　博章","丹次　力良","和田宗一郎","中本　雅大","末岡　修","松房ゆかり",null,null,null,{"$f":"D15","v":"杉本　博章"},"丹次　力良","和田宗一郎","中本　雅大","末岡　修","松房ゆかり",{"$f":"C15","v":"森田　憲"},null,null,null,{"$f":"N15","v":"丹次　力良"},"和田宗一郎","中本　雅大","末岡　修","松房ゆかり","森田　憲",{"$f":"M15","v":"杉本　博章"},null,null,null,{"$f":"X15","v":"和田宗一郎"},"中本　雅大","末岡　修","松房ゆかり","森田　憲","杉本　博章",{"$f":"W15","v":"丹次　力良"}]
[]
[]
[]
[null,null,29,30,31,32,33,34,35,null,null,null,36,37,38,39,40,41,42,null,null,null,43,44,45,46,47,48,49]
[null,null,{"$f":"C10","v":"斉藤　裕児"},{"$f":"D10","v":"近藤　拓馬"},"吉向　翔平","白戸　玲人","山田　晋之","山田　晃司","宮野　早織",null,null,null,{"$f":"C20","v":"斉藤　裕児"},"近藤　拓馬","吉向　翔平","白戸　玲人","山田　晋之","山田　晃司","宮野　早織",null,null,null,{"$f":"M20","v":"斉藤　裕児"},"近藤　拓馬","吉向　翔平","白戸　玲人","山田　晋之","山田　晃司","宮野　早織"]
[]
[]
[null,5,{"$f":"IF(P33=\"\",\"\",IF(P33<$AO$28,\"×\",\"○\"))","v":"×"},{"$f":"IF(Q34=\"\",\"\",IF(Q34<$AO$28,\"×\",\"○\"))","v":"○"},{"$f":"IF(R35=\"\",\"\",IF(R35<$AO$28,\"×\",\"○\"))","v":"○"},{"$f":"IF(L36=\"\",\"\",IF(L36<$AO$28,\"×\",\"○\"))","v":"×"},{"$f":"IF(M37=\"\",\"\",IF(M37<$AO$28,\"×\",\"○\"))","v":"×"},{"$f":"IF(N38=\"\",\"\",IF(N38<$AO$28,\"×\",\"○\"))","v":"×"},{"$f":"IF(O39=\"\",\"\",IF(O39<$AO$28,\"×\",\"○\"))","v":"×"},null,null,6,{"$f":"IF(Q33=\"\",\"\",IF(Q33<$AO$28,\"×\",\"○\"))","v":"×"},{"$f":"IF(R34=\"\",\"\",IF(R34<$AO$28,\"×\",\"○\"))","v":"×"},{"$f":"IF(L35=\"\",\"\",IF(L35<$AO$28,\"×\",\"○\"))","v":"○"},{"$f":"IF(M36=\"\",\"\",IF(M36<$AO$28,\"×\",\"○\"))","v":"○"},{"$f":"IF(N37=\"\",\"\",IF(N37<$AO$28,\"×\",\"○\"))","v":"○"},{"$f":"IF(O38=\"\",\"\",IF(O38<$AO$28,\"×\",\"○\"))","v":"×"},{"$f":"IF(P39=\"\",\"\",IF(P39<$AO$28,\"×\",\"○\"))","v":"×"},null,null,7,{"$f":"IF(R33=\"\",\"\",IF(R33<$AO$28,\"×\",\"○\"))","v":"×"},{"$f":"IF(L34=\"\",\"\",IF(L34<$AO$28,\"×\",\"○\"))","v":"×"},{"$f":"IF(M35=\"\",\"\",IF(M35<$AO$28,\"×\",\"○\"))","v":"×"},{"$f":"IF(N36=\"\",\"\",IF(N36<$AO$28,\"×\",\"○\"))","v":"○"},{"$f":"IF(O37=\"\",\"\",IF(O37<$AO$28,\"×\",\"○\"))","v":"○"},{"$f":"IF(P38=\"\",\"\",IF(P38<$AO$28,\"×\",\"○\"))","v":"○"},{"$f":"IF(Q39=\"\",\"\",IF(Q39<$AO$28,\"×\",\"○\"))","v":"×"}]
[null,null,{"$f":"IF(P33=\"\",\"\",IF(P33<$AO$28,\"○\",\"×\"))","v":"○"},{"$f":"IF(Q34=\"\",\"\",IF(Q34<$AO$28,\"○\",\"×\"))","v":"×"},{"$f":"IF(R35=\"\",\"\",IF(R35<$AO$28,\"○\",\"×\"))","v":"×"},{"$f":"IF(L36=\"\",\"\",IF(L36<$AO$28,\"○\",\"×\"))","v":"○"},{"$f":"IF(M37=\"\",\"\",IF(M37<$AO$28,\"○\",\"×\"))","v":"○"},{"$f":"IF(N38=\"\",\"\",IF(N38<$AO$28,\"○\",\"×\"))","v":"○"},{"$f":"IF(O39=\"\",\"\",IF(O39<$AO$28,\"○\",\"×\"))","v":"○"},null,null,null,{"$f":"IF(Q33=\"\",\"\",IF(Q33<$AO$28,\"○\",\"×\"))","v":"○"},{"$f":"IF(R34=\"\",\"\",IF(R34<$AO$28,\"○\",\"×\"))","v":"○"},{"$f":"IF(L35=\"\",\"\",IF(L35<$AO$28,\"○\",\"×\"))","v":"×"},{"$f":"IF(M36=\"\",\"\",IF(M36<$AO$28,\"○\",\"×\"))","v":"×"},{"$f":"IF(N37=\"\",\"\",IF(N37<$AO$28,\"○\",\"×\"))","v":"×"},{"$f":"IF(O38=\"\",\"\",IF(O38<$AO$28,\"○\",\"×\"))","v":"○"},{"$f":"IF(P39=\"\",\"\",IF(P39<$AO$28,\"○\",\"×\"))","v":"○"},null,null,null,{"$f":"IF(R33=\"\",\"\",IF(R33<$AO$28,\"○\",\"×\"))","v":"○"},{"$f":"IF(L34=\"\",\"\",IF(L34<$AO$28,\"○\",\"×\"))","v":"○"},{"$f":"IF(M35=\"\",\"\",IF(M35<$AO$28,\"○\",\"×\"))","v":"○"},{"$f":"IF(N36=\"\",\"\",IF(N36<$AO$28,\"○\",\"×\"))","v":"×"},{"$f":"IF(O37=\"\",\"\",IF(O37<$AO$28,\"○\",\"×\"))","v":"×"},{"$f":"IF(P38=\"\",\"\",IF(P38<$AO$28,\"○\",\"×\"))","v":"×"},{"$f":"IF(Q39=\"\",\"\",IF(Q39<$AO$28,\"○\",\"×\"))","v":"○"}]
[null,null,{"$f":"G15","v":"中本　雅大"},{"$f":"H15","v":"末岡　修"},{"$f":"I15","v":"松房ゆかり"},{"$f":"C15","v":"森田　憲"},{"$f":"D15","v":"杉本　博章"},{"$f":"E15","v":"丹次　力良"},{"$f":"F15","v":"和田宗一郎"},null,null,null,{"$f":"Q15","v":"末岡　修"},{"$f":"R15","v":"松房ゆかり"},{"$f":"S15","v":"森田　憲"},{"$f":"M15","v":"杉本　博章"},{"$f":"N15","v":"丹次　力良"},{"$f":"O15","v":"和田宗一郎"},{"$f":"P$15","v":"中本　雅大"},null,null,null,{"$f":"AA15","v":"松房ゆかり"},{"$f":"AB15","v":"森田　憲"},"杉本　博章",{"$f":"W15","v":"丹次　力良"},{"$f":"X15","v":"和田宗一郎"},"中本　雅大","末岡　修"]
[]
[]
[null,null,null,null,null,null,null,null,null,null,null,null,null,null,null,null,null,null,null,null,null,null,null,null,null,null,null,null,null,null,null,null,null,null,null,null,null,null,"基準点：",null,{"$f":"☆登録touroku!C17","v":180}]
[null,{"$f":"☆登録touroku!C20","v":"奈良"},null,"HR",null,{"$f":"☆登録touroku!E20","v":"和歌山"},null,null,null,null,null,1,2,3,4,5,6,7,null,"total point",null,null,{"$f":"IF(T40=\"\",\"\",T40*180+V40)","v":""},null,null,null,null,null,1,2,3,4,5,6,7,null,"total point",null,null,{"$f":"IF(AK40=\"\",\"\",AK40*180+AM40)","v":""}]
[null,"選手名",null,"点","選手名",null,"点",null,null,null,null,{"$f":"☆登録touroku!E21","v":"森田　憲"},{"$f":"☆登録touroku!E22","v":"杉本　博章"},{"$f":"☆登録touroku!E23","v":"丹次　力良"},{"$f":"☆登録touroku!E24","v":"和田宗一郎"},{"$f":"☆登録touroku!E25","v":"中本　雅大"},{"$f":"☆登録touroku!E26","v":"末岡　修"},{"$f":"☆登録touroku!E27","v":"松房ゆかり"},"持ち点","W","L","TP","失点","R",null,null,null,null,{"$f":"I33","v":"斉藤　裕児"},{"$f":"I34","v":"近藤　拓馬"},{"$f":"I35","v":"吉向　翔平"},{"$f":"I36","v":"白戸　玲人"},{"$f":"I37","v":"山田　晋之"},{"$f":"I38","v":"山田　晃司"},{"$f":"I39","v":"宮野　早織"},"持ち点","W","L","TP","失点","R"]
[]
[]
[{"$f":"T33*100000-U33*10000+V33-W33","v":150747},null,null,null,null,null,null,1,{"$f":"☆登録touroku!C21","v":"斉藤　裕児"},null,null,{"$f":"IF(進行表shinko!C14=\"\",\"\",IF(進行表shinko!C14<$AO$28,進行表shinko!C14,\"W\"))","v":23},{"$f":"IF(進行表shinko!J14=\"\",\"\",IF(進行表shinko!J14<$AO$28,進行表shinko!J14,\"W\"))","v":28},{"$f":"IF(進行表shinko!C32=\"\",\"\",IF(進行表shinko!C32<$AO$28,進行表shinko!C32,\"W\"))","v":"W"},{"$f":"IF(進行表shinko!J32=\"\",\"\",IF(進行表shinko!J32<$AO$28,進行表shinko!J32,\"W\"))","v":"W"},{"$f":"IF(進行表shinko!C50=\"\",\"\",IF(進行表shinko!C50<$AO$28,進行表shinko!C50,\"W\"))","v":167},{"$f":"IF(進行表shinko!J50=\"\",\"\",IF(進行表shinko!J50<$AO$28,進行表shinko!J50,\"W\"))","v":158},{"$f":"IF(進行表shinko!C68=\"\",\"\",IF(進行表shinko!C68<$AO$28,進行表shinko!C68,\"W\"))","v":138},{"$f":"☆登録touroku!D21","v":180},{"$f":"IF(COUNTBLANK($L33:$R33)=7,\"\",COUNTIF($L33:$R33,\"W\"))","v":2},{"$f":"IF(COUNTBLANK($L33:$R33)=7,\"\",COUNTIF($L33:$R33,\">=0\"))","v":5},{"$f":"IF(COUNTBLANK($L33:$R33)=7,\"\",INT((SUM($L33:$R33)+($S33*T33))*$AO$28/$S33))","v":874},{"$f":"IF(COUNTBLANK($L33:$R33)=7,\"\",SUM(AC$33:AC$39))","v":127},{"$f":"IF($T$41+$U$41=49,RANK($V43,$V$43:$V$49),\"\")","v":5},1,{"$f":"☆登録touroku!E21","v":"森田　憲"},null,null,{"$f":"IF(進行表shinko!E14=\"\",\"\",IF(進行表shinko!E14<$AO$28,進行表shinko!E14,\"W\"))","v":"W"},{"$f":"IF(進行表shinko!E70=\"\",\"\",IF(進行表shinko!E70<$AO$28,進行表shinko!E70,\"W\"))","v":"W"},{"$f":"IF(進行表shinko!L54=\"\",\"\",IF(進行表shinko!L54<$AO$28,進行表shinko!L54,\"W\"))","v":166},{"$f":"IF(進行表shinko!E56=\"\",\"\",IF(進行表shinko!E56<$AO$28,進行表shinko!E56,\"W\"))","v":"W"},{"$f":"IF(進行表shinko!L40=\"\",\"\",IF(進行表shinko!L40<$AO$28,進行表shinko!L40,\"W\"))","v":"W"},{"$f":"IF(進行表shinko!E42=\"\",\"\",IF(進行表shinko!E42<$AO$28,進行表shinko!E42,\"W\"))","v":"W"},{"$f":"IF(進行表shinko!L26=\"\",\"\",IF(進行表shinko!L26<$AO$28,進行表shinko!L26,\"W\"))","v":"W"},{"$f":"☆登録touroku!F21","v":180},{"$f":"IF(COUNTBLANK($AC33:$AI33)=7,\"\",COUNTIF($AC33:$AI33,\"W\"))","v":6},{"$f":"IF(COUNTBLANK($AC33:$AI33)=7,\"\",COUNTIF($AC33:$AI33,\">=0\"))","v":1},{"$f":"IF(COUNTBLANK($AC33:$AI33)=7,\"\",INT((SUM($AC33:$AI33)+($AJ33*$AK33))*$AO$28/$AJ33))","v":1246},{"$f":"IF(COUNTBLANK($AC33:$AI33)=7,\"\",SUM(L$33:L$39))","v":343},{"$f":"IF($AK$41+$AL$41=49,RANK($AM43,$AM$43:$AM$49),\"\")","v":1},{"$f":"AK33*100000-AL33*10000+AM33-AN33","v":590903}]
[480451,null,null,null,null,null,null,2,{"$f":"☆登録touroku!C22","v":"近藤　拓馬"},null,null,{"$f":"IF(進行表shinko!C70=\"\",\"\",IF(進行表shinko!C70<$AO$28,進行表shinko!C70,\"W\"))","v":61},{"$f":"IF(進行表shinko!C16=\"\",\"\",IF(進行表shinko!C16<$AO$28,進行表shinko!C16,\"W\"))","v":"W"},{"$f":"IF(進行表shinko!J16=\"\",\"\",IF(進行表shinko!J16<$AO$28,進行表shinko!J16,\"W\"))","v":"W"},{"$f":"IF(進行表shinko!C34=\"\",\"\",IF(進行表shinko!C34<$AO$28,進行表shinko!C34,\"W\"))","v":"W"},{"$f":"IF(進行表shinko!J34=\"\",\"\",IF(進行表shinko!J34<$AO$28,進行表shinko!J34,\"W\"))","v":"W"},{"$f":"IF(進行表shinko!C52=\"\",\"\",IF(進行表shinko!C52<$AO$28,進行表shinko!C52,\"W\"))","v":"W"},{"$f":"IF(進行表shinko!J52=\"\",\"\",IF(進行表shinko!J52<$AO$28,進行表shinko!J52,\"W\"))","v":28},{"$f":"☆登録touroku!D22","v":180},{"$f":"IF(COUNTBLANK($L34:$R34)=7,\"\",COUNTIF($L34:$R34,\"W\"))","v":5},2,{"$f":"IF(COUNTBLANK($L34:$R34)=7,\"\",INT((SUM($L34:$R34)+($S34*T34))*$AO$28/$S34))","v":989},{"$f":"IF(COUNTBLANK($L34:$R34)=7,\"\",SUM(AD$33:AD$39))","v":538},{"$f":"IF($T$41+$U$41=49,RANK($V44,$V$43:$V$49),\"\")","v":3},2,{"$f":"☆登録touroku!E22","v":"杉本　博章"},null,null,{"$f":"IF(進行表shinko!L14=\"\",\"\",IF(進行表shinko!L14<$AO$28,進行表shinko!L14,\"W\"))","v":"W"},{"$f":"IF(進行表shinko!E16=\"\",\"\",IF(進行表shinko!E16<$AO$28,進行表shinko!E16,\"W\"))","v":170},{"$f":"IF(進行表shinko!E72=\"\",\"\",IF(進行表shinko!E72<$AO$28,進行表shinko!E72,\"W\"))","v":"W"},{"$f":"IF(進行表shinko!L56=\"\",\"\",IF(進行表shinko!L56<$AO$28,進行表shinko!L56,\"W\"))","v":21},{"$f":"IF(進行表shinko!E58=\"\",\"\",IF(進行表shinko!E58<$AO$28,進行表shinko!E58,\"W\"))","v":"W"},{"$f":"IF(進行表shinko!L42=\"\",\"\",IF(進行表shinko!L42<$AO$28,進行表shinko!L42,\"W\"))","v":"W"},{"$f":"IF(進行表shinko!E44=\"\",\"\",IF(進行表shinko!E44<$AO$28,進行表shinko!E44,\"W\"))","v":"W"},{"$f":"☆登録touroku!F22","v":180},{"$f":"IF(COUNTBLANK($AC34:$AI34)=7,\"\",COUNTIF($AC34:$AI34,\"W\"))","v":5},2,{"$f":"IF(COUNTBLANK($AC34:$AI34)=7,\"\",INT((SUM($AC34:$AI34)+($AJ34*$AK34))*$AO$28/$AJ34))","v":1091},{"$f":"IF(COUNTBLANK($AC34:$AI34)=7,\"\",SUM(M$33:M$39))","v":491},{"$f":"IF($AK$41+$AL$41=49,RANK($AM44,$AM$43:$AM$49),\"\")","v":2},{"$f":"AK34*100000-AL34*10000+AM34-AN34","v":480600}]
[480574,null,null,null,null,null,null,3,{"$f":"☆登録touroku!C23","v":"吉向　翔平"},null,null,{"$f":"IF(進行表shinko!J54=\"\",\"\",IF(進行表shinko!J54<$AO$28,進行表shinko!J54,\"W\"))","v":"W"},{"$f":"IF(進行表shinko!C72=\"\",\"\",IF(進行表shinko!C72<$AO$28,進行表shinko!C72,\"W\"))","v":103},{"$f":"IF(進行表shinko!C18=\"\",\"\",IF(進行表shinko!C18<$AO$28,進行表shinko!C18,\"W\"))","v":"W"},{"$f":"IF(進行表shinko!J18=\"\",\"\",IF(進行表shinko!J18<$AO$28,進行表shinko!J18,\"W\"))","v":23},{"$f":"IF(進行表shinko!C36=\"\",\"\",IF(進行表shinko!C36<$AO$28,進行表shinko!C36,\"W\"))","v":"W"},{"$f":"IF(進行表shinko!J36=\"\",\"\",IF(進行表shinko!J36<$AO$28,進行表shinko!J36,\"W\"))","v":"W"},{"$f":"IF(進行表shinko!C54=\"\",\"\",IF(進行表shinko!C54<$AO$28,進行表shinko!C54,\"W\"))","v":"W"},{"$f":"☆登録touroku!D23","v":180},5,2,1026,{"$f":"IF(COUNTBLANK($L35:$R35)=7,\"\",SUM(AE$33:AE$39))","v":452},2,3,{"$f":"☆登録touroku!E23","v":"丹次　力良"},null,null,{"$f":"IF(進行表shinko!E32=\"\",\"\",IF(進行表shinko!E32<$AO$28,進行表shinko!E32,\"W\"))","v":94},{"$f":"IF(進行表shinko!L16=\"\",\"\",IF(進行表shinko!L16<$AO$28,進行表shinko!L16,\"W\"))","v":58},{"$f":"IF(進行表shinko!E18=\"\",\"\",IF(進行表shinko!E18<$AO$28,進行表shinko!E18,\"W\"))","v":98},{"$f":"IF(進行表shinko!E74=\"\",\"\",IF(進行表shinko!E74<$AO$28,進行表shinko!E74,\"W\"))","v":91},{"$f":"IF(進行表shinko!L58=\"\",\"\",IF(進行表shinko!L58<$AO$28,進行表shinko!L58,\"W\"))","v":13},{"$f":"IF(進行表shinko!E60=\"\",\"\",IF(進行表shinko!E60<$AO$28,進行表shinko!E60,\"W\"))","v":"W"},{"$f":"IF(進行表shinko!L44=\"\",\"\",IF(進行表shinko!L44<$AO$28,進行表shinko!L44,\"W\"))","v":86},{"$f":"☆登録touroku!F23","v":180},1,6,620,{"$f":"IF(COUNTBLANK($AC35:$AI35)=7,\"\",SUM(N$33:N$39))","v":133},7,40487]
[480766,null,null,null,null,null,null,4,{"$f":"☆登録touroku!C24","v":"白戸　玲人"},null,null,{"$f":"IF(進行表shinko!C56=\"\",\"\",IF(進行表shinko!C56<$AO$28,進行表shinko!C56,\"W\"))","v":37},{"$f":"IF(進行表shinko!J56=\"\",\"\",IF(進行表shinko!J56<$AO$28,進行表shinko!J56,\"W\"))","v":"W"},{"$f":"IF(進行表shinko!C74=\"\",\"\",IF(進行表shinko!C74<$AO$28,進行表shinko!C74,\"W\"))","v":"W"},{"$f":"IF(進行表shinko!C20=\"\",\"\",IF(進行表shinko!C20<$AO$28,進行表shinko!C20,\"W\"))","v":"W"},{"$f":"IF(進行表shinko!J20=\"\",\"\",IF(進行表shinko!J20<$AO$28,進行表shinko!J20,\"W\"))","v":167},{"$f":"IF(進行表shinko!C38=\"\",\"\",IF(進行表shinko!C38<$AO$28,進行表shinko!C38,\"W\"))","v":"W"},{"$f":"IF(進行表shinko!J38=\"\",\"\",IF(進行表shinko!J38<$AO$28,進行表shinko!J38,\"W\"))","v":"W"},{"$f":"☆登録touroku!D24","v":180},5,2,1104,{"$f":"IF(COUNTBLANK($L36:$R36)=7,\"\",SUM(AF$33:AF$39))","v":338},1,4,{"$f":"☆登録touroku!E24","v":"和田宗一郎"},null,null,{"$f":"IF(進行表shinko!L32=\"\",\"\",IF(進行表shinko!L32<$AO$28,進行表shinko!L32,\"W\"))","v":33},{"$f":"IF(進行表shinko!E34=\"\",\"\",IF(進行表shinko!E34<$AO$28,進行表shinko!E34,\"W\"))","v":114},{"$f":"IF(進行表shinko!L18=\"\",\"\",IF(進行表shinko!L18<$AO$28,進行表shinko!L18,\"W\"))","v":"W"},{"$f":"IF(進行表shinko!E20=\"\",\"\",IF(進行表shinko!E20<$AO$28,進行表shinko!E20,\"W\"))","v":117},{"$f":"IF(進行表shinko!E76=\"\",\"\",IF(進行表shinko!E76<$AO$28,進行表shinko!E76,\"W\"))","v":95},{"$f":"IF(進行表shinko!L60=\"\",\"\",IF(進行表shinko!L60<$AO$28,進行表shinko!L60,\"W\"))","v":"W"},{"$f":"IF(進行表shinko!E62=\"\",\"\",IF(進行表shinko!E62<$AO$28,進行表shinko!E62,\"W\"))","v":"W"},{"$f":"☆登録touroku!F24","v":180},3,4,899,{"$f":"IF(COUNTBLANK($AC36:$AI36)=7,\"\",SUM(O$33:O$39))","v":186},4,260713]
[370818,null,null,null,null,null,null,5,{"$f":"☆登録touroku!C25","v":"山田　晋之"},null,null,{"$f":"IF(進行表shinko!J40=\"\",\"\",IF(進行表shinko!J40<$AO$28,進行表shinko!J40,\"W\"))","v":155},{"$f":"IF(進行表shinko!C58=\"\",\"\",IF(進行表shinko!C58<$AO$28,進行表shinko!C58,\"W\"))","v":160},{"$f":"IF(進行表shinko!J58=\"\",\"\",IF(進行表shinko!J58<$AO$28,進行表shinko!J58,\"W\"))","v":"W"},{"$f":"IF(進行表shinko!C76=\"\",\"\",IF(進行表shinko!C76<$AO$28,進行表shinko!C76,\"W\"))","v":"W"},{"$f":"IF(進行表shinko!C22=\"\",\"\",IF(進行表shinko!C22<$AO$28,進行表shinko!C22,\"W\"))","v":"W"},{"$f":"IF(進行表shinko!J22=\"\",\"\",IF(進行表shinko!J22<$AO$28,進行表shinko!J22,\"W\"))","v":0},{"$f":"IF(進行表shinko!C40=\"\",\"\",IF(進行表shinko!C40<$AO$28,進行表shinko!C40,\"W\"))","v":"W"},{"$f":"☆登録touroku!D25","v":180},4,3,1035,{"$f":"IF(COUNTBLANK($L37:$R37)=7,\"\",SUM(AG$33:AG$39))","v":217},4,5,{"$f":"☆登録touroku!E25","v":"中本　雅大"},null,null,{"$f":"IF(進行表shinko!E50=\"\",\"\",IF(進行表shinko!E50<$AO$28,進行表shinko!E50,\"W\"))","v":"W"},{"$f":"IF(進行表shinko!L34=\"\",\"\",IF(進行表shinko!L34<$AO$28,進行表shinko!L34,\"W\"))","v":117},{"$f":"IF(進行表shinko!E36=\"\",\"\",IF(進行表shinko!E36<$AO$28,進行表shinko!E36,\"W\"))","v":7},{"$f":"IF(進行表shinko!L20=\"\",\"\",IF(進行表shinko!L20<$AO$28,進行表shinko!L20,\"W\"))","v":"W"},{"$f":"IF(進行表shinko!E22=\"\",\"\",IF(進行表shinko!E22<$AO$28,進行表shinko!E22,\"W\"))","v":65},{"$f":"IF(進行表shinko!E78=\"\",\"\",IF(進行表shinko!E78<$AO$28,進行表shinko!E78,\"W\"))","v":143},{"$f":"IF(進行表shinko!L62=\"\",\"\",IF(進行表shinko!L62<$AO$28,進行表shinko!L62,\"W\"))","v":"W"},{"$f":"☆登録touroku!F25","v":180},3,4,872,{"$f":"IF(COUNTBLANK($AC37:$AI37)=7,\"\",SUM(P$33:P$39))","v":462},5,260410]
[40578,null,null,null,null,null,null,6,{"$f":"☆登録touroku!C26","v":"山田　晃司"},null,null,{"$f":"IF(進行表shinko!C42=\"\",\"\",IF(進行表shinko!C42<$AO$28,進行表shinko!C42,\"W\"))","v":43},{"$f":"IF(進行表shinko!J42=\"\",\"\",IF(進行表shinko!J42<$AO$28,進行表shinko!J42,\"W\"))","v":146},{"$f":"IF(進行表shinko!C60=\"\",\"\",IF(進行表shinko!C60<$AO$28,進行表shinko!C60,\"W\"))","v":133},{"$f":"IF(進行表shinko!J60=\"\",\"\",IF(進行表shinko!J60<$AO$28,進行表shinko!J60,\"W\"))","v":120},{"$f":"IF(進行表shinko!C78=\"\",\"\",IF(進行表shinko!C78<$AO$28,進行表shinko!C78,\"W\"))","v":"W"},{"$f":"IF(進行表shinko!C24=\"\",\"\",IF(進行表shinko!C24<$AO$28,進行表shinko!C24,\"W\"))","v":19},{"$f":"IF(進行表shinko!J24=\"\",\"\",IF(進行表shinko!J24<$AO$28,進行表shinko!J24,\"W\"))","v":80},{"$f":"☆登録touroku!D26","v":180},1,6,721,{"$f":"IF(COUNTBLANK($L38:$R38)=7,\"\",SUM(AH$33:AH$39))","v":143},7,6,{"$f":"☆登録touroku!E26","v":"末岡　修"},null,null,{"$f":"IF(進行表shinko!L50=\"\",\"\",IF(進行表shinko!L50<$AO$28,進行表shinko!L50,\"W\"))","v":"W"},{"$f":"IF(進行表shinko!E52=\"\",\"\",IF(進行表shinko!E52<$AO$28,進行表shinko!E52,\"W\"))","v":79},{"$f":"IF(進行表shinko!L36=\"\",\"\",IF(進行表shinko!L36<$AO$28,進行表shinko!L36,\"W\"))","v":171},{"$f":"IF(進行表shinko!E38=\"\",\"\",IF(進行表shinko!E38<$AO$28,進行表shinko!E38,\"W\"))","v":21},{"$f":"IF(進行表shinko!L22=\"\",\"\",IF(進行表shinko!L22<$AO$28,進行表shinko!L22,\"W\"))","v":"W"},{"$f":"IF(進行表shinko!E24=\"\",\"\",IF(進行表shinko!E24<$AO$28,進行表shinko!E24,\"W\"))","v":"W"},{"$f":"IF(進行表shinko!E80=\"\",\"\",IF(進行表shinko!E80<$AO$28,進行表shinko!E80,\"W\"))","v":"W"},{"$f":"☆登録touroku!F26","v":180},4,3,991,{"$f":"IF(COUNTBLANK($AC38:$AI38)=7,\"\",SUM(Q$33:Q$39))","v":217},3,370774]
[150576,null,null,null,null,null,null,7,{"$f":"☆登録touroku!C27","v":"宮野　早織"},null,null,{"$f":"IF(進行表shinko!J26=\"\",\"\",IF(進行表shinko!J26<$AO$28,進行表shinko!J26,\"W\"))","v":24},{"$f":"IF(進行表shinko!C44=\"\",\"\",IF(進行表shinko!C44<$AO$28,進行表shinko!C44,\"W\"))","v":54},{"$f":"IF(進行表shinko!J44=\"\",\"\",IF(進行表shinko!J44<$AO$28,進行表shinko!J44,\"W\"))","v":"W"},{"$f":"IF(進行表shinko!C62=\"\",\"\",IF(進行表shinko!C62<$AO$28,進行表shinko!C62,\"W\"))","v":43},{"$f":"IF(進行表shinko!J62=\"\",\"\",IF(進行表shinko!J62<$AO$28,進行表shinko!J62,\"W\"))","v":128},{"$f":"IF(進行表shinko!C80=\"\",\"\",IF(進行表shinko!C80<$AO$28,進行表shinko!C80,\"W\"))","v":40},{"$f":"IF(進行表shinko!C26=\"\",\"\",IF(進行表shinko!C26<$AO$28,進行表shinko!C26,\"W\"))","v":"W"},{"$f":"☆登録touroku!D27","v":140},2,5,731,{"$f":"IF(COUNTBLANK($L39:$R39)=7,\"\",SUM(AI$33:AI$39))","v":155},6,7,{"$f":"☆登録touroku!E27","v":"松房ゆかり"},null,null,{"$f":"IF(進行表shinko!E68=\"\",\"\",IF(進行表shinko!E68<$AO$28,進行表shinko!E68,\"W\"))","v":"W"},{"$f":"IF(進行表shinko!L52=\"\",\"\",IF(進行表shinko!L52<$AO$28,進行表shinko!L52,\"W\"))","v":"W"},{"$f":"IF(進行表shinko!E54=\"\",\"\",IF(進行表shinko!E54<$AO$28,進行表shinko!E54,\"W\"))","v":10},{"$f":"IF(進行表shinko!L38=\"\",\"\",IF(進行表shinko!L38<$AO$28,進行表shinko!L38,\"W\"))","v":88},{"$f":"IF(進行表shinko!E40=\"\",\"\",IF(進行表shinko!E40<$AO$28,進行表shinko!E40,\"W\"))","v":44},{"$f":"IF(進行表shinko!L24=\"\",\"\",IF(進行表shinko!L24<$AO$28,進行表shinko!L24,\"W\"))","v":"W"},{"$f":"IF(進行表shinko!E26=\"\",\"\",IF(進行表shinko!E26<$AO$28,進行表shinko!E26,\"W\"))","v":69},{"$f":"☆登録touroku!F27","v":140},3,4,811,{"$f":"IF(COUNTBLANK($AC39:$AI39)=7,\"\",SUM(R$33:R$39))","v":246},6,260565]
[null,null,null,null,null,null,null,null,null,null,null,null,null,null,null,null,null,null,null,null,null,{"$f":"IF(COUNTBLANK(L40:R40)=7,\"\",T40*180+SUM(L40:R40))","v":""}]
[null,null,null,null,null,null,null,null,null,null,null,null,null,null,null,null,null,null,null,{"$f":"IF(COUNTBLANK(T33:T39)=7,0,SUM(T33:T39))","v":24},{"$f":"IF(COUNTBLANK(U33:U39)=7,0,SUM(U33:U39))","v":25},{"$f":"IF(COUNTBLANK(V33:V39)=7,0,SUM(V33:V39))","v":6480},{"$f":"IF(COUNTBLANK(W33:W39)=7,0,SUM(W33:W39))","v":1970},null,null,null,null,null,null,null,null,null,null,null,null,null,{"$f":"IF(COUNTBLANK(AK33:AK39)=7,0,SUM(AK33:AK39))","v":25},{"$f":"IF(COUNTBLANK(AL33:AL39)=7,0,SUM(AL33:AL39))","v":24},{"$f":"IF(COUNTBLANK(AM33:AM39)=7,0,SUM(AM33:AM39))","v":6530},{"$f":"IF(COUNTBLANK(AN33:AN39)=7,0,SUM(AN33:AN39))","v":2078}]
[null,null,null,null,null,null,null,null,null,null,null,null,null,null,null,null,null,null,null,"総失点",null,"ランキング",null,null,null,null,null,null,null,null,null,null,null,null,null,null,"総失点",null,"ランキング"]
[null,null,null,null,null,null,null,null,{"$f":"I33","v":"斉藤　裕児"},null,null,null,null,null,null,null,null,null,null,{"$f":"IF(COUNTBLANK($L33:$R33)=7,\"\",SUM(AC$33:AC$39))","v":127},null,{"$f":"IF(COUNTBLANK($L33:$R33)=7,\"\",T33*100000000+$V33*10000+(9999-$T43))","v":208749872},null,null,null,{"$f":"Z33","v":"森田　憲"},null,null,null,null,null,null,null,null,null,null,{"$f":"IF(COUNTBLANK($AC33:$AI33)=7,\"\",SUM(L$33:L$39))","v":343},null,{"$f":"IF(COUNTBLANK($AC33:$AI33)=7,\"\",AK33*100000000+AM33*10000+(9999-AK43))","v":612469656}]
[null,null,null,null,null,null,null,null,{"$f":"I34","v":"近藤　拓馬"},null,null,null,null,null,null,null,null,null,null,{"$f":"IF(COUNTBLANK($L34:$R34)=7,\"\",SUM(AD$33:AD$39))","v":538},null,{"$f":"IF(COUNTBLANK($L34:$R34)=7,\"\",T34*100000000+$V34*10000+(9999-$T44))","v":509899461},null,null,null,{"$f":"Z34","v":"杉本　博章"},null,null,null,null,null,null,null,null,null,null,{"$f":"IF(COUNTBLANK($AC34:$AI34)=7,\"\",SUM(M$33:M$39))","v":491},null,{"$f":"IF(COUNTBLANK($AC34:$AI34)=7,\"\",AK34*100000000+AM34*10000+(9999-AK44))","v":510919508}]
[null,null,null,null,null,null,null,null,"吉向　翔平",null,null,null,null,null,null,null,null,null,null,{"$f":"IF(COUNTBLANK($L35:$R35)=7,\"\",SUM(AE$33:AE$39))","v":452},null,510269547,null,null,null,"丹次　力良",null,null,null,null,null,null,null,null,null,null,{"$f":"IF(COUNTBLANK($AC35:$AI35)=7,\"\",SUM(N$33:N$39))","v":133},null,106209866]
[null,null,null,null,null,null,null,null,"白戸　玲人",null,null,null,null,null,null,null,null,null,null,{"$f":"IF(COUNTBLANK($L36:$R36)=7,\"\",SUM(AF$33:AF$39))","v":338},null,511049661,null,null,null,"和田宗一郎",null,null,null,null,null,null,null,null,null,null,{"$f":"IF(COUNTBLANK($AC36:$AI36)=7,\"\",SUM(O$33:O$39))","v":186},null,308999813]
[null,null,null,null,null,null,null,null,"山田　晋之",null,null,null,null,null,null,null,null,null,null,{"$f":"IF(COUNTBLANK($L37:$R37)=7,\"\",SUM(AG$33:AG$39))","v":217},null,410359782,null,null,null,"中本　雅大",null,null,null,null,null,null,null,null,null,null,{"$f":"IF(COUNTBLANK($AC37:$AI37)=7,\"\",SUM(P$33:P$39))","v":462},null,308729537]
[null,null,null,null,null,null,null,null,"山田　晃司",null,null,null,null,null,null,null,null,null,null,{"$f":"IF(COUNTBLANK($L38:$R38)=7,\"\",SUM(AH$33:AH$39))","v":143},null,107219856,null,null,null,"末岡　修",null,null,null,null,null,null,null,null,null,null,{"$f":"IF(COUNTBLANK($AC38:$AI38)=7,\"\",SUM(Q$33:Q$39))","v":217},null,409919782]
[null,null,null,null,null,null,null,null,"宮野　早織",null,null,null,null,null,null,null,null,null,null,{"$f":"IF(COUNTBLANK($L39:$R39)=7,\"\",SUM(AI$33:AI$39))","v":155},null,207319844,null,null,null,"松房ゆかり",null,null,null,null,null,null,null,null,null,null,{"$f":"IF(COUNTBLANK($AC39:$AI39)=7,\"\",SUM(R$33:R$39))","v":246},null,308119753]
[null,null,null,null,null,null,null,null,{"$f":"IF(ISERROR(INDEX($I$43:$X$49,MATCH($V50,$V$43:V$49,0),1)),\"\",INDEX($I$43:$X$49,MATCH($V50,$V$43:V$49,0),1)&\" (\"&B29&\")\")","v":"白戸　玲人 (奈良)"},null,null,"1位",null,null,null,null,null,null,null,null,null,{"$f":"IF(AND($T$41=0,$U$41=0),\"\",LARGE(V43:V49,1))","v":511049661},null,null,null,{"$f":"IF(ISERROR(INDEX($Z$43:$AO$49,MATCH($AM50,$AM$43:AM$49,0),1)),\"\",INDEX($Z$43:$AO$49,MATCH($AM50,$AM$43:AM$49,0),1)&\" (\"&F29&\")\")","v":"森田　憲 (和歌山)"},null,null,"1位",null,null,null,null,null,null,null,null,null,{"$f":"IF(AND($AK$41=0,$AL$41=0),\"\",LARGE(AM43:AM49,1))","v":612469656}]

{"sheet":"★(空欄)成績表seiseki","index":5,"n_rows":50,"n_cols":42,"rows_kept":50,"cut":false,"hidden":false,"merged":[[28,39,28,40],[29,23,31,23],[29,40,31,40],[29,34,31,34],[29,35,31,35],[29,36,31,36],[29,39,31,39],[29,31,31,31],[29,32,31,32],[29,33,31,33],[29,29,31,29],[29,37,31,37],[29,38,31,38],[29,28,31,28],[29,30,31,30],[29,25,31,27],[28,36,28,38],[38,25,38,27],[32,25,32,27],[33,25,33,27],[34,25,34,27],[35,25,35,27],[36,25,36,27],[37,25,37,27],[24,27,26,27],[28,5,28,6],[29,14,31,14],[24,24,26,24],[24,23,26,23],[29,11,31,11],[29,12,31,12],[29,8,31,10],[29,13,31,13],[29,19,31,19],[29,22,31,22],[28,19,28,21],[28,22,28,23],[24,14,26,14],[24,15,26,15],[24,22,26,22],[24,16,26,16],[14,7,16,7],[14,8,16,8],[14,16,16,16],[14,17,16,17],[9,22,11,22],[9,5,11,5],[9,6,11,6],[9,7,11,7],[9,12,11,12],[9,18,11,18],[12,21,13,21],[9,14,11,14],[9,15,11,15],[9,16,11,16],[9,9,11,9],[19,16,21,16],[9,23,11,23],[9,27,11,27],[19,23,21,23],[19,15,21,15],[19,17,21,17],[22,31,23,31],[9,19,11,19],[9,29,11,29],[14,28,16,28],[14,27,16,27],[19,18,21,18],[9,2,11,2],[9,8,11,8],[9,13,11,13],[6,36,6,40],[12,31,13,31],[6,22,6,25],[9,32,11,32],[14,35,16,35],[14,36,16,36],[14,32,16,32],[9,33,11,33],[9,25,11,25],[9,35,11,35],[9,26,11,26],[14,24,16,24],[14,25,16,25],[9,36,11,36],[9,38,11,38],[9,34,11,34],[14,26,16,26],[14,37,16,37],[14,4,16,4],[14,5,16,5],[14,6,16,6],[5,1,6,9],[6,10,6,13],[24,2,26,2],[24,3,26,3],[24,4,26,4],[24,5,26,5],[24,6,26,6],[12,1,13,1],[22,21,23,21],[12,11,13,11],[24,7,26,7],[19,2,21,2],[19,3,21,3],[19,5,21,5],[19,6,21,6],[19,4,21,4],[14,2,16,2],[14,3,16,3],[24,8,26,8],[19,8,21,8],[19,7,21,7],[9,3,11,3],[9,4,11,4],[19,14,21,14],[28,1,28,2],[28,3,28,4],[6,29,6,32],[24,25,26,25],[24,18,26,18],[24,26,26,26],[19,26,21,26],[19,28,21,28],[19,27,21,27],[19,25,21,25],[14,12,16,12],[14,13,16,13],[14,14,16,14],[14,15,16,15],[9,17,11,17],[14,18,16,18],[14,22,16,22],[14,23,16,23],[19,12,21,12],[19,13,21,13],[24,28,26,28],[22,1,23,1],[22,11,23,11],[24,13,26,13],[40,1,40,2],[40,4,40,5],[37,4,37,5],[38,1,38,2],[38,4,38,5],[39,1,39,2],[39,4,39,5],[29,4,29,5],[30,1,30,2],[30,4,30,5],[37,1,37,2],[34,4,34,5],[35,1,35,2],[35,4,35,5],[36,1,36,2],[36,4,36,5],[33,1,33,2],[33,4,33,5],[34,1,34,2],[31,1,31,2],[32,1,32,2],[32,4,32,5],[29,1,29,2],[24,17,26,17],[31,4,31,5],[29,20,31,20],[29,21,31,21],[29,18,31,18],[29,15,31,15],[29,17,31,17],[29,16,31,16],[24,12,26,12],[41,19,41,20],[41,21,41,23],[41,36,41,37],[41,38,41,40],[42,8,42,10],[42,19,42,20],[42,21,42,23],[42,25,42,27],[42,36,42,37],[42,38,42,40],[43,25,43,27],[43,36,43,37],[43,38,43,40],[44,8,44,10],[44,19,44,20],[44,21,44,23],[44,25,44,27],[44,36,44,37],[44,38,44,40],[43,8,43,10],[43,19,43,20],[43,21,43,23],[47,36,47,37],[47,38,47,40],[48,8,48,10],[48,19,48,20],[48,21,48,23],[48,25,48,27],[48,36,48,37],[48,38,48,40],[45,8,45,10],[45,19,45,20],[45,21,45,23],[45,25,45,27],[45,36,45,37],[45,38,45,40],[46,8,46,10],[46,19,46,20],[46,21,46,23],[46,25,46,27],[46,36,46,37],[46,38,46,40],[14,34,16,34],[14,33,16,33],[9,37,11,37],[49,8,49,10],[49,21,49,23],[49,25,49,27],[49,38,49,40],[1,1,1,24],[2,1,2,16],[24,9,26,9],[24,19,26,19],[24,29,26,29],[24,32,26,32],[24,33,26,33],[24,34,26,34],[24,35,26,35],[24,36,26,36],[24,37,26,37],[24,38,26,38],[24,39,26,39],[47,8,47,10],[47,19,47,20],[47,21,47,23],[47,25,47,27],[3,1,3,40],[4,1,4,40],[27,38,27,39],[9,39,11,39],[14,9,16,9],[14,19,16,19],[14,29,16,29],[14,39,16,39],[19,9,21,9],[19,19,21,19],[19,29,21,29],[19,32,21,32],[19,33,21,33],[19,34,21,34],[19,35,21,35],[19,36,21,36],[19,37,21,37],[19,38,21,38],[19,39,21,39],[19,24,21,24],[19,22,21,22],[9,24,11,24],[14,38,16,38],[9,28,11,28]]}
[null,"このシートは、左下のHRチェック、および右上のMVP、VP、HRの各賞対象者自動表示。"]
[null,"右上のMVP、VP、HRの各賞対象者も自動表示されます。"]
[]
[]
[null,"MVP、VPは「W数多い＞TP多い（ハンデに対応）＞総失点少ない(”W”を除いた合計、又失点のハンデは未対応)」で判定、同率の場合は手入力でお願いします。"]
[null,{"$f":"☆登録touroku!B11","v":"第1回　和奈対抗戦"}]
[null,null,null,null,null,null,null,null,null,null,{"$f":"☆登録touroku!C13","v":"2016-09-25"},null,null,null,"於",{"$f":"☆登録touroku!C15","v":"オーシャンドリーム"},null,null,null,null,"MVP",null,{"$f":"IF(▲成績表seiseki!W7=\"\",\"\",▲成績表seiseki!W7)","v":"森田　憲 (和歌山)"},null,null,null,null,"VP",null,{"$f":"IF(▲成績表seiseki!AD7=\"\",\"\",▲成績表seiseki!AD7)","v":"白戸　玲人 (奈良)"},null,null,null,null,"HR",null,{"$f":"IF(▲成績表seiseki!AK7=\"\",\"\",▲成績表seiseki!AK7)","v":"和田宗一郎 (和歌山) 444 p"}]
[]
[null,null,1,2,3,4,5,6,7,null,null,null,8,9,10,11,12,13,14,null,null,null,15,16,17,18,19,20,21,null,null,null,22,23,24,25,26,27,28]
[null,null,{"$f":"AC30","v":"斉藤　裕児"},"近藤　拓馬","吉向　翔平","白戸　玲人","山田　晋之","山田　晃司","宮野　早織",null,null,null,{"$f":"C10","v":"斉藤　裕児"},"近藤　拓馬","吉向　翔平","白戸　玲人","山田　晋之","山田　晃司","宮野　早織",null,null,null,{"$f":"M10","v":"斉藤　裕児"},"近藤　拓馬","吉向　翔平","白戸　玲人","山田　晋之","山田　晃司","宮野　早織",null,null,null,{"$f":"W10","v":"斉藤　裕児"},"近藤　拓馬","吉向　翔平","白戸　玲人","山田　晋之","山田　晃司","宮野　早織"]
[]
[]
[null,1,{"$f":"IF(L33=\"\",\"\",IF(L33<$AO$28,\"×\",\"○\"))","v":"×"},{"$f":"IF(M34=\"\",\"\",IF(M34<$AO$28,\"×\",\"○\"))","v":"○"},{"$f":"IF(N35=\"\",\"\",IF(N35<$AO$28,\"×\",\"○\"))","v":"○"},{"$f":"IF(O36=\"\",\"\",IF(O36<$AO$28,\"×\",\"○\"))","v":"○"},{"$f":"IF(P37=\"\",\"\",IF(P37<$AO$28,\"×\",\"○\"))","v":"○"},{"$f":"IF(Q38=\"\",\"\",IF(Q38<$AO$28,\"×\",\"○\"))","v":"×"},{"$f":"IF(R39=\"\",\"\",IF(R39<$AO$28,\"×\",\"○\"))","v":"○"},null,null,2,{"$f":"IF(M33=\"\",\"\",IF(M33<$AO$28,\"×\",\"○\"))","v":"×"},{"$f":"IF(N34=\"\",\"\",IF(N34<$AO$28,\"×\",\"○\"))","v":"○"},{"$f":"IF(O35=\"\",\"\",IF(O35<$AO$28,\"×\",\"○\"))","v":"×"},{"$f":"IF(P36=\"\",\"\",IF(P36<$AO$28,\"×\",\"○\"))","v":"×"},{"$f":"IF(Q37=\"\",\"\",IF(Q37<$AO$28,\"×\",\"○\"))","v":"×"},{"$f":"IF(R38=\"\",\"\",IF(R38<$AO$28,\"×\",\"○\"))","v":"×"},{"$f":"IF(L39=\"\",\"\",IF(L39<$AO$28,\"×\",\"○\"))","v":"×"},null,null,3,{"$f":"IF(N33=\"\",\"\",IF(N33<$AO$28,\"×\",\"○\"))","v":"○"},{"$f":"IF(O34=\"\",\"\",IF(O34<$AO$28,\"×\",\"○\"))","v":"○"},{"$f":"IF(P35=\"\",\"\",IF(P35<$AO$28,\"×\",\"○\"))","v":"○"},{"$f":"IF(Q36=\"\",\"\",IF(Q36<$AO$28,\"×\",\"○\"))","v":"○"},{"$f":"IF(R37=\"\",\"\",IF(R37<$AO$28,\"×\",\"○\"))","v":"○"},{"$f":"IF(L38=\"\",\"\",IF(L38<$AO$28,\"×\",\"○\"))","v":"×"},{"$f":"IF(M39=\"\",\"\",IF(M39<$AO$28,\"×\",\"○\"))","v":"×"},null,null,4,{"$f":"IF(O33=\"\",\"\",IF(O33<$AO$28,\"×\",\"○\"))","v":"○"},{"$f":"IF(P34=\"\",\"\",IF(P34<$AO$28,\"×\",\"○\"))","v":"○"},{"$f":"IF(Q35=\"\",\"\",IF(Q35<$AO$28,\"×\",\"○\"))","v":"○"},{"$f":"IF(R36=\"\",\"\",IF(R36<$AO$28,\"×\",\"○\"))","v":"○"},{"$f":"IF(L37=\"\",\"\",IF(L37<$AO$28,\"×\",\"○\"))","v":"×"},{"$f":"IF(M38=\"\",\"\",IF(M38<$AO$28,\"×\",\"○\"))","v":"×"},{"$f":"IF(N39=\"\",\"\",IF(N39<$AO$28,\"×\",\"○\"))","v":"○"}]
[null,null,{"$f":"IF(L33=\"\",\"\",IF(L33<$AO$28,\"○\",\"×\"))","v":"○"},{"$f":"IF(M34=\"\",\"\",IF(M34<$AO$28,\"○\",\"×\"))","v":"×"},{"$f":"IF(N35=\"\",\"\",IF(N35<$AO$28,\"○\",\"×\"))","v":"×"},{"$f":"IF(O36=\"\",\"\",IF(O36<$AO$28,\"○\",\"×\"))","v":"×"},{"$f":"IF(P37=\"\",\"\",IF(P37<$AO$28,\"○\",\"×\"))","v":"×"},{"$f":"IF(Q38=\"\",\"\",IF(Q38<$AO$28,\"○\",\"×\"))","v":"○"},{"$f":"IF(R39=\"\",\"\",IF(R39<$AO$28,\"○\",\"×\"))","v":"×"},null,null,null,{"$f":"IF(M33=\"\",\"\",IF(M33<$AO$28,\"○\",\"×\"))","v":"○"},{"$f":"IF(N34=\"\",\"\",IF(N34<$AO$28,\"○\",\"×\"))","v":"×"},{"$f":"IF(O35=\"\",\"\",IF(O35<$AO$28,\"○\",\"×\"))","v":"○"},{"$f":"IF(P36=\"\",\"\",IF(P36<$AO$28,\"○\",\"×\"))","v":"○"},{"$f":"IF(Q37=\"\",\"\",IF(Q37<$AO$28,\"○\",\"×\"))","v":"○"},{"$f":"IF(R38=\"\",\"\",IF(R38<$AO$28,\"○\",\"×\"))","v":"○"},{"$f":"IF(L39=\"\",\"\",IF(L39<$AO$28,\"○\",\"×\"))","v":"○"},null,null,null,{"$f":"IF(N33=\"\",\"\",IF(N33<$AO$28,\"○\",\"×\"))","v":"×"},{"$f":"IF(O34=\"\",\"\",IF(O34<$AO$28,\"○\",\"×\"))","v":"×"},{"$f":"IF(P35=\"\",\"\",IF(P35<$AO$28,\"○\",\"×\"))","v":"×"},{"$f":"IF(Q36=\"\",\"\",IF(Q36<$AO$28,\"○\",\"×\"))","v":"×"},{"$f":"IF(R37=\"\",\"\",IF(R37<$AO$28,\"○\",\"×\"))","v":"×"},{"$f":"IF(L38=\"\",\"\",IF(L38<$AO$28,\"○\",\"×\"))","v":"○"},{"$f":"IF(M39=\"\",\"\",IF(M39<$AO$28,\"○\",\"×\"))","v":"○"},null,null,null,{"$f":"IF(O33=\"\",\"\",IF(O33<$AO$28,\"○\",\"×\"))","v":"×"},{"$f":"IF(P34=\"\",\"\",IF(P34<$AO$28,\"○\",\"×\"))","v":"×"},{"$f":"IF(Q35=\"\",\"\",IF(Q35<$AO$28,\"○\",\"×\"))","v":"×"},{"$f":"IF(R36=\"\",\"\",IF(R36<$AO$28,\"○\",\"×\"))","v":"×"},{"$f":"IF(L37=\"\",\"\",IF(L37<$AO$28,\"○\",\"×\"))","v":"○"},{"$f":"IF(M38=\"\",\"\",IF(M38<$AO$28,\"○\",\"×\"))","v":"○"},{"$f":"IF(N39=\"\",\"\",IF(N39<$AO$28,\"○\",\"×\"))","v":"×"}]
[null,null,{"$f":"L30","v":"森田　憲"},"杉本　博章","丹次　力良","和田宗一郎","中本　雅大","末岡　修","松房ゆかり",null,null,null,{"$f":"D15","v":"杉本　博章"},"丹次　力良","和田宗一郎","中本　雅大","末岡　修","松房ゆかり",{"$f":"C15","v":"森田　憲"},null,null,null,{"$f":"N15","v":"丹次　力良"},"和田宗一郎","中本　雅大","末岡　修","松房ゆかり","森田　憲",{"$f":"M15","v":"杉本　博章"},null,null,null,{"$f":"X15","v":"和田宗一郎"},"中本　雅大","末岡　修","松房ゆかり","森田　憲","杉本　博章",{"$f":"W15","v":"丹次　力良"}]
[]
[]
[]
[null,null,29,30,31,32,33,34,35,null,null,null,36,37,38,39,40,41,42,null,null,null,43,44,45,46,47,48,49]
[null,null,{"$f":"C10","v":"斉藤　裕児"},{"$f":"D10","v":"近藤　拓馬"},"吉向　翔平","白戸　玲人","山田　晋之","山田　晃司","宮野　早織",null,null,null,{"$f":"C20","v":"斉藤　裕児"},"近藤　拓馬","吉向　翔平","白戸　玲人","山田　晋之","山田　晃司","宮野　早織",null,null,null,{"$f":"M20","v":"斉藤　裕児"},"近藤　拓馬","吉向　翔平","白戸　玲人","山田　晋之","山田　晃司","宮野　早織"]
[]
[]
[null,5,{"$f":"IF(P33=\"\",\"\",IF(P33<$AO$28,\"×\",\"○\"))","v":"×"},{"$f":"IF(Q34=\"\",\"\",IF(Q34<$AO$28,\"×\",\"○\"))","v":"○"},{"$f":"IF(R35=\"\",\"\",IF(R35<$AO$28,\"×\",\"○\"))","v":"○"},{"$f":"IF(L36=\"\",\"\",IF(L36<$AO$28,\"×\",\"○\"))","v":"×"},{"$f":"IF(M37=\"\",\"\",IF(M37<$AO$28,\"×\",\"○\"))","v":"×"},{"$f":"IF(N38=\"\",\"\",IF(N38<$AO$28,\"×\",\"○\"))","v":"×"},{"$f":"IF(O39=\"\",\"\",IF(O39<$AO$28,\"×\",\"○\"))","v":"×"},null,null,6,{"$f":"IF(Q33=\"\",\"\",IF(Q33<$AO$28,\"×\",\"○\"))","v":"×"},{"$f":"IF(R34=\"\",\"\",IF(R34<$AO$28,\"×\",\"○\"))","v":"×"},{"$f":"IF(L35=\"\",\"\",IF(L35<$AO$28,\"×\",\"○\"))","v":"○"},{"$f":"IF(M36=\"\",\"\",IF(M36<$AO$28,\"×\",\"○\"))","v":"○"},{"$f":"IF(N37=\"\",\"\",IF(N37<$AO$28,\"×\",\"○\"))","v":"○"},{"$f":"IF(O38=\"\",\"\",IF(O38<$AO$28,\"×\",\"○\"))","v":"×"},{"$f":"IF(P39=\"\",\"\",IF(P39<$AO$28,\"×\",\"○\"))","v":"×"},null,null,7,{"$f":"IF(R33=\"\",\"\",IF(R33<$AO$28,\"×\",\"○\"))","v":"×"},{"$f":"IF(L34=\"\",\"\",IF(L34<$AO$28,\"×\",\"○\"))","v":"×"},{"$f":"IF(M35=\"\",\"\",IF(M35<$AO$28,\"×\",\"○\"))","v":"×"},{"$f":"IF(N36=\"\",\"\",IF(N36<$AO$28,\"×\",\"○\"))","v":"○"},{"$f":"IF(O37=\"\",\"\",IF(O37<$AO$28,\"×\",\"○\"))","v":"○"},{"$f":"IF(P38=\"\",\"\",IF(P38<$AO$28,\"×\",\"○\"))","v":"○"},{"$f":"IF(Q39=\"\",\"\",IF(Q39<$AO$28,\"×\",\"○\"))","v":"×"}]
[null,null,{"$f":"IF(P33=\"\",\"\",IF(P33<$AO$28,\"○\",\"×\"))","v":"○"},{"$f":"IF(Q34=\"\",\"\",IF(Q34<$AO$28,\"○\",\"×\"))","v":"×"},{"$f":"IF(R35=\"\",\"\",IF(R35<$AO$28,\"○\",\"×\"))","v":"×"},{"$f":"IF(L36=\"\",\"\",IF(L36<$AO$28,\"○\",\"×\"))","v":"○"},{"$f":"IF(M37=\"\",\"\",IF(M37<$AO$28,\"○\",\"×\"))","v":"○"},{"$f":"IF(N38=\"\",\"\",IF(N38<$AO$28,\"○\",\"×\"))","v":"○"},{"$f":"IF(O39=\"\",\"\",IF(O39<$AO$28,\"○\",\"×\"))","v":"○"},null,null,null,{"$f":"IF(Q33=\"\",\"\",IF(Q33<$AO$28,\"○\",\"×\"))","v":"○"},{"$f":"IF(R34=\"\",\"\",IF(R34<$AO$28,\"○\",\"×\"))","v":"○"},{"$f":"IF(L35=\"\",\"\",IF(L35<$AO$28,\"○\",\"×\"))","v":"×"},{"$f":"IF(M36=\"\",\"\",IF(M36<$AO$28,\"○\",\"×\"))","v":"×"},{"$f":"IF(N37=\"\",\"\",IF(N37<$AO$28,\"○\",\"×\"))","v":"×"},{"$f":"IF(O38=\"\",\"\",IF(O38<$AO$28,\"○\",\"×\"))","v":"○"},{"$f":"IF(P39=\"\",\"\",IF(P39<$AO$28,\"○\",\"×\"))","v":"○"},null,null,null,{"$f":"IF(R33=\"\",\"\",IF(R33<$AO$28,\"○\",\"×\"))","v":"○"},{"$f":"IF(L34=\"\",\"\",IF(L34<$AO$28,\"○\",\"×\"))","v":"○"},{"$f":"IF(M35=\"\",\"\",IF(M35<$AO$28,\"○\",\"×\"))","v":"○"},{"$f":"IF(N36=\"\",\"\",IF(N36<$AO$28,\"○\",\"×\"))","v":"×"},{"$f":"IF(O37=\"\",\"\",IF(O37<$AO$28,\"○\",\"×\"))","v":"×"},{"$f":"IF(P38=\"\",\"\",IF(P38<$AO$28,\"○\",\"×\"))","v":"×"},{"$f":"IF(Q39=\"\",\"\",IF(Q39<$AO$28,\"○\",\"×\"))","v":"○"}]
[null,null,{"$f":"G15","v":"中本　雅大"},{"$f":"H15","v":"末岡　修"},{"$f":"I15","v":"松房ゆかり"},{"$f":"C15","v":"森田　憲"},{"$f":"D15","v":"杉本　博章"},{"$f":"E15","v":"丹次　力良"},{"$f":"F15","v":"和田宗一郎"},null,null,null,{"$f":"Q15","v":"末岡　修"},{"$f":"R15","v":"松房ゆかり"},{"$f":"S15","v":"森田　憲"},{"$f":"M15","v":"杉本　博章"},{"$f":"N15","v":"丹次　力良"},{"$f":"O15","v":"和田宗一郎"},{"$f":"P$15","v":"中本　雅大"},null,null,null,{"$f":"AA15","v":"松房ゆかり"},{"$f":"AB15","v":"森田　憲"},"杉本　博章",{"$f":"W15","v":"丹次　力良"},{"$f":"X15","v":"和田宗一郎"},"中本　雅大","末岡　修"]
[]
[]
[null,null,null,null,null,null,null,null,null,null,null,null,null,null,null,null,null,null,null,null,null,null,null,null,null,null,null,null,null,null,null,null,null,null,null,null,null,null,"基準点：",null,{"$f":"☆登録touroku!C17","v":180}]
[null,{"$f":"☆登録touroku!C20","v":"奈良"},null,"HR",null,{"$f":"☆登録touroku!E20","v":"和歌山"},null,null,null,null,null,1,2,3,4,5,6,7,null,"total point",null,null,{"$f":"IF(T40=\"\",\"\",T40*180+V40)","v":""},null,null,null,null,null,1,2,3,4,5,6,7,null,"total point",null,null,{"$f":"IF(AK40=\"\",\"\",AK40*180+AM40)","v":""}]
[null,"選手名",null,"点","選手名",null,"点",null,null,null,null,{"$f":"☆登録touroku!E21","v":"森田　憲"},{"$f":"☆登録touroku!E22","v":"杉本　博章"},{"$f":"☆登録touroku!E23","v":"丹次　力良"},{"$f":"☆登録touroku!E24","v":"和田宗一郎"},{"$f":"☆登録touroku!E25","v":"中本　雅大"},{"$f":"☆登録touroku!E26","v":"末岡　修"},{"$f":"☆登録touroku!E27","v":"松房ゆかり"},"持ち点","W","L","TP","失点","R",null,null,null,null,{"$f":"I33","v":"斉藤　裕児"},{"$f":"I34","v":"近藤　拓馬"},{"$f":"I35","v":"吉向　翔平"},{"$f":"I36","v":"白戸　玲人"},{"$f":"I37","v":"山田　晋之"},{"$f":"I38","v":"山田　晃司"},{"$f":"I39","v":"宮野　早織"},"持ち点","W","L","TP","失点","R"]
[null,{"$f":"IF(▲成績表seiseki!B31=\"\",\"\",▲成績表seiseki!B31)","v":""},null,{"$f":"IF(▲成績表seiseki!D31=\"\",\"\",▲成績表seiseki!D31)","v":""},{"$f":"IF(▲成績表seiseki!E31=\"\",\"\",▲成績表seiseki!E31)","v":""},null,{"$f":"IF(▲成績表seiseki!G31=\"\",\"\",▲成績表seiseki!G31)","v":""}]
[null,{"$f":"IF(▲成績表seiseki!B32=\"\",\"\",▲成績表seiseki!B32)","v":""},null,{"$f":"IF(▲成績表seiseki!D32=\"\",\"\",▲成績表seiseki!D32)","v":""},{"$f":"IF(▲成績表seiseki!E32=\"\",\"\",▲成績表seiseki!E32)","v":""},null,{"$f":"IF(▲成績表seiseki!G32=\"\",\"\",▲成績表seiseki!G32)","v":""}]
[{"$f":"S33*100000-T33*10000+U33-V33","v":17979131},{"$f":"IF(▲成績表seiseki!B33=\"\",\"\",▲成績表seiseki!B33)","v":""},null,{"$f":"IF(▲成績表seiseki!D33=\"\",\"\",▲成績表seiseki!D33)","v":""},{"$f":"IF(▲成績表seiseki!E33=\"\",\"\",▲成績表seiseki!E33)","v":""},null,{"$f":"IF(▲成績表seiseki!G33=\"\",\"\",▲成績表seiseki!G33)","v":""},1,{"$f":"☆登録touroku!C21","v":"斉藤　裕児"},null,null,{"$f":"IF(進行表shinko!C14=\"\",\"\",IF(進行表shinko!C14<$AO$28,進行表shinko!C14,\"W\"))","v":23},{"$f":"IF(進行表shinko!J14=\"\",\"\",IF(進行表shinko!J14<$AO$28,進行表shinko!J14,\"W\"))","v":28},{"$f":"IF(進行表shinko!C32=\"\",\"\",IF(進行表shinko!C32<$AO$28,進行表shinko!C32,\"W\"))","v":"W"},{"$f":"IF(進行表shinko!J32=\"\",\"\",IF(進行表shinko!J32<$AO$28,進行表shinko!J32,\"W\"))","v":"W"},{"$f":"IF(進行表shinko!C50=\"\",\"\",IF(進行表shinko!C50<$AO$28,進行表shinko!C50,\"W\"))","v":167},{"$f":"IF(進行表shinko!J50=\"\",\"\",IF(進行表shinko!J50<$AO$28,進行表shinko!J50,\"W\"))","v":158},{"$f":"IF(進行表shinko!C68=\"\",\"\",IF(進行表shinko!C68<$AO$28,進行表shinko!C68,\"W\"))","v":138},{"$f":"☆登録touroku!D21","v":180},{"$f":"IF(COUNTBLANK($L33:$R33)=7,\"\",COUNTIF($L33:$R33,\"W\"))","v":2},{"$f":"IF(COUNTBLANK($L33:$R33)=7,\"\",COUNTIF($L33:$R33,\">=0\"))","v":5},{"$f":"IF(COUNTBLANK($L33:$R33)=7,\"\",INT((SUM($L33:$R33)+($S33*T33))*$AO$28/$S33))","v":874},{"$f":"IF(COUNTBLANK($L33:$R33)=7,\"\",SUM(AC$33:AC$39))","v":127},{"$f":"IF($T$41+$U$41=49,RANK($V43,$V$43:$V$49),\"\")","v":5},1,{"$f":"☆登録touroku!E21","v":"森田　憲"},null,null,{"$f":"IF(進行表shinko!E14=\"\",\"\",IF(進行表shinko!E14<$AO$28,進行表shinko!E14,\"W\"))","v":"W"},{"$f":"IF(進行表shinko!E70=\"\",\"\",IF(進行表shinko!E70<$AO$28,進行表shinko!E70,\"W\"))","v":"W"},{"$f":"IF(進行表shinko!L54=\"\",\"\",IF(進行表shinko!L54<$AO$28,進行表shinko!L54,\"W\"))","v":166},{"$f":"IF(進行表shinko!E56=\"\",\"\",IF(進行表shinko!E56<$AO$28,進行表shinko!E56,\"W\"))","v":"W"},{"$f":"IF(進行表shinko!L40=\"\",\"\",IF(進行表shinko!L40<$AO$28,進行表shinko!L40,\"W\"))","v":"W"},{"$f":"IF(進行表shinko!E42=\"\",\"\",IF(進行表shinko!E42<$AO$28,進行表shinko!E42,\"W\"))","v":"W"},{"$f":"IF(進行表shinko!L26=\"\",\"\",IF(進行表shinko!L26<$AO$28,進行表shinko!L26,\"W\"))","v":"W"},{"$f":"☆登録touroku!F21","v":180},{"$f":"IF(COUNTBLANK($AC33:$AI33)=7,\"\",COUNTIF($AC33:$AI33,\"W\"))","v":6},{"$f":"IF(COUNTBLANK($AC33:$AI33)=7,\"\",COUNTIF($AC33:$AI33,\">=0\"))","v":1},{"$f":"IF(COUNTBLANK($AC33:$AI33)=7,\"\",INT((SUM($AC33:$AI33)+($AJ33*$AK33))*$AO$28/$AJ33))","v":1246},{"$f":"IF(COUNTBLANK($AC33:$AI33)=7,\"\",SUM(L$33:L$39))","v":343},{"$f":"IF($AK$41+$AL$41=49,RANK($AM43,$AM$43:$AM$49),\"\")","v":1},{"$f":"AJ33*100000-AK33*10000+AL33-AM33","v":17938755}]
[17949013,{"$f":"IF(▲成績表seiseki!B34=\"\",\"\",▲成績表seiseki!B34)","v":""},null,{"$f":"IF(▲成績表seiseki!D34=\"\",\"\",▲成績表seiseki!D34)","v":""},{"$f":"IF(▲成績表seiseki!E34=\"\",\"\",▲成績表seiseki!E34)","v":""},null,{"$f":"IF(▲成績表seiseki!G34=\"\",\"\",▲成績表seiseki!G34)","v":""},2,{"$f":"☆登録touroku!C22","v":"近藤　拓馬"},null,null,{"$f":"IF(進行表shinko!C70=\"\",\"\",IF(進行表shinko!C70<$AO$28,進行表shinko!C70,\"W\"))","v":61},{"$f":"IF(進行表shinko!C16=\"\",\"\",IF(進行表shinko!C16<$AO$28,進行表shinko!C16,\"W\"))","v":"W"},{"$f":"IF(進行表shinko!J16=\"\",\"\",IF(進行表shinko!J16<$AO$28,進行表shinko!J16,\"W\"))","v":"W"},{"$f":"IF(進行表shinko!C34=\"\",\"\",IF(進行表shinko!C34<$AO$28,進行表shinko!C34,\"W\"))","v":"W"},{"$f":"IF(進行表shinko!J34=\"\",\"\",IF(進行表shinko!J34<$AO$28,進行表shinko!J34,\"W\"))","v":"W"},{"$f":"IF(進行表shinko!C52=\"\",\"\",IF(進行表shinko!C52<$AO$28,進行表shinko!C52,\"W\"))","v":"W"},{"$f":"IF(進行表shinko!J52=\"\",\"\",IF(進行表shinko!J52<$AO$28,進行表shinko!J52,\"W\"))","v":28},{"$f":"☆登録touroku!D22","v":180},{"$f":"IF(COUNTBLANK($L34:$R34)=7,\"\",COUNTIF($L34:$R34,\"W\"))","v":5},2,{"$f":"IF(COUNTBLANK($L34:$R34)=7,\"\",INT((SUM($L34:$R34)+($S34*T34))*$AO$28/$S34))","v":989},{"$f":"IF(COUNTBLANK($L34:$R34)=7,\"\",SUM(AD$33:AD$39))","v":538},{"$f":"IF($T$41+$U$41=49,RANK($V44,$V$43:$V$49),\"\")","v":3},2,{"$f":"☆登録touroku!E22","v":"杉本　博章"},null,null,{"$f":"IF(進行表shinko!L14=\"\",\"\",IF(進行表shinko!L14<$AO$28,進行表shinko!L14,\"W\"))","v":"W"},{"$f":"IF(進行表shinko!E16=\"\",\"\",IF(進行表shinko!E16<$AO$28,進行表shinko!E16,\"W\"))","v":170},{"$f":"IF(進行表shinko!E72=\"\",\"\",IF(進行表shinko!E72<$AO$28,進行表shinko!E72,\"W\"))","v":"W"},{"$f":"IF(進行表shinko!L56=\"\",\"\",IF(進行表shinko!L56<$AO$28,進行表shinko!L56,\"W\"))","v":21},{"$f":"IF(進行表shinko!E58=\"\",\"\",IF(進行表shinko!E58<$AO$28,進行表shinko!E58,\"W\"))","v":"W"},{"$f":"IF(進行表shinko!L42=\"\",\"\",IF(進行表shinko!L42<$AO$28,進行表shinko!L42,\"W\"))","v":"W"},{"$f":"IF(進行表shinko!E44=\"\",\"\",IF(進行表shinko!E44<$AO$28,進行表shinko!E44,\"W\"))","v":"W"},{"$f":"☆登録touroku!F22","v":180},{"$f":"IF(COUNTBLANK($AC34:$AI34)=7,\"\",COUNTIF($AC34:$AI34,\"W\"))","v":5},2,{"$f":"IF(COUNTBLANK($AC34:$AI34)=7,\"\",INT((SUM($AC34:$AI34)+($AJ34*$AK34))*$AO$28/$AJ34))","v":1091},{"$f":"IF(COUNTBLANK($AC34:$AI34)=7,\"\",SUM(M$33:M$39))","v":491},{"$f":"IF($AK$41+$AL$41=49,RANK($AM44,$AM$43:$AM$49),\"\")","v":2},17948911]
[17948976,{"$f":"IF(▲成績表seiseki!B35=\"\",\"\",▲成績表seiseki!B35)","v":""},null,{"$f":"IF(▲成績表seiseki!D35=\"\",\"\",▲成績表seiseki!D35)","v":""},{"$f":"IF(▲成績表seiseki!E35=\"\",\"\",▲成績表seiseki!E35)","v":""},null,{"$f":"IF(▲成績表seiseki!G35=\"\",\"\",▲成績表seiseki!G35)","v":""},3,{"$f":"☆登録touroku!C23","v":"吉向　翔平"},null,null,{"$f":"IF(進行表shinko!J54=\"\",\"\",IF(進行表shinko!J54<$AO$28,進行表shinko!J54,\"W\"))","v":"W"},{"$f":"IF(進行表shinko!C72=\"\",\"\",IF(進行表shinko!C72<$AO$28,進行表shinko!C72,\"W\"))","v":103},{"$f":"IF(進行表shinko!C18=\"\",\"\",IF(進行表shinko!C18<$AO$28,進行表shinko!C18,\"W\"))","v":"W"},{"$f":"IF(進行表shinko!J18=\"\",\"\",IF(進行表shinko!J18<$AO$28,進行表shinko!J18,\"W\"))","v":23},{"$f":"IF(進行表shinko!C36=\"\",\"\",IF(進行表shinko!C36<$AO$28,進行表shinko!C36,\"W\"))","v":"W"},{"$f":"IF(進行表shinko!J36=\"\",\"\",IF(進行表shinko!J36<$AO$28,進行表shinko!J36,\"W\"))","v":"W"},{"$f":"IF(進行表shinko!C54=\"\",\"\",IF(進行表shinko!C54<$AO$28,進行表shinko!C54,\"W\"))","v":"W"},{"$f":"☆登録touroku!D23","v":180},5,2,1026,{"$f":"IF(COUNTBLANK($L35:$R35)=7,\"\",SUM(AE$33:AE$39))","v":452},2,3,{"$f":"☆登録touroku!E23","v":"丹次　力良"},null,null,{"$f":"IF(進行表shinko!E32=\"\",\"\",IF(進行表shinko!E32<$AO$28,進行表shinko!E32,\"W\"))","v":94},{"$f":"IF(進行表shinko!L16=\"\",\"\",IF(進行表shinko!L16<$AO$28,進行表shinko!L16,\"W\"))","v":58},{"$f":"IF(進行表shinko!E18=\"\",\"\",IF(進行表shinko!E18<$AO$28,進行表shinko!E18,\"W\"))","v":98},{"$f":"IF(進行表shinko!E74=\"\",\"\",IF(進行表shinko!E74<$AO$28,進行表shinko!E74,\"W\"))","v":91},{"$f":"IF(進行表shinko!L58=\"\",\"\",IF(進行表shinko!L58<$AO$28,進行表shinko!L58,\"W\"))","v":13},{"$f":"IF(進行表shinko!E60=\"\",\"\",IF(進行表shinko!E60<$AO$28,進行表shinko!E60,\"W\"))","v":"W"},{"$f":"IF(進行表shinko!L44=\"\",\"\",IF(進行表shinko!L44<$AO$28,進行表shinko!L44,\"W\"))","v":86},{"$f":"☆登録touroku!F23","v":180},1,6,620,{"$f":"IF(COUNTBLANK($AC35:$AI35)=7,\"\",SUM(N$33:N$39))","v":133},7,17989386]
[17948898,{"$f":"IF(▲成績表seiseki!B36=\"\",\"\",▲成績表seiseki!B36)","v":""},null,{"$f":"IF(▲成績表seiseki!D36=\"\",\"\",▲成績表seiseki!D36)","v":""},{"$f":"IF(▲成績表seiseki!E36=\"\",\"\",▲成績表seiseki!E36)","v":""},null,{"$f":"IF(▲成績表seiseki!G36=\"\",\"\",▲成績表seiseki!G36)","v":""},4,{"$f":"☆登録touroku!C24","v":"白戸　玲人"},null,null,{"$f":"IF(進行表shinko!C56=\"\",\"\",IF(進行表shinko!C56<$AO$28,進行表shinko!C56,\"W\"))","v":37},{"$f":"IF(進行表shinko!J56=\"\",\"\",IF(進行表shinko!J56<$AO$28,進行表shinko!J56,\"W\"))","v":"W"},{"$f":"IF(進行表shinko!C74=\"\",\"\",IF(進行表shinko!C74<$AO$28,進行表shinko!C74,\"W\"))","v":"W"},{"$f":"IF(進行表shinko!C20=\"\",\"\",IF(進行表shinko!C20<$AO$28,進行表shinko!C20,\"W\"))","v":"W"},{"$f":"IF(進行表shinko!J20=\"\",\"\",IF(進行表shinko!J20<$AO$28,進行表shinko!J20,\"W\"))","v":167},{"$f":"IF(進行表shinko!C38=\"\",\"\",IF(進行表shinko!C38<$AO$28,進行表shinko!C38,\"W\"))","v":"W"},{"$f":"IF(進行表shinko!J38=\"\",\"\",IF(進行表shinko!J38<$AO$28,進行表shinko!J38,\"W\"))","v":"W"},{"$f":"☆登録touroku!D24","v":180},5,2,1104,{"$f":"IF(COUNTBLANK($L36:$R36)=7,\"\",SUM(AF$33:AF$39))","v":338},1,4,{"$f":"☆登録touroku!E24","v":"和田宗一郎"},null,null,{"$f":"IF(進行表shinko!L32=\"\",\"\",IF(進行表shinko!L32<$AO$28,進行表shinko!L32,\"W\"))","v":33},{"$f":"IF(進行表shinko!E34=\"\",\"\",IF(進行表shinko!E34<$AO$28,進行表shinko!E34,\"W\"))","v":114},{"$f":"IF(進行表shinko!L18=\"\",\"\",IF(進行表shinko!L18<$AO$28,進行表shinko!L18,\"W\"))","v":"W"},{"$f":"IF(進行表shinko!E20=\"\",\"\",IF(進行表shinko!E20<$AO$28,進行表shinko!E20,\"W\"))","v":117},{"$f":"IF(進行表shinko!E76=\"\",\"\",IF(進行表shinko!E76<$AO$28,進行表shinko!E76,\"W\"))","v":95},{"$f":"IF(進行表shinko!L60=\"\",\"\",IF(進行表shinko!L60<$AO$28,進行表shinko!L60,\"W\"))","v":"W"},{"$f":"IF(進行表shinko!E62=\"\",\"\",IF(進行表shinko!E62<$AO$28,進行表shinko!E62,\"W\"))","v":"W"},{"$f":"☆登録touroku!F24","v":180},3,4,899,{"$f":"IF(COUNTBLANK($AC36:$AI36)=7,\"\",SUM(O$33:O$39))","v":186},4,17969105]
[17958968,{"$f":"IF(▲成績表seiseki!B37=\"\",\"\",▲成績表seiseki!B37)","v":""},null,{"$f":"IF(▲成績表seiseki!D37=\"\",\"\",▲成績表seiseki!D37)","v":""},{"$f":"IF(▲成績表seiseki!E37=\"\",\"\",▲成績表seiseki!E37)","v":""},null,{"$f":"IF(▲成績表seiseki!G37=\"\",\"\",▲成績表seiseki!G37)","v":""},5,{"$f":"☆登録touroku!C25","v":"山田　晋之"},null,null,{"$f":"IF(進行表shinko!J40=\"\",\"\",IF(進行表shinko!J40<$AO$28,進行表shinko!J40,\"W\"))","v":155},{"$f":"IF(進行表shinko!C58=\"\",\"\",IF(進行表shinko!C58<$AO$28,進行表shinko!C58,\"W\"))","v":160},{"$f":"IF(進行表shinko!J58=\"\",\"\",IF(進行表shinko!J58<$AO$28,進行表shinko!J58,\"W\"))","v":"W"},{"$f":"IF(進行表shinko!C76=\"\",\"\",IF(進行表shinko!C76<$AO$28,進行表shinko!C76,\"W\"))","v":"W"},{"$f":"IF(進行表shinko!C22=\"\",\"\",IF(進行表shinko!C22<$AO$28,進行表shinko!C22,\"W\"))","v":"W"},{"$f":"IF(進行表shinko!J22=\"\",\"\",IF(進行表shinko!J22<$AO$28,進行表shinko!J22,\"W\"))","v":0},{"$f":"IF(進行表shinko!C40=\"\",\"\",IF(進行表shinko!C40<$AO$28,進行表shinko!C40,\"W\"))","v":"W"},{"$f":"☆登録touroku!D25","v":180},4,3,1035,{"$f":"IF(COUNTBLANK($L37:$R37)=7,\"\",SUM(AG$33:AG$39))","v":217},4,5,{"$f":"☆登録touroku!E25","v":"中本　雅大"},null,null,{"$f":"IF(進行表shinko!E50=\"\",\"\",IF(進行表shinko!E50<$AO$28,進行表shinko!E50,\"W\"))","v":"W"},{"$f":"IF(進行表shinko!L34=\"\",\"\",IF(進行表shinko!L34<$AO$28,進行表shinko!L34,\"W\"))","v":117},{"$f":"IF(進行表shinko!E36=\"\",\"\",IF(進行表shinko!E36<$AO$28,進行表shinko!E36,\"W\"))","v":7},{"$f":"IF(進行表shinko!L20=\"\",\"\",IF(進行表shinko!L20<$AO$28,進行表shinko!L20,\"W\"))","v":"W"},{"$f":"IF(進行表shinko!E22=\"\",\"\",IF(進行表shinko!E22<$AO$28,進行表shinko!E22,\"W\"))","v":65},{"$f":"IF(進行表shinko!E78=\"\",\"\",IF(進行表shinko!E78<$AO$28,進行表shinko!E78,\"W\"))","v":143},{"$f":"IF(進行表shinko!L62=\"\",\"\",IF(進行表shinko!L62<$AO$28,進行表shinko!L62,\"W\"))","v":"W"},{"$f":"☆登録touroku!F25","v":180},3,4,872,{"$f":"IF(COUNTBLANK($AC37:$AI37)=7,\"\",SUM(P$33:P$39))","v":462},5,17969132]
[17989285,{"$f":"IF(▲成績表seiseki!B38=\"\",\"\",▲成績表seiseki!B38)","v":""},null,{"$f":"IF(▲成績表seiseki!D38=\"\",\"\",▲成績表seiseki!D38)","v":""},{"$f":"IF(▲成績表seiseki!E38=\"\",\"\",▲成績表seiseki!E38)","v":""},null,{"$f":"IF(▲成績表seiseki!G38=\"\",\"\",▲成績表seiseki!G38)","v":""},6,{"$f":"☆登録touroku!C26","v":"山田　晃司"},null,null,{"$f":"IF(進行表shinko!C42=\"\",\"\",IF(進行表shinko!C42<$AO$28,進行表shinko!C42,\"W\"))","v":43},{"$f":"IF(進行表shinko!J42=\"\",\"\",IF(進行表shinko!J42<$AO$28,進行表shinko!J42,\"W\"))","v":146},{"$f":"IF(進行表shinko!C60=\"\",\"\",IF(進行表shinko!C60<$AO$28,進行表shinko!C60,\"W\"))","v":133},{"$f":"IF(進行表shinko!J60=\"\",\"\",IF(進行表shinko!J60<$AO$28,進行表shinko!J60,\"W\"))","v":120},{"$f":"IF(進行表shinko!C78=\"\",\"\",IF(進行表shinko!C78<$AO$28,進行表shinko!C78,\"W\"))","v":"W"},{"$f":"IF(進行表shinko!C24=\"\",\"\",IF(進行表shinko!C24<$AO$28,進行表shinko!C24,\"W\"))","v":19},{"$f":"IF(進行表shinko!J24=\"\",\"\",IF(進行表shinko!J24<$AO$28,進行表shinko!J24,\"W\"))","v":80},{"$f":"☆登録touroku!D26","v":180},1,6,721,{"$f":"IF(COUNTBLANK($L38:$R38)=7,\"\",SUM(AH$33:AH$39))","v":143},7,6,{"$f":"☆登録touroku!E26","v":"末岡　修"},null,null,{"$f":"IF(進行表shinko!L50=\"\",\"\",IF(進行表shinko!L50<$AO$28,進行表shinko!L50,\"W\"))","v":"W"},{"$f":"IF(進行表shinko!E52=\"\",\"\",IF(進行表shinko!E52<$AO$28,進行表shinko!E52,\"W\"))","v":79},{"$f":"IF(進行表shinko!L36=\"\",\"\",IF(進行表shinko!L36<$AO$28,進行表shinko!L36,\"W\"))","v":171},{"$f":"IF(進行表shinko!E38=\"\",\"\",IF(進行表shinko!E38<$AO$28,進行表shinko!E38,\"W\"))","v":21},{"$f":"IF(進行表shinko!L22=\"\",\"\",IF(進行表shinko!L22<$AO$28,進行表shinko!L22,\"W\"))","v":"W"},{"$f":"IF(進行表shinko!E24=\"\",\"\",IF(進行表shinko!E24<$AO$28,進行表shinko!E24,\"W\"))","v":"W"},{"$f":"IF(進行表shinko!E80=\"\",\"\",IF(進行表shinko!E80<$AO$28,進行表shinko!E80,\"W\"))","v":"W"},{"$f":"☆登録touroku!F26","v":180},4,3,991,{"$f":"IF(COUNTBLANK($AC38:$AI38)=7,\"\",SUM(Q$33:Q$39))","v":217},3,17959012]
[13979274,{"$f":"IF(▲成績表seiseki!B39=\"\",\"\",▲成績表seiseki!B39)","v":""},null,{"$f":"IF(▲成績表seiseki!D39=\"\",\"\",▲成績表seiseki!D39)","v":""},{"$f":"IF(▲成績表seiseki!E39=\"\",\"\",▲成績表seiseki!E39)","v":""},null,{"$f":"IF(▲成績表seiseki!G39=\"\",\"\",▲成績表seiseki!G39)","v":""},7,{"$f":"☆登録touroku!C27","v":"宮野　早織"},null,null,{"$f":"IF(進行表shinko!J26=\"\",\"\",IF(進行表shinko!J26<$AO$28,進行表shinko!J26,\"W\"))","v":24},{"$f":"IF(進行表shinko!C44=\"\",\"\",IF(進行表shinko!C44<$AO$28,進行表shinko!C44,\"W\"))","v":54},{"$f":"IF(進行表shinko!J44=\"\",\"\",IF(進行表shinko!J44<$AO$28,進行表shinko!J44,\"W\"))","v":"W"},{"$f":"IF(進行表shinko!C62=\"\",\"\",IF(進行表shinko!C62<$AO$28,進行表shinko!C62,\"W\"))","v":43},{"$f":"IF(進行表shinko!J62=\"\",\"\",IF(進行表shinko!J62<$AO$28,進行表shinko!J62,\"W\"))","v":128},{"$f":"IF(進行表shinko!C80=\"\",\"\",IF(進行表shinko!C80<$AO$28,進行表shinko!C80,\"W\"))","v":40},{"$f":"IF(進行表shinko!C26=\"\",\"\",IF(進行表shinko!C26<$AO$28,進行表shinko!C26,\"W\"))","v":"W"},{"$f":"☆登録touroku!D27","v":140},2,5,731,{"$f":"IF(COUNTBLANK($L39:$R39)=7,\"\",SUM(AI$33:AI$39))","v":155},6,7,{"$f":"☆登録touroku!E27","v":"松房ゆかり"},null,null,{"$f":"IF(進行表shinko!E68=\"\",\"\",IF(進行表shinko!E68<$AO$28,進行表shinko!E68,\"W\"))","v":"W"},{"$f":"IF(進行表shinko!L52=\"\",\"\",IF(進行表shinko!L52<$AO$28,進行表shinko!L52,\"W\"))","v":"W"},{"$f":"IF(進行表shinko!E54=\"\",\"\",IF(進行表shinko!E54<$AO$28,進行表shinko!E54,\"W\"))","v":10},{"$f":"IF(進行表shinko!L38=\"\",\"\",IF(進行表shinko!L38<$AO$28,進行表shinko!L38,\"W\"))","v":88},{"$f":"IF(進行表shinko!E40=\"\",\"\",IF(進行表shinko!E40<$AO$28,進行表shinko!E40,\"W\"))","v":44},{"$f":"IF(進行表shinko!L24=\"\",\"\",IF(進行表shinko!L24<$AO$28,進行表shinko!L24,\"W\"))","v":"W"},{"$f":"IF(進行表shinko!E26=\"\",\"\",IF(進行表shinko!E26<$AO$28,進行表shinko!E26,\"W\"))","v":69},{"$f":"☆登録touroku!F27","v":140},3,4,811,{"$f":"IF(COUNTBLANK($AC39:$AI39)=7,\"\",SUM(R$33:R$39))","v":246},6,13969193]
[{"$error":"#VALUE!"},{"$f":"IF(▲成績表seiseki!B40=\"\",\"\",▲成績表seiseki!B40)","v":""},null,{"$f":"IF(▲成績表seiseki!D40=\"\",\"\",▲成績表seiseki!D40)","v":""},{"$f":"IF(▲成績表seiseki!E40=\"\",\"\",▲成績表seiseki!E40)","v":""},null,{"$f":"IF(▲成績表seiseki!G40=\"\",\"\",▲成績表seiseki!G40)","v":""},null,null,null,null,null,null,null,null,null,null,null,null,null,null,{"$f":"IF(COUNTBLANK(L40:R40)=7,\"\",T40*180+SUM(L40:R40))","v":""},null,null,null,null,null,null,null,null,null,null,null,null,null,null,null,null,null,null,null,0]
[null,{"$f":"IF(▲成績表seiseki!B41=\"\",\"\",▲成績表seiseki!B41)","v":""},null,{"$f":"IF(▲成績表seiseki!D41=\"\",\"\",▲成績表seiseki!D41)","v":""},{"$f":"IF(▲成績表seiseki!E41=\"\",\"\",▲成績表seiseki!E41)","v":""},null,{"$f":"IF(▲成績表seiseki!G41=\"\",\"\",▲成績表seiseki!G41)","v":""},null,null,null,null,null,null,null,null,null,null,null,null,{"$f":"IF(COUNTBLANK(T33:T39)=7,0,SUM(T33:T39))","v":24},{"$f":"IF(COUNTBLANK(U33:U39)=7,0,SUM(U33:U39))","v":25},{"$f":"IF(COUNTBLANK(V33:V39)=7,0,SUM(V33:V39))","v":6480},{"$f":"IF(COUNTBLANK(W33:W39)=7,0,SUM(W33:W39))","v":1970},null,null,null,null,null,null,null,null,null,null,null,null,null,{"$f":"IF(COUNTBLANK(AK33:AK39)=7,0,SUM(AK33:AK39))","v":25},{"$f":"IF(COUNTBLANK(AL33:AL39)=7,0,SUM(AL33:AL39))","v":24},{"$f":"IF(COUNTBLANK(AM33:AM39)=7,0,SUM(AM33:AM39))","v":6530},{"$f":"IF(COUNTBLANK(AN33:AN39)=7,0,SUM(AN33:AN39))","v":2078}]
[null,null,null,null,null,null,null,null,null,null,null,null,null,null,null,null,null,null,null,"総失点",null,"ランキング",null,null,null,null,null,null,null,null,null,null,null,null,null,null,"総失点",null,"ランキング"]
[null,null,null,null,null,null,null,null,{"$f":"I33","v":"斉藤　裕児"},null,null,null,null,null,null,null,null,null,null,{"$f":"IF(COUNTBLANK($L33:$R33)=7,\"\",SUM(AC$33:AC$39))","v":127},null,{"$f":"IF(COUNTBLANK($L33:$R33)=7,\"\",T33*100000000+$V33*10000+(9999-$T43))","v":208749872},null,null,null,{"$f":"Z33","v":"森田　憲"},null,null,null,null,null,null,null,null,null,null,{"$f":"IF(COUNTBLANK($AC33:$AI33)=7,\"\",SUM(L$33:L$39))","v":343},null,{"$f":"IF(COUNTBLANK($AC33:$AI33)=7,\"\",AK33*100000000+AM33*10000+(9999-AK43))","v":612469656}]
[null,null,null,null,null,null,null,null,{"$f":"I34","v":"近藤　拓馬"},null,null,null,null,null,null,null,null,null,null,{"$f":"IF(COUNTBLANK($L34:$R34)=7,\"\",SUM(AD$33:AD$39))","v":538},null,{"$f":"IF(COUNTBLANK($L34:$R34)=7,\"\",T34*100000000+$V34*10000+(9999-$T44))","v":509899461},null,null,null,{"$f":"Z34","v":"杉本　博章"},null,null,null,null,null,null,null,null,null,null,{"$f":"IF(COUNTBLANK($AC34:$AI34)=7,\"\",SUM(M$33:M$39))","v":491},null,{"$f":"IF(COUNTBLANK($AC34:$AI34)=7,\"\",AK34*100000000+AM34*10000+(9999-AK44))","v":510919508}]
[null,null,null,null,null,null,null,null,"吉向　翔平",null,null,null,null,null,null,null,null,null,null,{"$f":"IF(COUNTBLANK($L35:$R35)=7,\"\",SUM(AE$33:AE$39))","v":452},null,510269547,null,null,null,"丹次　力良",null,null,null,null,null,null,null,null,null,null,{"$f":"IF(COUNTBLANK($AC35:$AI35)=7,\"\",SUM(N$33:N$39))","v":133},null,106209866]
[null,null,null,null,null,null,null,null,"白戸　玲人",null,null,null,null,null,null,null,null,null,null,{"$f":"IF(COUNTBLANK($L36:$R36)=7,\"\",SUM(AF$33:AF$39))","v":338},null,511049661,null,null,null,"和田宗一郎",null,null,null,null,null,null,null,null,null,null,{"$f":"IF(COUNTBLANK($AC36:$AI36)=7,\"\",SUM(O$33:O$39))","v":186},null,308999813]
[null,null,null,null,null,null,null,null,"山田　晋之",null,null,null,null,null,null,null,null,null,null,{"$f":"IF(COUNTBLANK($L37:$R37)=7,\"\",SUM(AG$33:AG$39))","v":217},null,410359782,null,null,null,"中本　雅大",null,null,null,null,null,null,null,null,null,null,{"$f":"IF(COUNTBLANK($AC37:$AI37)=7,\"\",SUM(P$33:P$39))","v":462},null,308729537]
[null,null,null,null,null,null,null,null,"山田　晃司",null,null,null,null,null,null,null,null,null,null,{"$f":"IF(COUNTBLANK($L38:$R38)=7,\"\",SUM(AH$33:AH$39))","v":143},null,107219856,null,null,null,"末岡　修",null,null,null,null,null,null,null,null,null,null,{"$f":"IF(COUNTBLANK($AC38:$AI38)=7,\"\",SUM(Q$33:Q$39))","v":217},null,409919782]
[null,null,null,null,null,null,null,null,"宮野　早織",null,null,null,null,null,null,null,null,null,null,{"$f":"IF(COUNTBLANK($L39:$R39)=7,\"\",SUM(AI$33:AI$39))","v":155},null,207319844,null,null,null,"松房ゆかり",null,null,null,null,null,null,null,null,null,null,{"$f":"IF(COUNTBLANK($AC39:$AI39)=7,\"\",SUM(R$33:R$39))","v":246},null,308119753]
[null,null,null,null,null,null,null,null,{"$f":"IF(ISERROR(INDEX($I$43:$X$49,MATCH($V50,$V$43:V$49,0),1)),\"\",INDEX($I$43:$X$49,MATCH($V50,$V$43:V$49,0),1))","v":"白戸　玲人"},null,null,"1位",null,null,null,null,null,null,null,null,null,{"$f":"IF(AND($T$41=0,$U$41=0),\"\",LARGE(V43:V49,1))","v":511049661},null,null,null,{"$f":"IF(ISERROR(INDEX($Z$43:$AO$49,MATCH($AM50,$AM$43:AM$49,0),1)),\"\",INDEX($Z$43:$AO$49,MATCH($AM50,$AM$43:AM$49,0),1))","v":"森田　憲"},null,null,"1位",null,null,null,null,null,null,null,null,null,{"$f":"IF(AND($AK$41=0,$AL$41=0),\"\",LARGE(AM43:AM49,1))","v":612469656}]