{"text_format":"1","workbook":"xlsx","n_sheets":7,"sheets":["取扱説明","概要設定","list","1組","RT","ラベル","結果"],"not_rendered":{"charts":0,"images":0,"macros":1,"external_links":0,"defined_names":5,"comments":0,"pivot_tables":0},"unopened":[],"bounds":{"document_bytes":16777216,"sheet_cells":100000,"rows_first":2000,"rows_last":500,"rows_between":2000,"halvings":0,"cell_chars":16384,"cell_head_chars":4096},"cells_cut":0,"cells_raw":0,"read":"whole","date_system":"1900"}

{"sheet":"取扱説明","index":0,"n_rows":48,"n_cols":13,"rows_kept":48,"cut":false,"hidden":false,"merged":[]}
[null,"【取扱説明】"]
[null,null,null,null,null,null,null,null,null,null,null,"ver.1.5改","by：にんにん"]
[null,"◆","概要設定"]
[null,null,"まずはじめに、名前、ハンデ者には\"-\"を事前に入力します。"]
[null,null,"基準点、ハンデ点はデフォルトのままで良いです。（２４０点まで対応）"]
[null,null,"開催日、対抗戦名を入力し、ルール（基準点）、会場名をプルダウンメニューから選んでください。"]
{"$rows_left_out":43}
{"sheet":"概要設定","index":1,"n_rows":16,"n_cols":13,"rows_kept":16,"cut":false,"hidden":false,"merged":[[14,1,14,2],[15,1,15,2],[3,1,3,6],[7,1,7,6],[10,1,10,2],[11,1,11,2],[12,1,12,2]]}
[null,null,null,null,null,null,null,null,null,"名　　前","ハンデ","基準点数","ハンデ点数"]
["開催日",2016,"年",3,"月",13,"日",null,null,"山田　晋之",null,120,100]
[null,null,null,null,null,null,null,null,null,"吉向",null,160,120]
["試合名","京奈対抗戦",null,null,null,null,null,null,null,"金澤",null,180,140]
[null,null,null,null,null,null,null,null,null,"白戸",null,240,200]
["ルール",180,"点","コールショット",null,null,null,null,null,"近藤"]
{"$rows_left_out":11}
{"sheet":"list","index":2,"n_rows":146,"n_cols":75,"rows_kept":146,"cut":false,"hidden":false,"merged":[[29,0,32,0],[29,1,32,1],[29,2,32,2],[29,3,32,3],[29,4,32,4]]}
[null,3,"人",null,null,null,4,"人",null,null,null,5,"人",null,null,null,6,"人",null,null,null,7,"人",null,null,null,8,"人",null,null,null,9,"人",null,null,null,10,"人",null,null,null,11,"人",null,null,null,12,"人",null,null,null,13,"人",null,null,null,14,"人",null,null,null,15,"人",null,null,null,16,"人",null,null,null,17,"人"]
[1,{"$f":"A2+1","v":2},{"$f":"B2+1","v":3},{"$f":"C2+1","v":4},5,6,7,8,9,10,11,12,13,14,15,16,17,18,19,20,21,22,23,24,25,26,27,28,29,30,31,32,33,34,35,36,37,38,39,40,41,42,43,44,45,46,47,48,49,50,51,52,53,54,55,56,57,58,59,{"$f":"BG2+1","v":60},{"$f":"BH2+1","v":61},{"$f":"BI2+1","v":62},{"$f":"BJ2+1","v":63},{"$f":"BK2+1","v":64},{"$f":"BL2+1","v":65},{"$f":"BM2+1","v":66},{"$f":"BN2+1","v":67},{"$f":"BO2+1","v":68},{"$f":"BP2+1","v":69},{"$f":"BQ2+1","v":70},{"$f":"BR2+1","v":71},{"$f":"BS2+1","v":72},{"$f":"BT2+1","v":73},{"$f":"BU2+1","v":74},75]
[null,"一節",null,null,1,null,"一節",null,null,1,null,"一節",null,null,1,null,"一節",null,null,1,null,"一節",null,null,1,null,"一節",null,null,1,null,"一節",null,null,1,null,"一節",null,null,1,null,"一節",null,null,1,null,"一節",null,null,1,null,"一節",null,null,1,null,"一節",null,null,1,null,"一節",null,null,1,null,"一節",null,null,1,null,"一節",null,null,1]
[1,2,"-",3,1,1,2,"-",3,1,1,2,"-",5,1,1,3,"-",4,1,1,2,"-",4,1,1,4,"-",5,1,1,2,"-",4,1,1,5,"-",6,1,1,2,"-",4,1,1,6,"-",7,1,1,2,"-",4,1,1,7,"-",8,1,1,2,"-",4,1,1,8,"-",9,1,1,2,"-",4,1]
[{"$f":"A4+1","v":2},1,"-",3,1,{"$f":"F4+1","v":2},1,"-",4,1,{"$f":"K4+1","v":2},3,"-",4,1,2,2,"-",5,1,2,3,"-",6,1,2,3,"-",6,1,2,3,"-",6,1,2,4,"-",7,1,2,3,"-",6,1,2,5,"-",8,1,2,3,"-",6,1,2,6,"-",9,1,2,3,"-",6,1,2,7,"-",10,1,2,3,"-",6,1]
[{"$f":"A5+1","v":3},1,"-",2,1,{"$f":"F5+1","v":3},4,"-",2,1,{"$f":"K5+1","v":3},1,"-",5,1,3,1,"-",6,1,3,5,"-",7,1,3,2,"-",7,1,3,5,"-",8,1,3,3,"-",8,1,3,5,"-",8,1,3,4,"-",9,1,3,5,"-",8,1,3,5,"-",10,1,3,5,"-",8,1,3,6,"-",11,1,3,5,"-",8,1]
{"$rows_left_out":141}
{"sheet":"1組","index":3,"n_rows":43,"n_cols":46,"rows_kept":43,"cut":false,"hidden":false,"merged":[[33,44,34,44],[35,44,36,44],[8,37,8,38],[12,21,12,22],[12,23,12,24],[12,27,12,28],[10,21,10,22],[10,25,10,26],[12,25,12,26],[16,25,16,26],[18,25,18,26],[10,23,10,24],[8,23,8,24],[18,27,18,28],[18,23,18,24],[20,25,20,26],[22,25,22,26],[22,21,22,22],[16,21,16,22],[16,27,16,28],[16,23,16,24],[34,23,34,24],[34,25,34,26],[28,27,28,28],[37,44,38,44],[42,7,42,8],[5,4,6,4],[7,4,8,4],[9,4,10,4],[10,5,10,6],[21,44,22,44],[23,44,24,44],[25,44,26,44],[27,44,28,44],[29,44,30,44],[31,44,32,44],[23,4,24,4],[17,4,18,4],[19,4,20,4],[24,13,24,14],[24,17,24,18],[24,19,24,20],[24,27,24,28],[24,31,24,32],[39,4,39,44],[6,5,6,6],[12,7,12,8],[6,7,6,8],[0,15,0,20],[17,44,18,44],[19,44,20,44],[5,44,6,44],[16,15,16,16],[18,17,18,18],[20,19,20,20],[7,44,8,44],[9,44,10,44],[11,44,12,44],[13,44,14,44],[15,44,16,44],[20,27,20,28],[20,31,20,32],[8,21,8,22],[18,15,18,16],[20,15,20,16],[14,21,14,22],[8,35,8,36],[14,25,14,26],[10,27,10,28],[14,27,14,28],[10,29,10,30],[12,29,12,30],[14,5,14,6],[11,4,12,4],[27,1,28,1],[13,4,14,4],[15,4,16,4],[21,4,22,4],[23,1,24,1],[25,1,26,1],[23,3,24,3],[25,3,26,3],[25,4,26,4],[18,5,18,6],[3,1,4,1],[4,5,4,6],[4,7,4,8],[28,15,28,16],[4,11,4,12],[8,5,8,6],[8,11,8,12],[14,7,14,8],[14,9,14,10],[12,11,12,12],[3,5,3,6],[3,7,3,8],[3,9,3,10],[3,11,3,12],[3,13,3,14],[18,11,18,12],[20,9,20,10],[20,7,20,8],[14,13,14,14],[18,13,18,14],[16,13,16,14],[20,13,20,14],[18,7,18,8],[18,9,18,10],[35,1,36,1],[37,1,38,1],[8,7,8,8],[16,9,16,10],[16,7,16,8],[12,9,12,10],[38,5,38,6],[38,7,38,8],[38,9,38,10],[20,5,20,6],[16,5,16,6],[37,4,38,4],[31,4,32,4],[35,4,36,4],[36,5,36,6],[17,1,18,1],[19,1,20,1],[21,1,22,1],[31,1,32,1],[33,1,34,1],[29,1,30,1],[28,5,28,6],[28,7,28,8],[27,4,28,4],[22,9,22,10],[24,7,24,8],[24,9,24,10],[32,13,32,14],[26,5,26,6],[28,11,28,12],[28,9,28,10],[28,13,28,14],[26,7,26,8],[26,9,26,10],[26,11,26,12],[32,7,32,8],[22,5,22,6],[24,5,24,6],[22,7,22,8],[30,7,30,8],[30,9,30,10],[34,5,34,6],[32,5,32,6],[38,11,38,12],[36,13,36,14],[38,13,38,14],[38,15,38,16],[38,17,38,18],[38,19,38,20],[36,7,36,8],[36,9,36,10],[36,15,36,16],[36,17,36,18],[36,19,36,20],[14,19,14,20],[14,11,14,12],[16,11,16,12],[20,11,20,12],[12,13,12,14],[16,17,16,18],[16,19,16,20],[34,17,34,18],[36,21,36,22],[30,11,30,12],[30,13,30,14],[22,13,22,14],[22,17,22,18],[22,19,22,20],[26,15,26,16],[28,21,28,22],[28,17,28,18],[28,19,28,20],[36,11,36,12],[42,11,42,12],[32,9,32,10],[32,11,32,12],[42,15,42,16],[38,23,38,24],[26,13,26,14],[36,23,36,24],[28,23,28,24],[24,11,24,12],[24,15,24,16],[38,21,38,22],[32,27,32,28],[3,15,3,16],[32,23,32,24],[32,15,32,16],[32,17,32,18],[32,19,32,20],[22,15,22,16],[3,23,3,24],[3,17,3,18],[3,19,3,20],[3,21,3,22],[14,23,14,24],[6,21,6,22],[6,23,6,24],[6,17,6,18],[6,19,6,20],[6,15,6,16],[32,21,32,22],[18,21,18,22],[14,17,14,18],[20,21,20,22],[24,23,24,24],[20,17,20,18],[18,19,18,20],[29,4,30,4],[30,5,30,6],[30,21,30,22],[30,15,30,16],[30,31,30,32],[30,17,30,18],[1,21,1,24],[26,23,26,24],[22,23,22,24],[20,23,20,24],[26,21,26,22],[24,21,24,22],[22,27,22,28],[26,27,26,28],[12,19,12,20],[26,17,26,18],[26,19,26,20],[22,31,22,32],[30,19,30,20],[16,29,16,30],[8,29,8,30],[14,15,14,16],[12,15,12,16],[12,17,12,18],[33,4,34,4],[34,19,34,20],[34,21,34,22],[26,31,26,32],[30,23,30,24],[30,25,30,26],[30,27,30,28],[26,29,26,30],[22,11,22,12],[28,31,28,32],[28,29,28,30],[34,27,34,28],[28,25,28,26],[24,25,24,26],[26,25,26,26],[32,25,32,26],[34,7,34,8],[34,9,34,10],[34,11,34,12],[34,13,34,14],[34,15,34,16],[34,29,34,30],[34,31,34,32],[32,31,32,32],[5,1,6,1],[7,1,8,1],[9,1,10,1],[11,1,12,1],[13,1,14,1],[15,1,16,1],[6,31,6,32],[8,31,8,32],[10,31,10,32],[12,31,12,32],[6,9,6,10],[10,9,10,10],[10,7,10,8],[10,11,10,12],[10,13,10,14],[10,15,10,16],[10,17,10,18],[10,19,10,20],[8,13,8,14],[8,15,8,16],[8,17,8,18],[8,19,8,20],[8,9,8,10],[12,5,12,6],[36,37,36,38],[36,35,36,36],[36,33,36,34],[36,25,36,26],[36,27,36,28],[36,29,36,30],[36,31,36,32],[38,29,38,30],[38,31,38,32],[38,37,38,38],[38,35,38,36],[38,33,38,34],[38,25,38,26],[38,27,38,28],[34,37,34,38],[34,35,34,36],[34,33,34,34],[32,35,32,36],[32,33,32,34],[14,31,14,32],[16,31,16,32],[18,31,18,32],[20,29,20,30],[22,29,22,30],[24,29,24,30],[14,29,14,30],[18,37,18,38],[18,35,18,36],[18,33,18,34],[16,37,16,38],[16,35,16,36],[16,33,16,34],[14,37,14,38],[14,35,14,36],[14,33,14,34],[20,37,20,38],[20,35,20,36],[20,33,20,34],[30,29,30,30],[30,35,30,36],[30,33,30,34],[32,29,32,30],[32,37,32,38],[10,37,10,38],[10,35,10,36],[10,33,10,34],[12,37,12,38],[12,35,12,36],[12,33,12,34],[28,37,28,38],[30,37,30,38],[28,35,28,36],[28,33,28,34],[26,37,26,38],[26,35,26,36],[26,33,26,34],[24,37,24,38],[24,35,24,36],[18,29,18,30],[6,37,6,38],[6,35,6,36],[6,33,6,34],[22,35,22,36],[22,33,22,34],[24,33,24,34],[22,37,22,38],[3,33,3,34],[3,35,3,36],[3,37,3,38],[4,35,4,36],[4,37,4,38],[3,25,3,26],[3,27,3,28],[4,29,4,30],[4,31,4,32],[8,25,8,26],[8,27,8,28],[3,29,3,30],[3,31,3,32],[4,33,4,34],[6,29,6,30],[8,33,8,34],[4,13,4,14],[4,15,4,16],[4,17,4,18],[4,19,4,20],[4,21,4,22],[4,23,4,24],[4,25,4,26],[4,9,4,10],[6,27,6,28],[6,25,6,26],[6,13,6,14],[6,11,6,12],[4,27,4,28],[5,39,6,39],[5,40,6,40],[5,41,6,41],[5,42,6,42],[5,43,6,43],[5,45,6,45],[7,45,8,45],[9,45,10,45],[11,45,12,45],[7,39,8,39],[7,40,8,40],[7,41,8,41],[7,42,8,42],[7,43,8,43],[9,39,10,39],[9,40,10,40],[9,41,10,41],[9,42,10,42],[9,43,10,43],[11,39,12,39],[11,40,12,40],[11,41,12,41],[11,42,12,42],[11,43,12,43],[31,45,32,45],[33,45,34,45],[35,45,36,45],[37,45,38,45],[13,45,14,45],[15,45,16,45],[17,45,18,45],[19,45,20,45],[21,45,22,45],[23,45,24,45],[25,45,26,45],[27,45,28,45],[29,45,30,45],[13,39,14,39],[13,40,14,40],[13,41,14,41],[13,42,14,42],[13,43,14,43],[15,39,16,39],[15,40,16,40],[15,41,16,41],[15,42,16,42],[15,43,16,43],[17,39,18,39],[17,40,18,40],[17,41,18,41],[17,42,18,42],[17,43,18,43],[19,39,20,39],[19,40,20,40],[19,41,20,41],[19,42,20,42],[19,43,20,43],[21,39,22,39],[21,40,22,40],[21,41,22,41],[21,42,22,42],[21,43,22,43],[23,39,24,39],[23,40,24,40],[23,41,24,41],[23,42,24,42],[23,43,24,43],[31,42,32,42],[31,43,32,43],[25,39,26,39],[25,40,26,40],[25,41,26,41],[25,42,26,42],[25,43,26,43],[27,39,28,39],[27,40,28,40],[27,41,28,41],[27,42,28,42],[27,43,28,43],[1,40,1,44],[37,39,38,39],[37,40,38,40],[37,41,38,41],[37,42,38,42],[37,43,38,43],[33,39,34,39],[33,40,34,40],[33,41,34,41],[33,42,34,42],[33,43,34,43],[35,39,36,39],[35,40,36,40],[35,41,36,41],[35,42,36,42],[35,43,36,43],[29,39,30,39],[29,40,30,40],[29,41,30,41],[29,42,30,42],[29,43,30,43],[31,39,32,39],[31,40,32,40],[31,41,32,41],[35,3,36,3],[37,3,38,3],[3,3,4,3],[5,3,6,3],[7,3,8,3],[9,3,10,3],[11,3,12,3],[13,3,14,3],[15,3,16,3],[17,3,18,3],[19,3,20,3],[21,3,22,3],[27,3,28,3],[29,3,30,3],[31,3,32,3],[33,3,34,3]]}
[null,null,null,null,{"$f":"概要設定!B2","v":2016},"年",null,null,{"$f":"概要設定!D2","v":3},"月",null,"例会",null,null,null,{"$f":"概要設定!B4","v":"京奈対抗戦"}]
[null,null,null,null,null,null,null,{"$f":"COUNTA(E6:E29)","v":12},"人",null,{"$f":"概要設定!B6","v":180},"点コールショット",null,null,null,null,null,null,null,"開催日：",null,{"$f":"E1&\"/\"&I1&\"/\"&概要設定!F2","v":"2016/3/13"},null,null,null,null,null,null,null,null,null,null,null,null,null,null,null,null,null,"会場：",{"$f":"概要設定!B8","v":"キングスポット"}]
[]
[null,"No","ハンデ","ハンデ","No.",1,null,2,null,3,null,4,null,5,null,6,null,7,null,8,null,9,null,10,null,11,null,12,null,13,null,14,null,15,null,16,null,17]
[null,null,"得点",null,null,{"$f":"IF($E6=\"\",\"\",$E6)","v":"白戸"},null,{"$f":"IF($E8=\"\",\"\",$E8)","v":"近藤"},null,{"$f":"IF($E10=\"\",\"\",$E10)","v":"吉向"},null,{"$f":"IF($E12=\"\",\"\",$E12)","v":"山田　晋之"},null,{"$f":"IF($E14=\"\",\"\",$E14)","v":"山田晃司"},null,{"$f":"IF($E16=\"\",\"\",$E16)","v":"長谷川"},null,{"$f":"IF($E18=\"\",\"\",$E18)","v":"植田"},null,{"$f":"IF($E20=\"\",\"\",$E20)","v":"金澤"},null,{"$f":"IF($E22=\"\",\"\",$E22)","v":"宮野"},null,{"$f":"IF($E24=\"\",\"\",$E24)","v":"岩本"},null,{"$f":"IF($E26=\"\",\"\",$E26)","v":"水田"},null,{"$f":"IF($E28=\"\",\"\",$E28)","v":"斎藤裕児"},null,{"$f":"IF($E30=\"\",\"\",$E30)","v":"鷲尾"},null,{"$f":"IF($E32=\"\",\"\",$E32)","v":""},null,{"$f":"IF($E34=\"\",\"\",$E34)","v":""},null,{"$f":"IF($E36=\"\",\"\",$E36)","v":""},null,{"$f":"IF($E38=\"\",\"\",$E38)","v":""},null,"W","L","TP","LP","R_POINT","R","HR"]
[null,1,{"$f":"IF($E6=\"\",\"\",INDEX(概要設定!$J$2:$K$21,MATCH($E6, 概要設定!$J$2:$J$21,0),2))","v":0},{"$f":"IF($C6=\"-\",\"△\",\"\")","v":""},"白戸",null,null,null,null,null,null,null,null,null,null,null,110,null,null,null,108,null,null,null,null,null,null,null,null,null,null,null,null,null,null,null,null,null,null,{"$f":"IF(E6=\"\",\"\",COUNTIF($F7:AL7,\"w\"))","v":5},{"$f":"IF(E6=\"\",\"\",COUNTIF(F7:AL7,\">=0\"))","v":1},{"$f":"IF(E6=\"\",\"\",INT((SUM(F7:AM7)+($C7*AN6))*$K$2/$C7))","v":1073},{"$f":"IF($E6=\"\",\"\",SUM(F$7:F$39))","v":263},{"$f":"IF(E6=\"\",\"\",AN6*100000000+AP6*10000-AQ6)","v":510729737},{"$f":"IF(E6=\"\",\"\",RANK(AR6,$AR$6:$AR$39)+COUNTIF($AR$6:AR6,AR6)-1)","v":1},{"$f":"MAX($G6:$AM6)","v":110}]
{"$rows_left_out":38}
{"sheet":"RT","index":4,"n_rows":329,"n_cols":37,"rows_kept":329,"cut":false,"hidden":false,"merged":[[284,3,284,4],[284,5,284,6],[274,3,274,4],[274,5,274,6],[276,3,276,4],[300,3,300,4],[300,5,300,6],[302,3,302,4],[302,5,302,6],[276,5,276,6],[278,3,278,4],[278,5,278,6],[304,3,304,4],[304,5,304,6],[306,3,306,4],[306,5,306,6],[308,3,308,4],[308,5,308,6],[280,3,280,4],[280,5,280,6],[282,3,282,4],[282,5,282,6],[298,3,298,4],[298,5,298,6],[292,3,292,4],[292,5,292,6],[294,3,294,4],[294,5,294,6],[296,3,296,4],[296,5,296,6],[286,3,286,4],[286,5,286,6],[288,3,288,4],[288,5,288,6],[290,3,290,4],[290,5,290,6],[326,3,326,4],[326,5,326,6],[328,3,328,4],[328,5,328,6],[310,3,310,4],[310,5,310,6],[312,3,312,4],[312,5,312,6],[314,3,314,4],[314,5,314,6],[316,3,316,4],[316,5,316,6],[318,3,318,4],[318,5,318,6],[320,3,320,4],[320,5,320,6],[322,3,322,4],[322,5,322,6],[324,3,324,4],[324,5,324,6],[268,3,268,4],[268,5,268,6],[270,3,270,4],[270,5,270,6],[272,3,272,4],[272,5,272,6],[262,3,262,4],[262,5,262,6],[264,3,264,4],[264,5,264,6],[266,3,266,4],[266,5,266,6],[256,3,256,4],[256,5,256,6],[258,3,258,4],[258,5,258,6],[260,3,260,4],[260,5,260,6],[250,3,250,4],[250,5,250,6],[252,3,252,4],[252,5,252,6],[254,3,254,4],[254,5,254,6],[244,3,244,4],[244,5,244,6],[246,3,246,4],[246,5,246,6],[248,3,248,4],[248,5,248,6],[238,3,238,4],[238,5,238,6],[240,3,240,4],[240,5,240,6],[242,3,242,4],[242,5,242,6],[232,3,232,4],[232,5,232,6],[234,3,234,4],[234,5,234,6],[236,3,236,4],[236,5,236,6],[226,3,226,4],[226,5,226,6],[228,3,228,4],[228,5,228,6],[230,3,230,4],[230,5,230,6],[220,3,220,4],[220,5,220,6],[222,3,222,4],[222,5,222,6],[224,3,224,4],[224,5,224,6],[214,3,214,4],[214,5,214,6],[216,3,216,4],[216,5,216,6],[218,3,218,4],[218,5,218,6],[208,3,208,4],[208,5,208,6],[210,3,210,4],[210,5,210,6],[212,3,212,4],[212,5,212,6],[202,3,202,4],[202,5,202,6],[204,3,204,4],[204,5,204,6],[206,3,206,4],[206,5,206,6],[196,3,196,4],[196,5,196,6],[198,3,198,4],[198,5,198,6],[200,3,200,4],[200,5,200,6],[190,3,190,4],[190,5,190,6],[192,3,192,4],[192,5,192,6],[194,3,194,4],[194,5,194,6],[184,3,184,4],[184,5,184,6],[186,3,186,4],[186,5,186,6],[188,3,188,4],[188,5,188,6],[178,3,178,4],[178,5,178,6],[180,3,180,4],[180,5,180,6],[182,3,182,4],[182,5,182,6],[172,3,172,4],[172,5,172,6],[174,3,174,4],[174,5,174,6],[176,3,176,4],[176,5,176,6],[166,3,166,4],[166,5,166,6],[168,3,168,4],[168,5,168,6],[170,3,170,4],[170,5,170,6],[160,3,160,4],[160,5,160,6],[162,3,162,4],[162,5,162,6],[164,3,164,4],[164,5,164,6],[154,3,154,4],[154,5,154,6],[156,3,156,4],[156,5,156,6],[158,3,158,4],[158,5,158,6],[148,3,148,4],[148,5,148,6],[150,3,150,4],[150,5,150,6],[152,3,152,4],[152,5,152,6],[142,3,142,4],[142,5,142,6],[144,3,144,4],[144,5,144,6],[146,3,146,4],[146,5,146,6],[136,3,136,4],[136,5,136,6],[138,3,138,4],[138,5,138,6],[140,3,140,4],[140,5,140,6],[130,3,130,4],[130,5,130,6],[132,3,132,4],[132,5,132,6],[134,3,134,4],[134,5,134,6],[124,3,124,4],[124,5,124,6],[126,3,126,4],[126,5,126,6],[128,3,128,4],[128,5,128,6],[118,3,118,4],[118,5,118,6],[120,3,120,4],[120,5,120,6],[122,3,122,4],[122,5,122,6],[112,3,112,4],[112,5,112,6],[114,3,114,4],[114,5,114,6],[116,3,116,4],[116,5,116,6],[106,3,106,4],[106,5,106,6],[108,3,108,4],[108,5,108,6],[110,3,110,4],[110,5,110,6],[100,3,100,4],[100,5,100,6],[102,3,102,4],[102,5,102,6],[104,3,104,4],[104,5,104,6],[94,3,94,4],[94,5,94,6],[96,3,96,4],[96,5,96,6],[98,3,98,4],[98,5,98,6],[88,3,88,4],[88,5,88,6],[90,3,90,4],[90,5,90,6],[92,3,92,4],[92,5,92,6],[82,3,82,4],[82,5,82,6],[84,3,84,4],[84,5,84,6],[86,3,86,4],[86,5,86,6],[76,3,76,4],[76,5,76,6],[78,3,78,4],[78,5,78,6],[80,3,80,4],[80,5,80,6],[70,3,70,4],[70,5,70,6],[72,3,72,4],[72,5,72,6],[74,3,74,4],[74,5,74,6],[64,3,64,4],[64,5,64,6],[66,3,66,4],[66,5,66,6],[68,3,68,4],[68,5,68,6],[58,3,58,4],[58,5,58,6],[60,3,60,4],[60,5,60,6],[62,3,62,4],[62,5,62,6],[52,3,52,4],[52,5,52,6],[54,3,54,4],[54,5,54,6],[56,3,56,4],[56,5,56,6],[46,3,46,4],[46,5,46,6],[48,3,48,4],[48,5,48,6],[50,3,50,4],[50,5,50,6],[40,3,40,4],[40,5,40,6],[42,3,42,4],[42,5,42,6],[44,3,44,4],[44,5,44,6],[34,3,34,4],[34,5,34,6],[36,3,36,4],[36,5,36,6],[38,3,38,4],[38,5,38,6],[30,3,30,4],[30,5,30,6],[32,3,32,4],[32,5,32,6],[28,3,28,4],[28,5,28,6],[4,3,4,4],[4,5,4,6],[26,3,26,4],[26,5,26,6],[20,3,20,4],[20,5,20,6],[22,3,22,4],[22,5,22,6],[24,3,24,4],[24,5,24,6],[18,3,18,4],[18,5,18,6],[4,28,4,44],[0,28,0,44],[2,3,2,4],[2,5,2,6],[6,3,6,4],[6,5,6,6],[14,3,14,4],[14,5,14,6],[16,3,16,4],[16,5,16,6],[8,3,8,4],[8,5,8,6],[10,3,10,4],[10,5,10,6],[12,3,12,4],[12,5,12,6],[0,3,0,7],[1,3,1,7],[1,28,1,42],[2,28,2,42],[10,29,10,30],[10,32,10,33],[10,35,10,36]]}
[null,null,null,"人数により自動でRTを作成→",null,null,null,null,null,"人数は：",{"$f":"IF('1組'!$E6=\"\",\"\",34 - COUNTIF('1組'!$E$6:$E$39,\"\") )","v":13},"人","列数は：",{"$f":"IF($K$1=\"\",\"\",HLOOKUP($K$1,list!$A$1:$BW$2,2,FALSE))","v":52},"列","(listセルの開始列数)",null,null,null,null,null,null,null,null,null,null,null,null,"3人～17人対応　RT作成ボタンで対戦相手が表示されラベルも同時に作成されます。 ※注）RT、一組で入力したスコアは消えます。"]
[null,null,null,"←スコアを1組セルに反映",null,null,null,null,null,"何節まで：",3,"節",null,null,null,"１組側の行と列変換",null,null,null,null,null,null,null,null,null,null,null,null,"RT作成ボタンを押す前に、1組の選手を登録すると人数が自動表示されます。（人数は入力しないで下さい。）"]
["試合数","節数/No.","名　前","スコア",null,"スコア",null,"名　前","No.",null,null,null,"スコアL行","スコアL列","ABL行","ABL列","HRL行","HRL列","ハンデ左","スコアL行","スコアL列","ABR行","ABR列","HRR行","HRR列","ハンデ右",null,null,"節数を入力しRT作成ボタンを押すと、入力節まで表示されます。（”９９”と入力すると全節が表示され”０”だと全節クリアされます。）"]
[]
[null,"一節",{"$f":"IF(AND($B5>=1,$B5<=17),INDEX('1組'!$B$6:$E$39,MATCH($B5,'1組'!$B$6:$B$39,0),4),\"\")","v":""},null,null,null,null,{"$f":"IF(AND($I5>=1,$I5<=17),INDEX('1組'!$B$6:$E$39,MATCH($I5,'1組'!$B$6:$B$39,0),4),\"\")","v":""},null,null,null,null,{"$f":"IF($A5=\"\",\"\",$B5+$B5+5)","v":""},{"$f":"IF($A5=\"\",\"\",$I5+$I5+4)","v":""},null,null,null,null,null,{"$f":"IF($A5=\"\",\"\",$I5+$I5+5)","v":""},{"$f":"IF($A5=\"\",\"\",$B5+$B5+4)","v":""},null,null,null,null,null,null,null,"スコア入力後、1組へ反映ボタンを押すと、1組にスコアが反映されます。※注）１組で入力したスコアは消えます。"]
[]
{"$rows_left_out":324}
{"sheet":"ラベル","index":5,"n_rows":79,"n_cols":15,"rows_kept":79,"cut":false,"hidden":false,"merged":[]}
[]
[null,"2 - 4　持ち点：180","第1節　(1)　持ち点：180",null,null,"3 - 6　持ち点：180","第1節　(2)　持ち点：180",null,null,"5 - 8　持ち点：180","第1節　(3)　持ち点：180",null,null,"10 - 7　持ち点：180","第1節　(4)　持ち点：180"]
[null,"近藤","山田　晋之",null,null,"吉向","長谷川",null,null,"山田晃司","金澤",null,null,"岩本","植田"]
[]
[]
[null,"HR","HR",null,null,"HR","HR",null,null,"HR","HR",null,null,"HR","HR"]
{"$rows_left_out":74}
{"sheet":"結果","index":6,"n_rows":18,"n_cols":7,"rows_kept":18,"cut":false,"hidden":false,"merged":[]}
["順位","名      前","W","L","TP","LP","HR"]
[1,{"$f":"IF(ISERROR(INDEX('1組'!$E$6:$AT$39,MATCH($A2,'1組'!$AS$6:$AS$39,0),1)),\"\",INDEX('1組'!$E$6:$AT$39,MATCH($A2,'1組'!$AS$6:$AS$39,0),1))","v":"白戸"},{"$f":"IF(ISERROR(INDEX('1組'!$E$6:$AT$39,MATCH($A2,'1組'!$AS$6:$AS$39,0),36)),\"\",INDEX('1組'!$E$6:$AT$39,MATCH($A2,'1組'!$AS$6:$AS$39,0),36))","v":5},{"$f":"IF(ISERROR(INDEX('1組'!$E$6:$AT$39,MATCH($A2,'1組'!$AS$6:$AS$39,0),37)),\"\",INDEX('1組'!$E$6:$AT$39,MATCH($A2,'1組'!$AS$6:$AS$39,0),37))","v":1},{"$f":"IF(ISERROR(INDEX('1組'!$E$6:$AT$39,MATCH($A2,'1組'!$AS$6:$AS$39,0),38)),\"\",INDEX('1組'!$E$6:$AT$39,MATCH($A2,'1組'!$AS$6:$AS$39,0),38))","v":1073},{"$f":"IF(ISERROR(INDEX('1組'!$E$6:$AT$39,MATCH($A2,'1組'!$AS$6:$AS$39,0),39)),\"\",INDEX('1組'!$E$6:$AT$39,MATCH($A2,'1組'!$AS$6:$AS$39,0),39))","v":263},{"$f":"IF(ISERROR(INDEX('1組'!$E$6:$AT$39,MATCH($A2,'1組'!$AS$6:$AS$39,0),42)),\"\",INDEX('1組'!$E$6:$AT$39,MATCH($A2,'1組'!$AS$6:$AS$39,0),42))","v":110}]
[{"$f":"A2+1","v":2},{"$f":"IF(ISERROR(INDEX('1組'!$E$6:$AS$39,MATCH($A3,'1組'!$AS$6:$AS$39,0),1)),\"\",INDEX('1組'!$E$6:$AS$39,MATCH($A3,'1組'!$AS$6:$AS$39,0),1))","v":"吉向"},{"$f":"IF(ISERROR(INDEX('1組'!$E$6:$AT$39,MATCH($A3,'1組'!$AS$6:$AS$39,0),36)),\"\",INDEX('1組'!$E$6:$AT$39,MATCH($A3,'1組'!$AS$6:$AS$39,0),36))","v":5},{"$f":"IF(ISERROR(INDEX('1組'!$E$6:$AT$39,MATCH($A3,'1組'!$AS$6:$AS$39,0),37)),\"\",INDEX('1組'!$E$6:$AT$39,MATCH($A3,'1組'!$AS$6:$AS$39,0),37))","v":1},{"$f":"IF(ISERROR(INDEX('1組'!$E$6:$AT$39,MATCH($A3,'1組'!$AS$6:$AS$39,0),38)),\"\",INDEX('1組'!$E$6:$AT$39,MATCH($A3,'1組'!$AS$6:$AS$39,0),38))","v":1065},{"$f":"IF(ISERROR(INDEX('1組'!$E$6:$AT$39,MATCH($A3,'1組'!$AS$6:$AS$39,0),39)),\"\",INDEX('1組'!$E$6:$AT$39,MATCH($A3,'1組'!$AS$6:$AS$39,0),39))","v":316},{"$f":"IF(ISERROR(INDEX('1組'!$E$6:$AT$39,MATCH($A3,'1組'!$AS$6:$AS$39,0),42)),\"\",INDEX('1組'!$E$6:$AT$39,MATCH($A3,'1組'!$AS$6:$AS$39,0),42))","v":105}]
[{"$f":"A3+1","v":3},{"$f":"IF(ISERROR(INDEX('1組'!$E$6:$AS$39,MATCH($A4,'1組'!$AS$6:$AS$39,0),1)),\"\",INDEX('1組'!$E$6:$AS$39,MATCH($A4,'1組'!$AS$6:$AS$39,0),1))","v":"山田晃司"},{"$f":"IF(ISERROR(INDEX('1組'!$E$6:$AT$39,MATCH($A4,'1組'!$AS$6:$AS$39,0),36)),\"\",INDEX('1組'!$E$6:$AT$39,MATCH($A4,'1組'!$AS$6:$AS$39,0),36))","v":5},{"$f":"IF(ISERROR(INDEX('1組'!$E$6:$AT$39,MATCH($A4,'1組'!$AS$6:$AS$39,0),37)),\"\",INDEX('1組'!$E$6:$AT$39,MATCH($A4,'1組'!$AS$6:$AS$39,0),37))","v":1},{"$f":"IF(ISERROR(INDEX('1組'!$E$6:$AT$39,MATCH($A4,'1組'!$AS$6:$AS$39,0),38)),\"\",INDEX('1組'!$E$6:$AT$39,MATCH($A4,'1組'!$AS$6:$AS$39,0),38))","v":1018},{"$f":"IF(ISERROR(INDEX('1組'!$E$6:$AT$39,MATCH($A4,'1組'!$AS$6:$AS$39,0),39)),\"\",INDEX('1組'!$E$6:$AT$39,MATCH($A4,'1組'!$AS$6:$AS$39,0),39))","v":648},{"$f":"IF(ISERROR(INDEX('1組'!$E$6:$AT$39,MATCH($A4,'1組'!$AS$6:$AS$39,0),42)),\"\",INDEX('1組'!$E$6:$AT$39,MATCH($A4,'1組'!$AS$6:$AS$39,0),42))","v":0}]
[4,{"$f":"IF(ISERROR(INDEX('1組'!$E$6:$AS$39,MATCH($A5,'1組'!$AS$6:$AS$39,0),1)),\"\",INDEX('1組'!$E$6:$AS$39,MATCH($A5,'1組'!$AS$6:$AS$39,0),1))","v":"斎藤裕児"},{"$f":"IF(ISERROR(INDEX('1組'!$E$6:$AT$39,MATCH($A5,'1組'!$AS$6:$AS$39,0),36)),\"\",INDEX('1組'!$E$6:$AT$39,MATCH($A5,'1組'!$AS$6:$AS$39,0),36))","v":5},{"$f":"IF(ISERROR(INDEX('1組'!$E$6:$AT$39,MATCH($A5,'1組'!$AS$6:$AS$39,0),37)),\"\",INDEX('1組'!$E$6:$AT$39,MATCH($A5,'1組'!$AS$6:$AS$39,0),37))","v":1},{"$f":"IF(ISERROR(INDEX('1組'!$E$6:$AT$39,MATCH($A5,'1組'!$AS$6:$AS$39,0),38)),\"\",INDEX('1組'!$E$6:$AT$39,MATCH($A5,'1組'!$AS$6:$AS$39,0),38))","v":964},{"$f":"IF(ISERROR(INDEX('1組'!$E$6:$AT$39,MATCH($A5,'1組'!$AS$6:$AS$39,0),39)),\"\",INDEX('1組'!$E$6:$AT$39,MATCH($A5,'1組'!$AS$6:$AS$39,0),39))","v":406},{"$f":"IF(ISERROR(INDEX('1組'!$E$6:$AT$39,MATCH($A5,'1組'!$AS$6:$AS$39,0),42)),\"\",INDEX('1組'!$E$6:$AT$39,MATCH($A5,'1組'!$AS$6:$AS$39,0),42))","v":0}]
[5,{"$f":"IF(ISERROR(INDEX('1組'!$E$6:$AS$39,MATCH($A6,'1組'!$AS$6:$AS$39,0),1)),\"\",INDEX('1組'!$E$6:$AS$39,MATCH($A6,'1組'!$AS$6:$AS$39,0),1))","v":"近藤"},{"$f":"IF(ISERROR(INDEX('1組'!$E$6:$AT$39,MATCH($A6,'1組'!$AS$6:$AS$39,0),36)),\"\",INDEX('1組'!$E$6:$AT$39,MATCH($A6,'1組'!$AS$6:$AS$39,0),36))","v":4},{"$f":"IF(ISERROR(INDEX('1組'!$E$6:$AT$39,MATCH($A6,'1組'!$AS$6:$AS$39,0),37)),\"\",INDEX('1組'!$E$6:$AT$39,MATCH($A6,'1組'!$AS$6:$AS$39,0),37))","v":2},{"$f":"IF(ISERROR(INDEX('1組'!$E$6:$AT$39,MATCH($A6,'1組'!$AS$6:$AS$39,0),38)),\"\",INDEX('1組'!$E$6:$AT$39,MATCH($A6,'1組'!$AS$6:$AS$39,0),38))","v":829},{"$f":"IF(ISERROR(INDEX('1組'!$E$6:$AT$39,MATCH($A6,'1組'!$AS$6:$AS$39,0),39)),\"\",INDEX('1組'!$E$6:$AT$39,MATCH($A6,'1組'!$AS$6:$AS$39,0),39))","v":343},0]
{"$rows_left_out":12}