{"text_format":"1","workbook":"xlsx","n_sheets":6,"sheets":["【準備】登録","【準備】対戦カード","【進行】結果入力表","【結果】個人成績表","【結果】リーグ成績表","【結果】総合結果表"],"not_rendered":{"charts":0,"images":0,"macros":1,"external_links":0,"defined_names":16,"comments":1,"pivot_tables":0},"unopened":[],"bounds":{"document_bytes":16777216,"sheet_cells":100000,"rows_first":2000,"rows_last":500,"rows_between":2000,"halvings":0,"cell_chars":16384,"cell_head_chars":4096},"cells_cut":0,"cells_raw":0,"read":"whole","date_system":"1900"}

{"sheet":"【準備】登録","index":0,"n_rows":58,"n_cols":59,"rows_kept":58,"cut":false,"hidden":false,"merged":[[18,3,18,5],[18,6,18,9],[24,3,24,5],[24,6,24,9],[24,10,24,12],[20,6,20,9],[20,10,20,12],[18,10,18,12],[20,20,20,23],[24,13,24,16],[24,17,24,19],[24,20,24,23],[23,17,23,19],[23,20,23,23],[19,20,19,23],[23,10,23,12],[23,13,23,16],[23,3,23,5],[23,6,23,9],[22,3,22,5],[22,6,22,9],[22,10,22,12],[22,13,22,16],[20,3,20,5],[19,10,19,12],[19,6,19,9],[20,13,20,16],[22,17,22,19],[22,20,22,23],[21,20,21,23],[18,13,18,16],[19,17,19,19],[17,10,17,16],[15,3,15,4],[21,17,21,19],[19,13,19,16],[21,3,21,5],[21,6,21,9],[21,10,21,12],[21,13,21,16],[20,17,20,19],[17,3,17,9],[17,17,17,23],[18,17,18,19],[18,20,18,23],[19,3,19,5],[14,3,14,4],[12,15,12,16],[11,6,11,7],[10,9,10,10],[12,6,12,7],[12,9,12,10],[12,12,12,13],[11,12,11,13],[11,15,11,16],[10,12,10,13],[10,15,10,16],[5,10,5,11],[9,9,9,10],[8,12,8,14],[8,15,8,17],[8,18,8,20],[9,18,9,19],[9,12,9,13],[9,15,9,16],[11,21,11,22],[12,18,12,19],[9,21,9,22],[8,9,8,11],[11,9,11,10],[12,21,12,22],[10,18,10,19],[10,21,10,22],[8,21,8,23],[12,1,12,2],[11,3,11,4],[12,3,12,4],[11,1,11,2],[11,18,11,19],[1,6,1,7],[10,1,10,2],[10,6,10,7],[3,3,3,6],[8,1,9,2],[9,6,9,7],[5,3,5,8],[8,3,8,5],[8,6,8,8],[10,3,10,4],[9,3,9,4]]}
[null,null,null,null,null,null,null,null,null,null,null,null,null,null,null,null,null,null,null,null,null,null,null,null,null,null,null,null,null,null,"ver.1.9改","ayayagogo7@gmail.com"]
["対抗戦名称",null,null,"第",8,"回","阪神奈",null,"対抗戦",null,null,null,null,null,null,null,null,null,null,null,null,null,null,null,null,null,null,null,null,null,"by.にんにん","バグ等が有りましたら、その状態で保存しメールお願いします。"]
[null,null,null,null,null,null,null,null,null,null,null,null,null,null,null,null,null,null,null,null,null,null,null,null,null,null,null,null,null,null,null,"出来る範囲で対応します。"]
["開催日",null,null,"2015-10-25"]
[]
["会場",null,null,"キングスポット",null,null,null,null,null,"（",{"$f":"IF($D6=\"\",\"\",INDEX($AF10:$AG$18,MATCH($D6,$AF10:$AF18,0),2))","v":"奈良"},null,"）",null,null,null,null,null,null,null,null,null,null,null,null,null,null,null,null,null,"※会場・地域を事前に設定しておいて下さい。"]
[null,null,null,null,null,null,null,null,null,null,null,null,null,null,null,null,null,null,null,null,null,null,null,null,null,null,null,null,null,null,"※チームリストは変更出来ません。（変更がある場合は対応します。）"]
["出場選手"]
["前回","チーム",null,1,null,null,2,null,null,3,null,null,4,null,null,5,null,null,6,null,null,7,null,null,null,null,null,null,null,null,"チームリスト","会　場","地域"]
["順位",null,null,"選手名",null,"点数","選手名",null,"点数","選手名",null,"点数","選手名",null,"点数","選手名",null,"点数","選手名",null,"点数","選手名",null,"点数",null,null,null,null,null,null,"ORC","トップガン","奈良"]
["3位",{"$f":"R18","v":"HRC"},null,{"$f":"IF(R19=\"\",\"\",R19)","v":"高木　俊行"},null,{"$f":"IF(D11=\"\",\"\",IF($B11=$AE$27,INDEX($AE$28:$AH$57,MATCH(D11,$AE$28:$AE$57,0),4),IF($B11=$AJ$27,INDEX($AJ$28:$AM$57,MATCH(D11,$AJ$28:$AJ$57,0),4),IF($B11=$AO$27,INDEX($AO$28:$AR$57,MATCH(D11,$AO$28:$AO$57,0),4),IF($B11=$AT$27,INDEX($AT$28:$AW$57,MATCH(D11,$AT$28:$AT$57,0),4),IF($B11=$AY$27,INDEX($AY$28:$BB$57,MATCH(D11,$AY$28:$AY$57,0),4),IF($B11=$BD$27,INDEX($BD$28:$BG$57,MATCH(D11,$BD$28:$BD$57,0),4),\"\")))))))","v":180},{"$f":"IF(R20=\"\",\"\",R20)","v":"堂園　雅也"},null,{"$f":"IF(G11=\"\",\"\",IF($B11=$AE$27,INDEX($AE$28:$AH$57,MATCH(G11,$AE$28:$AE$57,0),4),IF($B11=$AJ$27,INDEX($AJ$28:$AM$57,MATCH(G11,$AJ$28:$AJ$57,0),4),IF($B11=$AO$27,INDEX($AO$28:$AR$57,MATCH(G11,$AO$28:$AO$57,0),4),IF($B11=$AT$27,INDEX($AT$28:$AW$57,MATCH(G11,$AT$28:$AT$57,0),4),IF($B11=$AY$27,INDEX($AY$28:$BB$57,MATCH(G11,$AY$28:$AY$57,0),4),IF($B11=$BD$27,INDEX($BD$28:$BG$57,MATCH(G11,$BD$28:$BD$57,0),4),\"\")))))))","v":180},{"$f":"IF(R21=\"\",\"\",R21)","v":"菊川　博功"},null,{"$f":"IF(J11=\"\",\"\",IF($B11=$AE$27,INDEX($AE$28:$AH$57,MATCH(J11,$AE$28:$AE$57,0),4),IF($B11=$AJ$27,INDEX($AJ$28:$AM$57,MATCH(J11,$AJ$28:$AJ$57,0),4),IF($B11=$AO$27,INDEX($AO$28:$AR$57,MATCH(J11,$AO$28:$AO$57,0),4),IF($B11=$AT$27,INDEX($AT$28:$AW$57,MATCH(J11,$AT$28:$AT$57,0),4),IF($B11=$AY$27,INDEX($AY$28:$BB$57,MATCH(J11,$AY$28:$AY$57,0),4),IF($B11=$BD$27,INDEX($BD$28:$BG$57,MATCH(J11,$BD$28:$BD$57,0),4),\"\")))))))","v":180},{"$f":"IF(R22=\"\",\"\",R22)","v":"丹羽　俊也"},null,{"$f":"IF(M11=\"\",\"\",IF($B11=$AE$27,INDEX($AE$28:$AH$57,MATCH(M11,$AE$28:$AE$57,0),4),IF($B11=$AJ$27,INDEX($AJ$28:$AM$57,MATCH(M11,$AJ$28:$AJ$57,0),4),IF($B11=$AO$27,INDEX($AO$28:$AR$57,MATCH(M11,$AO$28:$AO$57,0),4),IF($B11=$AT$27,INDEX($AT$28:$AW$57,MATCH(M11,$AT$28:$AT$57,0),4),IF($B11=$AY$27,INDEX($AY$28:$BB$57,MATCH(M11,$AY$28:$AY$57,0),4),IF($B11=$BD$27,INDEX($BD$28:$BG$57,MATCH(M11,$BD$28:$BD$57,0),4),\"\")))))))","v":180},{"$f":"IF(R23=\"\",\"\",R23)","v":"高山　普任"},null,{"$f":"IF(P11=\"\",\"\",IF($B11=$AE$27,INDEX($AE$28:$AH$57,MATCH(P11,$AE$28:$AE$57,0),4),IF($B11=$AJ$27,INDEX($AJ$28:$AM$57,MATCH(P11,$AJ$28:$AJ$57,0),4),IF($B11=$AO$27,INDEX($AO$28:$AR$57,MATCH(P11,$AO$28:$AO$57,0),4),IF($B11=$AT$27,INDEX($AT$28:$AW$57,MATCH(P11,$AT$28:$AT$57,0),4),IF($B11=$AY$27,INDEX($AY$28:$BB$57,MATCH(P11,$AY$28:$AY$57,0),4),IF($B11=$BD$27,INDEX($BD$28:$BG$57,MATCH(P11,$BD$28:$BD$57,0),4),\"\")))))))","v":180},{"$f":"IF(R24=\"\",\"\",R24)","v":"藤中健太郎"},null,{"$f":"IF(S11=\"\",\"\",IF($B11=$AE$27,INDEX($AE$28:$AH$57,MATCH(S11,$AE$28:$AE$57,0),4),IF($B11=$AJ$27,INDEX($AJ$28:$AM$57,MATCH(S11,$AJ$28:$AJ$57,0),4),IF($B11=$AO$27,INDEX($AO$28:$AR$57,MATCH(S11,$AO$28:$AO$57,0),4),IF($B11=$AT$27,INDEX($AT$28:$AW$57,MATCH(S11,$AT$28:$AT$57,0),4),IF($B11=$AY$27,INDEX($AY$28:$BB$57,MATCH(S11,$AY$28:$AY$57,0),4),IF($B11=$BD$27,INDEX($BD$28:$BG$57,MATCH(S11,$BD$28:$BD$57,0),4),\"\")))))))","v":180},{"$f":"IF(R25=\"\",\"\",R25)","v":"中平　美輪"},null,{"$f":"IF(V11=\"\",\"\",IF($B11=$AE$27,INDEX($AE$28:$AH$57,MATCH(V11,$AE$28:$AE$57,0),4),IF($B11=$AJ$27,INDEX($AJ$28:$AM$57,MATCH(V11,$AJ$28:$AJ$57,0),4),IF($B11=$AO$27,INDEX($AO$28:$AR$57,MATCH(V11,$AO$28:$AO$57,0),4),IF($B11=$AT$27,INDEX($AT$28:$AW$57,MATCH(V11,$AT$28:$AT$57,0),4),IF($B11=$AY$27,INDEX($AY$28:$BB$57,MATCH(V11,$AY$28:$AY$57,0),4),IF($B11=$BD$27,INDEX($BD$28:$BG$57,MATCH(V11,$BD$28:$BD$57,0),4),\"\")))))))","v":140},null,null,null,null,null,null,"KRC","キングスポット","奈良"]
["1位",{"$f":"K18","v":"NRC"},null,{"$f":"IF(K19=\"\",\"\",K19)","v":"吉向　翔平"},null,{"$f":"IF(D12=\"\",\"\",IF($B12=$AE$27,INDEX($AE$28:$AH$57,MATCH(D12,$AE$28:$AE$57,0),4),IF($B12=$AJ$27,INDEX($AJ$28:$AM$57,MATCH(D12,$AJ$28:$AJ$57,0),4),IF($B12=$AO$27,INDEX($AO$28:$AR$57,MATCH(D12,$AO$28:$AO$57,0),4),IF($B12=$AT$27,INDEX($AT$28:$AW$57,MATCH(D12,$AT$28:$AT$57,0),4),IF($B12=$AY$27,INDEX($AY$28:$BB$57,MATCH(D12,$AY$28:$AY$57,0),4),IF($B12=$BD$27,INDEX($BD$28:$BG$57,MATCH(D12,$BD$28:$BD$57,0),4),\"\")))))))","v":180},{"$f":"IF(K20=\"\",\"\",K20)","v":"近藤　拓馬"},null,{"$f":"IF(G12=\"\",\"\",IF($B12=$AE$27,INDEX($AE$28:$AH$57,MATCH(G12,$AE$28:$AE$57,0),4),IF($B12=$AJ$27,INDEX($AJ$28:$AM$57,MATCH(G12,$AJ$28:$AJ$57,0),4),IF($B12=$AO$27,INDEX($AO$28:$AR$57,MATCH(G12,$AO$28:$AO$57,0),4),IF($B12=$AT$27,INDEX($AT$28:$AW$57,MATCH(G12,$AT$28:$AT$57,0),4),IF($B12=$AY$27,INDEX($AY$28:$BB$57,MATCH(G12,$AY$28:$AY$57,0),4),IF($B12=$BD$27,INDEX($BD$28:$BG$57,MATCH(G12,$BD$28:$BD$57,0),4),\"\")))))))","v":180},{"$f":"IF(K21=\"\",\"\",K21)","v":"金澤　茂昌"},null,{"$f":"IF(J12=\"\",\"\",IF($B12=$AE$27,INDEX($AE$28:$AH$57,MATCH(J12,$AE$28:$AE$57,0),4),IF($B12=$AJ$27,INDEX($AJ$28:$AM$57,MATCH(J12,$AJ$28:$AJ$57,0),4),IF($B12=$AO$27,INDEX($AO$28:$AR$57,MATCH(J12,$AO$28:$AO$57,0),4),IF($B12=$AT$27,INDEX($AT$28:$AW$57,MATCH(J12,$AT$28:$AT$57,0),4),IF($B12=$AY$27,INDEX($AY$28:$BB$57,MATCH(J12,$AY$28:$AY$57,0),4),IF($B12=$BD$27,INDEX($BD$28:$BG$57,MATCH(J12,$BD$28:$BD$57,0),4),\"\")))))))","v":180},{"$f":"IF(K22=\"\",\"\",K22)","v":"斉藤　裕児"},null,{"$f":"IF(M12=\"\",\"\",IF($B12=$AE$27,INDEX($AE$28:$AH$57,MATCH(M12,$AE$28:$AE$57,0),4),IF($B12=$AJ$27,INDEX($AJ$28:$AM$57,MATCH(M12,$AJ$28:$AJ$57,0),4),IF($B12=$AO$27,INDEX($AO$28:$AR$57,MATCH(M12,$AO$28:$AO$57,0),4),IF($B12=$AT$27,INDEX($AT$28:$AW$57,MATCH(M12,$AT$28:$AT$57,0),4),IF($B12=$AY$27,INDEX($AY$28:$BB$57,MATCH(M12,$AY$28:$AY$57,0),4),IF($B12=$BD$27,INDEX($BD$28:$BG$57,MATCH(M12,$BD$28:$BD$57,0),4),\"\")))))))","v":180},{"$f":"IF(K23=\"\",\"\",K23)","v":"岩本　剛"},null,{"$f":"IF(P12=\"\",\"\",IF($B12=$AE$27,INDEX($AE$28:$AH$57,MATCH(P12,$AE$28:$AE$57,0),4),IF($B12=$AJ$27,INDEX($AJ$28:$AM$57,MATCH(P12,$AJ$28:$AJ$57,0),4),IF($B12=$AO$27,INDEX($AO$28:$AR$57,MATCH(P12,$AO$28:$AO$57,0),4),IF($B12=$AT$27,INDEX($AT$28:$AW$57,MATCH(P12,$AT$28:$AT$57,0),4),IF($B12=$AY$27,INDEX($AY$28:$BB$57,MATCH(P12,$AY$28:$AY$57,0),4),IF($B12=$BD$27,INDEX($BD$28:$BG$57,MATCH(P12,$BD$28:$BD$57,0),4),\"\")))))))","v":180},{"$f":"IF(K24=\"\",\"\",K24)","v":"植田　慎也"},null,{"$f":"IF(S12=\"\",\"\",IF($B12=$AE$27,INDEX($AE$28:$AH$57,MATCH(S12,$AE$28:$AE$57,0),4),IF($B12=$AJ$27,INDEX($AJ$28:$AM$57,MATCH(S12,$AJ$28:$AJ$57,0),4),IF($B12=$AO$27,INDEX($AO$28:$AR$57,MATCH(S12,$AO$28:$AO$57,0),4),IF($B12=$AT$27,INDEX($AT$28:$AW$57,MATCH(S12,$AT$28:$AT$57,0),4),IF($B12=$AY$27,INDEX($AY$28:$BB$57,MATCH(S12,$AY$28:$AY$57,0),4),IF($B12=$BD$27,INDEX($BD$28:$BG$57,MATCH(S12,$BD$28:$BD$57,0),4),\"\")))))))","v":180},{"$f":"IF(K25=\"\",\"\",K25)","v":"宮野　早織"},null,{"$f":"IF(V12=\"\",\"\",IF($B12=$AE$27,INDEX($AE$28:$AH$57,MATCH(V12,$AE$28:$AE$57,0),4),IF($B12=$AJ$27,INDEX($AJ$28:$AM$57,MATCH(V12,$AJ$28:$AJ$57,0),4),IF($B12=$AO$27,INDEX($AO$28:$AR$57,MATCH(V12,$AO$28:$AO$57,0),4),IF($B12=$AT$27,INDEX($AT$28:$AW$57,MATCH(V12,$AT$28:$AT$57,0),4),IF($B12=$AY$27,INDEX($AY$28:$BB$57,MATCH(V12,$AY$28:$AY$57,0),4),IF($B12=$BD$27,INDEX($BD$28:$BG$57,MATCH(V12,$BD$28:$BD$57,0),4),\"\")))))))","v":140},null,null,null,null,null,null,"HRC","プールギャング","奈良"]
["2位",{"$f":"D18","v":"ORC"},null,{"$f":"IF(D19=\"\",\"\",D19)","v":"樹本　武士"},null,180,{"$f":"IF(D20=\"\",\"\",D20)","v":"乾　伸綱"},null,180,{"$f":"IF(D21=\"\",\"\",D21)","v":"村上　泰辰"},null,180,{"$f":"IF(D22=\"\",\"\",D22)","v":"山岡　修二"},null,180,{"$f":"IF(D23=\"\",\"\",D23)","v":"吉岡　保俊"},null,180,{"$f":"IF(D24=\"\",\"\",D24)","v":"渡邊　孝行"},null,180,{"$f":"IF(D25=\"\",\"\",D25)","v":"山崎真紀子"},null,140,null,null,null,null,null,null,"SBC"]
[null,null,null,null,null,null,null,null,null,null,null,null,null,null,null,null,null,null,null,null,null,null,null,null,null,null,null,null,null,null,"NRC"]
["点数",null,null,"男性",null,"：","M",null,180,"点",null,null,null,null,null,null,null,null,null,null,null,null,null,null,null,null,null,null,null,null,"WRC"]
[null,null,null,"女性",null,"：","W",null,140,"点"]
[]
[null,null,null,"ORC",null,null,null,null,null,null,"NRC",null,null,null,null,null,null,"HRC"]
[null,null,1,"樹本　武士",null,null,{"$f":"IF($D19=\"\",\"\",IF($D$18=\"ORC\",INDEX($AE$28:$AF$57,MATCH($D19,$AE$28:$AE$57,0),2),IF($D$18=\"KRC\",INDEX($AJ$28:$AK$57,MATCH($D19,$AJ$28:$AJ$57,0),2),IF($D$18=\"HRC\",INDEX($AO$28:$AP$57,MATCH($D19,$AO$28:$AO$57,0),2),IF($D$18=\"SBC\",INDEX($AT$28:$AU$57,MATCH($D19,$AT$28:$AT$57,0),2),IF($D$18=\"NRC\",INDEX($AY$28:$AZ$57,MATCH($D19,$AY$28:$AY$57,0),2),IF($D$18=\"WRC\",INDEX($BD$28:$BE$57,MATCH($D19,$BD$28:$BD$57,0),2),\"\")))))))","v":"きもと　たけし"},null,null,null,"吉向　翔平",null,null,{"$f":"IF($K19=\"\",\"\",IF($K$18=\"ORC\",INDEX($AE$28:$AF$57,MATCH($K19,$AE$28:$AE$57,0),2),IF($K$18=\"KRC\",INDEX($AJ$28:$AK$57,MATCH($K19,$AJ$28:$AJ$57,0),2),IF($K$18=\"HRC\",INDEX($AO$28:$AP$57,MATCH($K19,$AO$28:$AO$57,0),2),IF($K$18=\"SBC\",INDEX($AT$28:$AU$57,MATCH($K19,$AT$28:$AT$57,0),2),IF($K$18=\"NRC\",INDEX($AY$28:$AZ$57,MATCH($K19,$AY$28:$AY$57,0),2),IF($K$18=\"WRC\",INDEX($BD$28:$BE$57,MATCH($K19,$BD$28:$BD$57,0),2),\"\")))))))","v":"きっこう　しょうへい"},null,null,null,"高木　俊行",null,null,{"$f":"IF($R19=\"\",\"\",IF($R$18=\"ORC\",INDEX($AE$28:$AF$57,MATCH($R19,$AE$28:$AE$57,0),2),IF($R$18=\"KRC\",INDEX($AJ$28:$AK$57,MATCH($R19,$AJ$28:$AJ$57,0),2),IF($R$18=\"HRC\",INDEX($AO$28:$AP$57,MATCH($R19,$AO$28:$AO$57,0),2),IF($R$18=\"SBC\",INDEX($AT$28:$AU$57,MATCH($R19,$AT$28:$AT$57,0),2),IF($R$18=\"NRC\",INDEX($AY$28:$AZ$57,MATCH($R19,$AY$28:$AY$57,0),2),IF($R$18=\"WRC\",INDEX($BD$28:$BE$57,MATCH($R19,$BD$28:$BD$57,0),2),\"\")))))))","v":"たかぎ　としゆき"}]
[null,null,2,"乾　伸綱",null,null,{"$f":"IF($D20=\"\",\"\",IF($D$18=\"ORC\",INDEX($AE$28:$AF$57,MATCH($D20,$AE$28:$AE$57,0),2),IF($D$18=\"KRC\",INDEX($AJ$28:$AK$57,MATCH($D20,$AJ$28:$AJ$57,0),2),IF($D$18=\"HRC\",INDEX($AO$28:$AP$57,MATCH($D20,$AO$28:$AO$57,0),2),IF($D$18=\"SBC\",INDEX($AT$28:$AU$57,MATCH($D20,$AT$28:$AT$57,0),2),IF($D$18=\"NRC\",INDEX($AY$28:$AZ$57,MATCH($D20,$AY$28:$AY$57,0),2),IF($D$18=\"WRC\",INDEX($BD$28:$BE$57,MATCH($D20,$BD$28:$BD$57,0),2),\"\")))))))","v":"いぬい　のぶつな"},null,null,null,"近藤　拓馬",null,null,{"$f":"IF($K20=\"\",\"\",IF($K$18=\"ORC\",INDEX($AE$28:$AF$57,MATCH($K20,$AE$28:$AE$57,0),2),IF($K$18=\"KRC\",INDEX($AJ$28:$AK$57,MATCH($K20,$AJ$28:$AJ$57,0),2),IF($K$18=\"HRC\",INDEX($AO$28:$AP$57,MATCH($K20,$AO$28:$AO$57,0),2),IF($K$18=\"SBC\",INDEX($AT$28:$AU$57,MATCH($K20,$AT$28:$AT$57,0),2),IF($K$18=\"NRC\",INDEX($AY$28:$AZ$57,MATCH($K20,$AY$28:$AY$57,0),2),IF($K$18=\"WRC\",INDEX($BD$28:$BE$57,MATCH($K20,$BD$28:$BD$57,0),2),\"\")))))))","v":"こんどう　たくま"},null,null,null,"堂園　雅也",null,null,{"$f":"IF($R20=\"\",\"\",IF($R$18=\"ORC\",INDEX($AE$28:$AF$57,MATCH($R20,$AE$28:$AE$57,0),2),IF($R$18=\"KRC\",INDEX($AJ$28:$AK$57,MATCH($R20,$AJ$28:$AJ$57,0),2),IF($R$18=\"HRC\",INDEX($AO$28:$AP$57,MATCH($R20,$AO$28:$AO$57,0),2),IF($R$18=\"SBC\",INDEX($AT$28:$AU$57,MATCH($R20,$AT$28:$AT$57,0),2),IF($R$18=\"NRC\",INDEX($AY$28:$AZ$57,MATCH($R20,$AY$28:$AY$57,0),2),IF($R$18=\"WRC\",INDEX($BD$28:$BE$57,MATCH($R20,$BD$28:$BD$57,0),2),\"\")))))))","v":"どうぞの まさや"}]
[null,null,3,"村上　泰辰",null,null,"むらかみ　やすよし",null,null,null,"金澤　茂昌",null,null,"かなざわ　しげまさ",null,null,null,"菊川　博功",null,null,"きくかわ ひろよし"]
[null,null,4,"山岡　修二",null,null,"やまおか　しゅうじ",null,null,null,"斉藤　裕児",null,null,"さいとう　ゆうじ",null,null,null,"丹羽　俊也",null,null,"にわ　としや"]
[null,null,5,"吉岡　保俊",null,null,"よしおか　やすとし",null,null,null,"岩本　剛",null,null,"いわもと　つよし",null,null,null,"高山　普任",null,null,"たかやま ゆきひで"]
[null,null,6,"渡邊　孝行",null,null,"わたなべ　たかゆき",null,null,null,"植田　慎也",null,null,"うえだ　しんや",null,null,null,"藤中健太郎",null,null,"ふじなか　けんたろう",null,null,null,null,null,null,null,null,null,null,"←名前順に並べ替え"]
[null,null,7,"山崎真紀子",null,null,{"$f":"IF($D25=\"\",\"\",IF($D$18=\"ORC\",INDEX($AE$28:$AF$57,MATCH($D25,$AE$28:$AE$57,0),2),IF($D$18=\"KRC\",INDEX($AJ$28:$AK$57,MATCH($D25,$AJ$28:$AJ$57,0),2),IF($D$18=\"HRC\",INDEX($AO$28:$AP$57,MATCH($D25,$AO$28:$AO$57,0),2),IF($D$18=\"SBC\",INDEX($AT$28:$AU$57,MATCH($D25,$AT$28:$AT$57,0),2),IF($D$18=\"NRC\",INDEX($AY$28:$AZ$57,MATCH($D25,$AY$28:$AY$57,0),2),IF($D$18=\"WRC\",INDEX($BD$28:$BE$57,MATCH($D25,$BD$28:$BD$57,0),2),\"\")))))))","v":"やまざき　まきこ"},null,null,null,"宮野　早織",null,null,{"$f":"IF($K25=\"\",\"\",IF($K$18=\"ORC\",INDEX($AE$28:$AF$57,MATCH($K25,$AE$28:$AE$57,0),2),IF($K$18=\"KRC\",INDEX($AJ$28:$AK$57,MATCH($K25,$AJ$28:$AJ$57,0),2),IF($K$18=\"HRC\",INDEX($AO$28:$AP$57,MATCH($K25,$AO$28:$AO$57,0),2),IF($K$18=\"SBC\",INDEX($AT$28:$AU$57,MATCH($K25,$AT$28:$AT$57,0),2),IF($K$18=\"NRC\",INDEX($AY$28:$AZ$57,MATCH($K25,$AY$28:$AY$57,0),2),IF($K$18=\"WRC\",INDEX($BD$28:$BE$57,MATCH($K25,$BD$28:$BD$57,0),2),\"\")))))))","v":"みやの　さおり"},null,null,null,"中平　美輪",null,null,{"$f":"IF($R25=\"\",\"\",IF($R$18=\"ORC\",INDEX($AE$28:$AF$57,MATCH($R25,$AE$28:$AE$57,0),2),IF($R$18=\"KRC\",INDEX($AJ$28:$AK$57,MATCH($R25,$AJ$28:$AJ$57,0),2),IF($R$18=\"HRC\",INDEX($AO$28:$AP$57,MATCH($R25,$AO$28:$AO$57,0),2),IF($R$18=\"SBC\",INDEX($AT$28:$AU$57,MATCH($R25,$AT$28:$AT$57,0),2),IF($R$18=\"NRC\",INDEX($AY$28:$AZ$57,MATCH($R25,$AY$28:$AY$57,0),2),IF($R$18=\"WRC\",INDEX($BD$28:$BE$57,MATCH($R25,$BD$28:$BD$57,0),2),\"\")))))))","v":"なかひら　みわ"},null,null,null,null,null,null,null,null,null,"※選手名漢字・よみがな・ハンデ（△）を事前に設定しておいて下さい。（漢字5文字以上は詰めて入力願います。各３０人まで対応）"]
[]
[null,null,null,null,null,null,null,null,null,null,null,null,null,null,null,null,null,null,null,null,null,null,null,null,null,null,null,null,null,null,"ORC","よみがな","ハンデ","基準点",null,"KRC","よみがな","ハンデ","基準点",null,"HRC","よみがな","ハンデ","基準点",null,"SBC","よみがな","ハンデ","基準点",null,"NRC","よみがな","ハンデ","基準点",null,"WRC","よみがな","ハンデ","基準点"]
[null,null,null,null,null,null,null,null,null,null,null,null,null,null,null,null,null,null,null,null,null,null,null,null,null,null,null,null,null,null,"乾　伸綱","いぬい　のぶつな",null,{"$f":"IF(AE28=\"\",\"\",IF(AG28=\"△\",140,180))","v":180},null,"阿部　和大","あべ　かずひろ",null,{"$f":"IF(AJ28=\"\",\"\",IF(AL28=\"△\",140,180))","v":180},null,"牛尾　貴之","うしお　たかゆき",null,{"$f":"IF(AO28=\"\",\"\",IF(AQ28=\"△\",140,180))","v":180},null,"秋田　倫央","あきた　みちお",null,{"$f":"IF(AT28=\"\",\"\",IF(AV28=\"△\",140,180))","v":180},null,"岩本　剛","いわもと　つよし",null,{"$f":"IF(AY28=\"\",\"\",IF(BA28=\"△\",140,180))","v":180},null,"阿河　直人","あが　なおと",null,{"$f":"IF(BD28=\"\",\"\",IF(BF28=\"△\",140,180))","v":180}]
["◆","変更点",null,null,null,null,null,null,null,null,null,null,null,null,null,null,null,null,null,null,null,null,null,null,null,null,null,null,null,null,"上栄　忍","かみえ　しのぶ","△",140,null,"石川　政広","いしかわ　まさひろ",null,180,null,"大島　知幸","おおしま　ともゆき",null,180,null,"井上　友紀","いのうえ　ゆき","△",140,null,"植田　慎也","うえだ　しんや",null,180,null,"芝先　泰生","しばさき　やすお",null,180]
[null,"※会場をプルダウンメニュー選択でき、地域が表示されます。（「Home」先頭、「End」末尾）",null,null,null,null,null,null,null,null,null,null,null,null,null,null,null,null,null,null,null,null,null,null,null,null,null,null,null,null,"河本　一典","かわもと　かずのり",null,180,null,"伊藤　修平","いとう　しゅうへい",null,180,null,"河内　恵里","かわち　えり","△",140,null,"大橋　義治","おおはし よしはる",null,180,null,"金澤　茂昌","かなざわ　しげまさ",null,180,null,"末岡　修","すえおか　おさむ",null,180]
[null,"※チーム名を選択後、選手名はチーム毎に切り替わり、プルダウンメニュー選択でき「よみがな」が表示されます。",null,null,null,null,null,null,null,null,null,null,null,null,null,null,null,null,null,null,null,null,null,null,null,null,null,null,null,null,"北村　勇気","きたむら　ゆうき",null,180,null,"伊庭　保久","いば　やすひさ",null,180,null,"菊川　博功","きくかわ ひろよし",null,180,null,"酒井　美紀","さかい　みき","△",140,null,"吉向　翔平","きっこう　しょうへい",null,180,null,"杉本　博章","すぎもと　ひろあき",null,180]
[null,"※出場選手欄にはチーム名・名前・点数が表示され、前回順位も選択できます。",null,null,null,null,null,null,null,null,null,null,null,null,null,null,null,null,null,null,null,null,null,null,null,null,null,null,null,null,"小森　雅昭　","こもり　まさあき",null,180,null,"今村　哲也","いまむら　てつや",null,180,null,"後藤　拓磨","ごとう　たくま",null,180,null,"藤田　元気","すどう　げんき",null,180,null,"近藤　拓馬","こんどう　たくま",null,180,null,"関　長一郎","せき　ちょういちろう",null,180]
[null,"※",null,"色の項目以外は選択および入力しないで下さい。",null,null,null,null,null,null,null,null,null,null,null,null,null,null,null,null,null,null,null,null,null,null,null,null,null,null,"中川　典久","なかがわ　のりひさ",null,180,null,"植田　幸司","うえだ こうじ",null,180,null,"白澤雄一郎","しらざわ ゆういちろう",null,180,null,"須藤　浩章","すどう　ひろあき",null,180,null,"斉藤　大輔","さいとう　だいすけ",null,180,null,"中本　雅大","なかもと　まさひろ",null,180]
[null,null,null,null,null,null,null,null,null,null,null,null,null,null,null,null,null,null,null,null,null,null,null,null,null,null,null,null,null,null,"野村　宗司","のむら　そうじ",null,180,null,"折戸　和幸","おりと　かずゆき",null,180,null,"鈴木　勇介","すずき　ゆうすけ",null,180,null,"高島　太一","たかしま　たいち",null,180,null,"斉藤　裕児","さいとう　ゆうじ",null,180,null,"松房ゆかり","まつふさ　ゆかり","△",140]
[null,"※【進行】結果入力表：敗者側のスコアを入力すると相手側に”ｗ”が自動表示されます。",null,null,null,null,null,null,null,null,null,null,null,null,null,null,null,null,null,null,null,null,null,null,null,null,null,null,null,null,"松居　勝巳","まつい　かつみ",null,180,null,"加藤　秀万","かとう　しゅうまん",null,180,null,"高山　普任","たかやま ゆきひで",null,180,null,"長田　智紀","ながた　とものり",null,180,null,"白戸　玲人","しらと　れいにん",null,180,null,"森田　憲","もりた　けん",null,180]
[null,"　　入力行を間違えた場合は「Ctrl＋ｑ」でその行がクリア（HR、スコア）されます。",null,null,null,null,null,null,null,null,null,null,null,null,null,null,null,null,null,null,null,null,null,null,null,null,null,null,null,null,"村上　泰辰","むらかみ　やすよし",null,180,null,"金沢　亘","かなざわ　わたる",null,180,null,"土井本紀彦","どいもと　のりひこ",null,180,null,"西峰　久祐","にしみね　ひさのり",null,180,null,"谷野　晋平","たにの　しんぺい",null,180,null,"脇　真一郎","わき　しんいちろう",null,180]
[null,"※【結果】リーグ成績表：表が見難いので、TPのハンデ点の書式を「縮小表示を解除」にしました。（他の計算は変更してません。）",null,null,null,null,null,null,null,null,null,null,null,null,null,null,null,null,null,null,null,null,null,null,null,null,null,null,null,null,"森山　博紀","もりやま　ひろき",null,180,null,"上倉　淑敬","かみくら　きよゆき",null,180,null,"堂園　雅也","どうぞの まさや",null,180,null,"山本小百合","やまもと　さゆり","△",140,null,"長谷川　進","はせがわ　すすむ",null,180,null,"和田宗一郎","わだ　そういちろう",null,180]
[null,"※【結果】総合結果表：MVP、VP、HRを自動表示、\"\"W数＋TP\"\"が同率の場合は手入力でお願いします。",null,null,null,null,null,null,null,null,null,null,null,null,null,null,null,null,null,null,null,null,null,null,null,null,null,null,null,null,"安田　純華","やすだ　すみか","△",140,null,"川田　準樹","かわた　じゅんき",null,180,null,"栃下　恭子","とちした　きょうこ","△",140,null,"山本　淳","やまもと　じゅん",null,180,null,"林　隆行","はやし　たかゆき",null,180,null,null,null,null,""]
[null,"　　HRも同点なら手入力でお願いします。（HRが出なかった場合は空白とします。）",null,null,null,null,null,null,null,null,null,null,null,null,null,null,null,null,null,null,null,null,null,null,null,null,null,null,null,null,"山岡　修二","やまおか　しゅうじ",null,180,null,"菊池　靖正","きくち　やすまさ",null,180,null,"長井　充","ながい みつる",null,180,null,null,null,null,"",null,"水田　賢宏","みずた　よしひろ",null,180,null,null,null,null,""]
[null,"※８人用の項目を７人用に変更しました。",null,null,null,null,null,null,null,null,null,null,null,null,null,null,null,null,null,null,null,null,null,null,null,null,null,null,null,null,"山崎真紀子","やまざき　まきこ","△",140,null,"小堀泰次郎","こぼり　たいじろう",null,180,null,"中平　美輪","なかひら　みわ","△",140,null,null,null,null,"",null,"宮野　早織","みやの　さおり","△",140,null,null,null,null,""]
[null,"※その他、微修正しました。",null,null,null,null,null,null,null,null,null,null,null,null,null,null,null,null,null,null,null,null,null,null,null,null,null,null,null,null,"吉岡　保俊","よしおか　やすとし",null,180,null,"小山　久博","こやま　ひさひろ",null,180,null,"平井　洸志","ひらい こうし",null,180,null,null,null,null,"",null,"山田　晋之","やまだ　くにゆき",null,180,null,null,null,null,""]
[null,null,null,null,null,null,null,null,null,null,null,null,null,null,null,null,null,null,null,null,null,null,null,null,null,null,null,null,null,null,"渡邊　孝行","わたなべ　たかゆき",null,180,null,"佐藤　雄吾","さとう　ゆうご",null,180,null,"南　眞任","みなみ　まさひと",null,180,null,null,null,null,"",null,"山田　晃司","やまだ　こうじ",null,180,null,null,null,null,""]
["◆","シートの保護",null,null,null,null,null,null,null,null,null,null,null,null,null,null,null,null,null,null,null,null,null,null,null,null,null,null,null,null,"樹本　武士","きもと　たけし",null,180,null,"高田　裕司","たかだ　ゆうじ",null,180,null,"高木　俊行","たかぎ　としゆき",null,180,null,null,null,null,"",null,"鷲尾　隆杜","わしお　りゅうと",null,180,null,null,null,null,""]
[null,"保護を解除したい時は　リボン＞校閲＞変更の　シートの解除（現在全解除しております。保護にするとマクロ実行時エラーに成るため。）　",null,null,null,null,null,null,null,null,null,null,null,null,null,null,null,null,null,null,null,null,null,null,null,null,null,null,null,null,null,null,null,"",null,"田中　正","たなか ただし",null,180,null,"丹羽　俊也","にわ　としや",null,180,null,null,null,null,"",null,null,null,null,"",null,null,null,null,""]
[null,null,null,null,null,null,null,null,null,null,null,null,null,null,null,null,null,null,null,null,null,null,null,null,null,null,null,null,null,null,null,null,null,"",null,"早川　疏","はやかわ とおる",null,180,null,"藤中健太郎","ふじなか　けんたろう",null,180,null,null,null,null,"",null,null,null,null,"",null,null,null,null,""]
["◆","緑色の小さな▲が出る場合",null,null,null,null,null,null,null,null,null,null,null,null,null,null,null,null,null,null,null,null,null,null,null,null,null,null,null,null,null,null,null,"",null,"平田　正司","ひらた　しょうじ",null,180,null,null,null,null,"",null,null,null,null,"",null,null,null,null,"",null,null,null,null,""]
[null,"excelのオプション＞数式＞エラーチェック＞バックグラウンドでエラーチェックを行う　チェック外す",null,null,null,null,null,null,null,null,null,null,null,null,null,null,null,null,null,null,null,null,null,null,null,null,null,null,null,null,null,null,null,"",null,"藤本　悟史","ふじもと さとし",null,180,null,null,null,null,"",null,null,null,null,"",null,null,null,null,"",null,null,null,null,""]
[null,null,null,null,null,null,null,null,null,null,null,null,null,null,null,null,null,null,null,null,null,null,null,null,null,null,null,null,null,null,null,null,null,"",null,"松好　太一","まつよし　たいち",null,180,null,null,null,null,"",null,null,null,null,"",null,null,null,null,"",null,null,null,null,""]
["◆","マクロを使用しています。マクロを有効にして下さい。",null,null,null,null,null,null,null,null,null,null,null,null,null,null,null,null,null,null,null,null,null,null,null,null,null,null,null,null,null,null,null,"",null,"三木　敏裕","みき　としひろ",null,180,null,null,null,null,"",null,null,null,null,"",null,null,null,null,"",null,null,null,null,""]
[null,"毎回マクロを有効にするのが手間ならば（このファイルがある場所がディスクトップの場合）",null,null,null,null,null,null,null,null,null,null,null,null,null,null,null,null,null,null,null,null,null,null,null,null,null,null,null,null,null,null,null,"",null,"森田由佳里","もりた ゆかり","△",140,null,null,null,null,"",null,null,null,null,"",null,null,null,null,"",null,null,null,null,""]
[null,"excelのオプション＞セキュリティセンター＞セキュリティセンターの設定＞信頼できる場所＞新しい場所の追加＞参照＞ディスクトップ　OK＞OK",null,null,null,null,null,null,null,null,null,null,null,null,null,null,null,null,null,null,null,null,null,null,null,null,null,null,null,null,null,null,null,"",null,"山下　直生","やました　なおき",null,180,null,null,null,null,"",null,null,null,null,"",null,null,null,null,"",null,null,null,null,""]
[null,null,null,null,null,null,null,null,null,null,null,null,null,null,null,null,null,null,null,null,null,null,null,null,null,null,null,null,null,null,null,null,null,"",null,"若松　雄造","わかまつ ゆうぞう",null,180,null,null,null,null,"",null,null,null,null,"",null,null,null,null,"",null,null,null,null,""]
["◆","【準備】対戦カード",null,null,null,null,null,null,null,null,null,null,null,null,null,null,null,null,null,null,null,null,null,null,null,null,null,null,null,null,null,null,null,"",null,"渡辺　満","わたなべ　みつる",null,180,null,null,null,null,"",null,null,null,null,"",null,null,null,null,"",null,null,null,null,""]
[null,"対戦カードシートで対戦カードを印刷してください。",null,null,null,null,null,null,null,null,null,null,null,null,null,null,null,null,null,null,null,null,null,null,null,null,null,null,null,null,null,null,null,"",null,null,null,null,"",null,null,null,null,"",null,null,null,null,"",null,null,null,null,"",null,null,null,null,""]
[null,"A6またはハガキサイズで印刷されます。（Excel2007以降に対応）",null,null,null,null,null,null,null,null,null,null,null,null,null,null,null,null,null,null,null,null,null,null,null,null,null,null,null,null,null,null,null,"",null,null,null,null,"",null,null,null,null,"",null,null,null,null,"",null,null,null,null,"",null,null,null,null,""]
[null,null,null,null,null,null,null,null,null,null,null,null,null,null,null,null,null,null,null,null,null,null,null,null,null,null,null,null,null,null,null,null,null,"",null,null,null,null,"",null,null,null,null,"",null,null,null,null,"",null,null,null,null,"",null,null,null,null,""]
["◆","右記の各選手名をよみがな順に並べ替えるには",null,null,null,null,null,null,null,null,null,null,null,null,null,null,null,null,null,null,null,null,null,null,null,null,null,null,null,null,null,null,null,"",null,null,null,null,"",null,null,null,null,"",null,null,null,null,"",null,null,null,null,"",null,null,null,null,""]
[null,"並び替え：ボタンで全チームリストがよみがな順に並べ替えされます。"]

{"sheet":"【準備】対戦カード","index":1,"n_rows":100,"n_cols":61,"rows_kept":100,"cut":false,"hidden":false,"merged":[]}
[null,null,null,null,null,null,null,null,null," ",{"$f":"【結果】個人成績表!$A$1","v":"第8回　阪神奈対抗戦　　　(奈良：キングスポット)"}]
[]
[null,"印刷範囲の設定",null,null,null,null,null,null,null,null,"G-No",null,null,null,"T-No"]
[]
[null,null,null,null,null,null,null,null,null,null,null,null,null,"所属"]
[null,null,null,null,null,null,null,null,null,null,null,null,null,"氏名"]
[null,null,null,null,null,null,null,null,null,null,null,null,null,"得点"]
[null,null,null,null,null,null,null,null,null,null,null,null,null,"HR"]
[]
[null,null,null,null,null,null,null,null,null,null,null,null,null,null,"レフリー"]
[null,{"$f":"【結果】個人成績表!$A$1","v":"第8回　阪神奈対抗戦　　　(奈良：キングスポット)"},null,null,null,null,null,null,null,null,{"$f":"【結果】個人成績表!$A$1","v":"第8回　阪神奈対抗戦　　　(奈良：キングスポット)"},null,null,null,null,null,null,null,null,{"$f":"【結果】個人成績表!$A$1","v":"第8回　阪神奈対抗戦　　　(奈良：キングスポット)"},null,null,null,null,null,null,null,null,{"$f":"【結果】個人成績表!$A$1","v":"第8回　阪神奈対抗戦　　　(奈良：キングスポット)"},null,null,null,null,null,null,null,null,{"$f":"【結果】個人成績表!$A$1","v":"第8回　阪神奈対抗戦　　　(奈良：キングスポット)"},null,null,null,null,null,null,null,null,{"$f":"【結果】個人成績表!$A$1","v":"第8回　阪神奈対抗戦　　　(奈良：キングスポット)"},null,null,null,null,null,null,null,null,{"$f":"【結果】個人成績表!$A$1","v":"第8回　阪神奈対抗戦　　　(奈良：キングスポット)"}]
[]
[null,"G-No",{"$f":"【進行】結果入力表!B7","v":1},null,null,"T-No",null,null,null,null,"G-No",{"$f":"【進行】結果入力表!B8","v":2},null,null,"T-No",null,null,null,null,"G-No",{"$f":"【進行】結果入力表!B9","v":3},null,null,"T-No",null,null,null,null,"G-No",{"$f":"【進行】結果入力表!B10","v":4},null,null,"T-No",null,null,null,null,"G-No",{"$f":"【進行】結果入力表!B11","v":5},null,null,"T-No",null,null,null,null,"G-No",{"$f":"【進行】結果入力表!B12","v":6},null,null,"T-No",null,null,null,null,"G-No",{"$f":"【進行】結果入力表!B13","v":7},null,null,"T-No"]
[]
[null,{"$f":"VLOOKUP(C13,【進行】結果入力表!$B$7:$J$69,2,FALSE)","v":"HRC"},null,null,"所属",{"$f":"VLOOKUP(C13,【進行】結果入力表!$B$7:$J$69,9,FALSE)","v":"ORC"},null,null,null,null,{"$f":"VLOOKUP(L13,【進行】結果入力表!$B$7:$J$69,2,FALSE)","v":"HRC"},null,null,"所属",{"$f":"VLOOKUP(L13,【進行】結果入力表!$B$7:$J$69,9,FALSE)","v":"ORC"},null,null,null,null,{"$f":"VLOOKUP(U13,【進行】結果入力表!$B$7:$J$69,2,FALSE)","v":"HRC"},null,null,"所属",{"$f":"VLOOKUP(U13,【進行】結果入力表!$B$7:$J$69,9,FALSE)","v":"ORC"},null,null,null,null,{"$f":"VLOOKUP(AD13,【進行】結果入力表!$B$7:$J$69,2,FALSE)","v":"HRC"},null,null,"所属",{"$f":"VLOOKUP(AD13,【進行】結果入力表!$B$7:$J$69,9,FALSE)","v":"ORC"},null,null,null,null,{"$f":"VLOOKUP(AM13,【進行】結果入力表!$B$7:$J$69,2,FALSE)","v":"HRC"},null,null,"所属",{"$f":"VLOOKUP(AM13,【進行】結果入力表!$B$7:$J$69,9,FALSE)","v":"ORC"},null,null,null,null,{"$f":"VLOOKUP(AV13,【進行】結果入力表!$B$7:$J$69,2,FALSE)","v":"HRC"},null,null,"所属",{"$f":"VLOOKUP(AV13,【進行】結果入力表!$B$7:$J$69,9,FALSE)","v":"ORC"},null,null,null,null,{"$f":"VLOOKUP(BE13,【進行】結果入力表!$B$7:$J$69,2,FALSE)","v":"HRC"},null,null,"所属",{"$f":"VLOOKUP(BE13,【進行】結果入力表!$B$7:$J$69,9,FALSE)","v":"ORC"}]
[null,{"$f":"VLOOKUP(C13,【進行】結果入力表!$B$7:$J$69,3,FALSE)","v":"高木　俊行"},null,null,"氏名",{"$f":"VLOOKUP(C13,【進行】結果入力表!$B$7:$J$69,8,FALSE)","v":"樹本　武士"},null,null,null,null,{"$f":"VLOOKUP(L13,【進行】結果入力表!$B$7:$J$69,3,FALSE)","v":"堂園　雅也"},null,null,"氏名",{"$f":"VLOOKUP(L13,【進行】結果入力表!$B$7:$J$69,8,FALSE)","v":"乾　伸綱"},null,null,null,null,{"$f":"VLOOKUP(U13,【進行】結果入力表!$B$7:$J$69,3,FALSE)","v":"菊川　博功"},null,null,"氏名",{"$f":"VLOOKUP(U13,【進行】結果入力表!$B$7:$J$69,8,FALSE)","v":"村上　泰辰"},null,null,null,null,{"$f":"VLOOKUP(AD13,【進行】結果入力表!$B$7:$J$69,3,FALSE)","v":"丹羽　俊也"},null,null,"氏名",{"$f":"VLOOKUP(AD13,【進行】結果入力表!$B$7:$J$69,8,FALSE)","v":"山岡　修二"},null,null,null,null,{"$f":"VLOOKUP(AM13,【進行】結果入力表!$B$7:$J$69,3,FALSE)","v":"高山　普任"},null,null,"氏名",{"$f":"VLOOKUP(AM13,【進行】結果入力表!$B$7:$J$69,8,FALSE)","v":"吉岡　保俊"},null,null,null,null,{"$f":"VLOOKUP(AV13,【進行】結果入力表!$B$7:$J$69,3,FALSE)","v":"藤中健太郎"},null,null,"氏名",{"$f":"VLOOKUP(AV13,【進行】結果入力表!$B$7:$J$69,8,FALSE)","v":"渡邊　孝行"},null,null,null,null,{"$f":"VLOOKUP(BE13,【進行】結果入力表!$B$7:$J$69,3,FALSE)","v":"中平　美輪"},null,null,"氏名",{"$f":"VLOOKUP(BE13,【進行】結果入力表!$B$7:$J$69,8,FALSE)","v":"山崎真紀子"}]
[null,null,null,null,"得点",null,null,null,null,null,null,null,null,"得点",null,null,null,null,null,null,null,null,"得点",null,null,null,null,null,null,null,null,"得点",null,null,null,null,null,null,null,null,"得点",null,null,null,null,null,null,null,null,"得点",null,null,null,null,null,null,null,null,"得点"]
[null,null,null,null,"HR",null,null,null,null,null,null,null,null,"HR",null,null,null,null,null,null,null,null,"HR",null,null,null,null,null,null,null,null,"HR",null,null,null,null,null,null,null,null,"HR",null,null,null,null,null,null,null,null,"HR",null,null,null,null,null,null,null,null,"HR"]
[]
[null,null,null,null,"レフリー：",{"$f":"VLOOKUP(C13,【進行】結果入力表!$B$7:$M$69,11,FALSE)","v":"NRC"},{"$f":"VLOOKUP(C13,【進行】結果入力表!$B$7:$M$69,12,FALSE)","v":"吉向　翔平"},null,null,null,null,null,null,"レフリー：",{"$f":"VLOOKUP(L13,【進行】結果入力表!$B$7:$M$69,11,FALSE)","v":"NRC"},{"$f":"VLOOKUP(L13,【進行】結果入力表!$B$7:$M$69,12,FALSE)","v":"近藤　拓馬"},null,null,null,null,null,null,"レフリー：",{"$f":"VLOOKUP(U13,【進行】結果入力表!$B$7:$M$69,11,FALSE)","v":"NRC"},{"$f":"VLOOKUP(U13,【進行】結果入力表!$B$7:$M$69,12,FALSE)","v":"金澤　茂昌"},null,null,null,null,null,null,"レフリー：",{"$f":"VLOOKUP(AD13,【進行】結果入力表!$B$7:$M$69,11,FALSE)","v":"NRC"},{"$f":"VLOOKUP(AD13,【進行】結果入力表!$B$7:$M$69,12,FALSE)","v":"斉藤　裕児"},null,null,null,null,null,null,"レフリー：",{"$f":"VLOOKUP(AM13,【進行】結果入力表!$B$7:$M$69,11,FALSE)","v":"NRC"},{"$f":"VLOOKUP(AM13,【進行】結果入力表!$B$7:$M$69,12,FALSE)","v":"岩本　剛"},null,null,null,null,null,null,"レフリー：",{"$f":"VLOOKUP(AV13,【進行】結果入力表!$B$7:$M$69,11,FALSE)","v":"NRC"},{"$f":"VLOOKUP(AV13,【進行】結果入力表!$B$7:$M$69,12,FALSE)","v":"植田　慎也"},null,null,null,null,null,null,"レフリー：",{"$f":"VLOOKUP(BE13,【進行】結果入力表!$B$7:$M$69,11,FALSE)","v":"NRC"},{"$f":"VLOOKUP(BE13,【進行】結果入力表!$B$7:$M$69,12,FALSE)","v":"宮野　早織"}]
[null,{"$f":"【結果】個人成績表!$A$1","v":"第8回　阪神奈対抗戦　　　(奈良：キングスポット)"},null,null,null,null,null,null,null,null,{"$f":"【結果】個人成績表!$A$1","v":"第8回　阪神奈対抗戦　　　(奈良：キングスポット)"},null,null,null,null,null,null,null,null,{"$f":"【結果】個人成績表!$A$1","v":"第8回　阪神奈対抗戦　　　(奈良：キングスポット)"},null,null,null,null,null,null,null,null,{"$f":"【結果】個人成績表!$A$1","v":"第8回　阪神奈対抗戦　　　(奈良：キングスポット)"},null,null,null,null,null,null,null,null,{"$f":"【結果】個人成績表!$A$1","v":"第8回　阪神奈対抗戦　　　(奈良：キングスポット)"},null,null,null,null,null,null,null,null,{"$f":"【結果】個人成績表!$A$1","v":"第8回　阪神奈対抗戦　　　(奈良：キングスポット)"},null,null,null,null,null,null,null,null,{"$f":"【結果】個人成績表!$A$1","v":"第8回　阪神奈対抗戦　　　(奈良：キングスポット)"}]
[]
[null,"G-No",{"$f":"【進行】結果入力表!B14","v":8},null,null,"T-No",null,null,null,null,"G-No",{"$f":"【進行】結果入力表!B15","v":9},null,null,"T-No",null,null,null,null,"G-No",{"$f":"【進行】結果入力表!B16","v":10},null,null,"T-No",null,null,null,null,"G-No",{"$f":"【進行】結果入力表!B17","v":11},null,null,"T-No",null,null,null,null,"G-No",{"$f":"【進行】結果入力表!B18","v":12},null,null,"T-No",null,null,null,null,"G-No",{"$f":"【進行】結果入力表!B19","v":13},null,null,"T-No",null,null,null,null,"G-No",{"$f":"【進行】結果入力表!B20","v":14},null,null,"T-No"]
[]
[null,{"$f":"VLOOKUP(C23,【進行】結果入力表!$B$7:$J$69,2,FALSE)","v":"HRC"},null,null,"所属",{"$f":"VLOOKUP(C23,【進行】結果入力表!$B$7:$J$69,9,FALSE)","v":"NRC"},null,null,null,null,{"$f":"VLOOKUP(L23,【進行】結果入力表!$B$7:$J$69,2,FALSE)","v":"HRC"},null,null,"所属",{"$f":"VLOOKUP(L23,【進行】結果入力表!$B$7:$J$69,9,FALSE)","v":"NRC"},null,null,null,null,{"$f":"VLOOKUP(U23,【進行】結果入力表!$B$7:$J$69,2,FALSE)","v":"HRC"},null,null,"所属",{"$f":"VLOOKUP(U23,【進行】結果入力表!$B$7:$J$69,9,FALSE)","v":"NRC"},null,null,null,null,{"$f":"VLOOKUP(AD23,【進行】結果入力表!$B$7:$J$69,2,FALSE)","v":"HRC"},null,null,"所属",{"$f":"VLOOKUP(AD23,【進行】結果入力表!$B$7:$J$69,9,FALSE)","v":"NRC"},null,null,null,null,{"$f":"VLOOKUP(AM23,【進行】結果入力表!$B$7:$J$69,2,FALSE)","v":"HRC"},null,null,"所属",{"$f":"VLOOKUP(AM23,【進行】結果入力表!$B$7:$J$69,9,FALSE)","v":"NRC"},null,null,null,null,{"$f":"VLOOKUP(AV23,【進行】結果入力表!$B$7:$J$69,2,FALSE)","v":"HRC"},null,null,"所属",{"$f":"VLOOKUP(AV23,【進行】結果入力表!$B$7:$J$69,9,FALSE)","v":"NRC"},null,null,null,null,{"$f":"VLOOKUP(BE23,【進行】結果入力表!$B$7:$J$69,2,FALSE)","v":"HRC"},null,null,"所属",{"$f":"VLOOKUP(BE23,【進行】結果入力表!$B$7:$J$69,9,FALSE)","v":"NRC"}]
[null,{"$f":"VLOOKUP(C23,【進行】結果入力表!$B$7:$J$69,3,FALSE)","v":"高木　俊行"},null,null,"氏名",{"$f":"VLOOKUP(C23,【進行】結果入力表!$B$7:$J$69,8,FALSE)","v":"吉向　翔平"},null,null,null,null,{"$f":"VLOOKUP(L23,【進行】結果入力表!$B$7:$J$69,3,FALSE)","v":"堂園　雅也"},null,null,"氏名",{"$f":"VLOOKUP(L23,【進行】結果入力表!$B$7:$J$69,8,FALSE)","v":"近藤　拓馬"},null,null,null,null,{"$f":"VLOOKUP(U23,【進行】結果入力表!$B$7:$J$69,3,FALSE)","v":"菊川　博功"},null,null,"氏名",{"$f":"VLOOKUP(U23,【進行】結果入力表!$B$7:$J$69,8,FALSE)","v":"金澤　茂昌"},null,null,null,null,{"$f":"VLOOKUP(AD23,【進行】結果入力表!$B$7:$J$69,3,FALSE)","v":"丹羽　俊也"},null,null,"氏名",{"$f":"VLOOKUP(AD23,【進行】結果入力表!$B$7:$J$69,8,FALSE)","v":"斉藤　裕児"},null,null,null,null,{"$f":"VLOOKUP(AM23,【進行】結果入力表!$B$7:$J$69,3,FALSE)","v":"高山　普任"},null,null,"氏名",{"$f":"VLOOKUP(AM23,【進行】結果入力表!$B$7:$J$69,8,FALSE)","v":"岩本　剛"},null,null,null,null,{"$f":"VLOOKUP(AV23,【進行】結果入力表!$B$7:$J$69,3,FALSE)","v":"藤中健太郎"},null,null,"氏名",{"$f":"VLOOKUP(AV23,【進行】結果入力表!$B$7:$J$69,8,FALSE)","v":"植田　慎也"},null,null,null,null,{"$f":"VLOOKUP(BE23,【進行】結果入力表!$B$7:$J$69,3,FALSE)","v":"中平　美輪"},null,null,"氏名",{"$f":"VLOOKUP(BE23,【進行】結果入力表!$B$7:$J$69,8,FALSE)","v":"宮野　早織"}]
[null,null,null,null,"得点",null,null,null,null,null,null,null,null,"得点",null,null,null,null,null,null,null,null,"得点",null,null,null,null,null,null,null,null,"得点",null,null,null,null,null,null,null,null,"得点",null,null,null,null,null,null,null,null,"得点",null,null,null,null,null,null,null,null,"得点"]
[null,null,null,null,"HR",null,null,null,null,null,null,null,null,"HR",null,null,null,null,null,null,null,null,"HR",null,null,null,null,null,null,null,null,"HR",null,null,null,null,null,null,null,null,"HR",null,null,null,null,null,null,null,null,"HR",null,null,null,null,null,null,null,null,"HR"]
[]
[null,null,null,null,"レフリー：",{"$f":"VLOOKUP(C23,【進行】結果入力表!$B$7:$M$69,11,FALSE)","v":"ORC"},{"$f":"VLOOKUP(C23,【進行】結果入力表!$B$7:$M$69,12,FALSE)","v":"樹本　武士"},null,null,null,null,null,null,"レフリー：",{"$f":"VLOOKUP(L23,【進行】結果入力表!$B$7:$M$69,11,FALSE)","v":"ORC"},{"$f":"VLOOKUP(L23,【進行】結果入力表!$B$7:$M$69,12,FALSE)","v":"乾　伸綱"},null,null,null,null,null,null,"レフリー：",{"$f":"VLOOKUP(U23,【進行】結果入力表!$B$7:$M$69,11,FALSE)","v":"ORC"},{"$f":"VLOOKUP(U23,【進行】結果入力表!$B$7:$M$69,12,FALSE)","v":"村上　泰辰"},null,null,null,null,null,null,"レフリー：",{"$f":"VLOOKUP(AD23,【進行】結果入力表!$B$7:$M$69,11,FALSE)","v":"ORC"},{"$f":"VLOOKUP(AD23,【進行】結果入力表!$B$7:$M$69,12,FALSE)","v":"山岡　修二"},null,null,null,null,null,null,"レフリー：",{"$f":"VLOOKUP(AM23,【進行】結果入力表!$B$7:$M$69,11,FALSE)","v":"ORC"},{"$f":"VLOOKUP(AM23,【進行】結果入力表!$B$7:$M$69,12,FALSE)","v":"吉岡　保俊"},null,null,null,null,null,null,"レフリー：",{"$f":"VLOOKUP(AV23,【進行】結果入力表!$B$7:$M$69,11,FALSE)","v":"ORC"},{"$f":"VLOOKUP(AV23,【進行】結果入力表!$B$7:$M$69,12,FALSE)","v":"渡邊　孝行"},null,null,null,null,null,null,"レフリー：",{"$f":"VLOOKUP(BE23,【進行】結果入力表!$B$7:$M$69,11,FALSE)","v":"ORC"},{"$f":"VLOOKUP(BE23,【進行】結果入力表!$B$7:$M$69,12,FALSE)","v":"山崎真紀子"}]
[null,{"$f":"【結果】個人成績表!$A$1","v":"第8回　阪神奈対抗戦　　　(奈良：キングスポット)"},null,null,null,null,null,null,null,null,{"$f":"【結果】個人成績表!$A$1","v":"第8回　阪神奈対抗戦　　　(奈良：キングスポット)"},null,null,null,null,null,null,null,null,{"$f":"【結果】個人成績表!$A$1","v":"第8回　阪神奈対抗戦　　　(奈良：キングスポット)"},null,null,null,null,null,null,null,null,{"$f":"【結果】個人成績表!$A$1","v":"第8回　阪神奈対抗戦　　　(奈良：キングスポット)"},null,null,null,null,null,null,null,null,{"$f":"【結果】個人成績表!$A$1","v":"第8回　阪神奈対抗戦　　　(奈良：キングスポット)"},null,null,null,null,null,null,null,null,{"$f":"【結果】個人成績表!$A$1","v":"第8回　阪神奈対抗戦　　　(奈良：キングスポット)"},null,null,null,null,null,null,null,null,{"$f":"【結果】個人成績表!$A$1","v":"第8回　阪神奈対抗戦　　　(奈良：キングスポット)"}]
[]
[null,"G-No",{"$f":"【進行】結果入力表!B21","v":15},null,null,"T-No",null,null,null,null,"G-No",{"$f":"【進行】結果入力表!B22","v":16},null,null,"T-No",null,null,null,null,"G-No",{"$f":"【進行】結果入力表!B23","v":17},null,null,"T-No",null,null,null,null,"G-No",{"$f":"【進行】結果入力表!B24","v":18},null,null,"T-No",null,null,null,null,"G-No",{"$f":"【進行】結果入力表!B25","v":19},null,null,"T-No",null,null,null,null,"G-No",{"$f":"【進行】結果入力表!B26","v":20},null,null,"T-No",null,null,null,null,"G-No",{"$f":"【進行】結果入力表!B27","v":21},null,null,"T-No"]
[]
[null,{"$f":"VLOOKUP(C33,【進行】結果入力表!$B$7:$J$69,2,FALSE)","v":"NRC"},null,null,"所属",{"$f":"VLOOKUP(C33,【進行】結果入力表!$B$7:$J$69,9,FALSE)","v":"ORC"},null,null,null,null,{"$f":"VLOOKUP(L33,【進行】結果入力表!$B$7:$J$69,2,FALSE)","v":"NRC"},null,null,"所属",{"$f":"VLOOKUP(L33,【進行】結果入力表!$B$7:$J$69,9,FALSE)","v":"ORC"},null,null,null,null,{"$f":"VLOOKUP(U33,【進行】結果入力表!$B$7:$J$69,2,FALSE)","v":"NRC"},null,null,"所属",{"$f":"VLOOKUP(U33,【進行】結果入力表!$B$7:$J$69,9,FALSE)","v":"ORC"},null,null,null,null,{"$f":"VLOOKUP(AD33,【進行】結果入力表!$B$7:$J$69,2,FALSE)","v":"NRC"},null,null,"所属",{"$f":"VLOOKUP(AD33,【進行】結果入力表!$B$7:$J$69,9,FALSE)","v":"ORC"},null,null,null,null,{"$f":"VLOOKUP(AM33,【進行】結果入力表!$B$7:$J$69,2,FALSE)","v":"NRC"},null,null,"所属",{"$f":"VLOOKUP(AM33,【進行】結果入力表!$B$7:$J$69,9,FALSE)","v":"ORC"},null,null,null,null,{"$f":"VLOOKUP(AV33,【進行】結果入力表!$B$7:$J$69,2,FALSE)","v":"NRC"},null,null,"所属",{"$f":"VLOOKUP(AV33,【進行】結果入力表!$B$7:$J$69,9,FALSE)","v":"ORC"},null,null,null,null,{"$f":"VLOOKUP(BE33,【進行】結果入力表!$B$7:$J$69,2,FALSE)","v":"NRC"},null,null,"所属",{"$f":"VLOOKUP(BE33,【進行】結果入力表!$B$7:$J$69,9,FALSE)","v":"ORC"}]
[null,{"$f":"VLOOKUP(C33,【進行】結果入力表!$B$7:$J$69,3,FALSE)","v":"吉向　翔平"},null,null,"氏名",{"$f":"VLOOKUP(C33,【進行】結果入力表!$B$7:$J$69,8,FALSE)","v":"樹本　武士"},null,null,null,null,{"$f":"VLOOKUP(L33,【進行】結果入力表!$B$7:$J$69,3,FALSE)","v":"近藤　拓馬"},null,null,"氏名",{"$f":"VLOOKUP(L33,【進行】結果入力表!$B$7:$J$69,8,FALSE)","v":"乾　伸綱"},null,null,null,null,{"$f":"VLOOKUP(U33,【進行】結果入力表!$B$7:$J$69,3,FALSE)","v":"金澤　茂昌"},null,null,"氏名",{"$f":"VLOOKUP(U33,【進行】結果入力表!$B$7:$J$69,8,FALSE)","v":"村上　泰辰"},null,null,null,null,{"$f":"VLOOKUP(AD33,【進行】結果入力表!$B$7:$J$69,3,FALSE)","v":"斉藤　裕児"},null,null,"氏名",{"$f":"VLOOKUP(AD33,【進行】結果入力表!$B$7:$J$69,8,FALSE)","v":"山岡　修二"},null,null,null,null,{"$f":"VLOOKUP(AM33,【進行】結果入力表!$B$7:$J$69,3,FALSE)","v":"岩本　剛"},null,null,"氏名",{"$f":"VLOOKUP(AM33,【進行】結果入力表!$B$7:$J$69,8,FALSE)","v":"吉岡　保俊"},null,null,null,null,{"$f":"VLOOKUP(AV33,【進行】結果入力表!$B$7:$J$69,3,FALSE)","v":"植田　慎也"},null,null,"氏名",{"$f":"VLOOKUP(AV33,【進行】結果入力表!$B$7:$J$69,8,FALSE)","v":"渡邊　孝行"},null,null,null,null,{"$f":"VLOOKUP(BE33,【進行】結果入力表!$B$7:$J$69,3,FALSE)","v":"宮野　早織"},null,null,"氏名",{"$f":"VLOOKUP(BE33,【進行】結果入力表!$B$7:$J$69,8,FALSE)","v":"山崎真紀子"}]
[null,null,null,null,"得点",null,null,null,null,null,null,null,null,"得点",null,null,null,null,null,null,null,null,"得点",null,null,null,null,null,null,null,null,"得点",null,null,null,null,null,null,null,null,"得点",null,null,null,null,null,null,null,null,"得点",null,null,null,null,null,null,null,null,"得点"]
[null,null,null,null,"HR",null,null,null,null,null,null,null,null,"HR",null,null,null,null,null,null,null,null,"HR",null,null,null,null,null,null,null,null,"HR",null,null,null,null,null,null,null,null,"HR",null,null,null,null,null,null,null,null,"HR",null,null,null,null,null,null,null,null,"HR"]
[]
[null,null,null,null,"レフリー：",{"$f":"VLOOKUP(C33,【進行】結果入力表!$B$7:$M$69,11,FALSE)","v":"HRC"},{"$f":"VLOOKUP(C33,【進行】結果入力表!$B$7:$M$69,12,FALSE)","v":"高木　俊行"},null,null,null,null,null,null,"レフリー：",{"$f":"VLOOKUP(L33,【進行】結果入力表!$B$7:$M$69,11,FALSE)","v":"HRC"},{"$f":"VLOOKUP(L33,【進行】結果入力表!$B$7:$M$69,12,FALSE)","v":"堂園　雅也"},null,null,null,null,null,null,"レフリー：",{"$f":"VLOOKUP(U33,【進行】結果入力表!$B$7:$M$69,11,FALSE)","v":"HRC"},{"$f":"VLOOKUP(U33,【進行】結果入力表!$B$7:$M$69,12,FALSE)","v":"菊川　博功"},null,null,null,null,null,null,"レフリー：",{"$f":"VLOOKUP(AD33,【進行】結果入力表!$B$7:$M$69,11,FALSE)","v":"HRC"},{"$f":"VLOOKUP(AD33,【進行】結果入力表!$B$7:$M$69,12,FALSE)","v":"丹羽　俊也"},null,null,null,null,null,null,"レフリー：",{"$f":"VLOOKUP(AM33,【進行】結果入力表!$B$7:$M$69,11,FALSE)","v":"HRC"},{"$f":"VLOOKUP(AM33,【進行】結果入力表!$B$7:$M$69,12,FALSE)","v":"高山　普任"},null,null,null,null,null,null,"レフリー：",{"$f":"VLOOKUP(AV33,【進行】結果入力表!$B$7:$M$69,11,FALSE)","v":"HRC"},{"$f":"VLOOKUP(AV33,【進行】結果入力表!$B$7:$M$69,12,FALSE)","v":"藤中健太郎"},null,null,null,null,null,null,"レフリー：",{"$f":"VLOOKUP(BE33,【進行】結果入力表!$B$7:$M$69,11,FALSE)","v":"HRC"},{"$f":"VLOOKUP(BE33,【進行】結果入力表!$B$7:$M$69,12,FALSE)","v":"中平　美輪"}]
[null,{"$f":"【結果】個人成績表!$A$1","v":"第8回　阪神奈対抗戦　　　(奈良：キングスポット)"},null,null,null,null,null,null,null,null,{"$f":"【結果】個人成績表!$A$1","v":"第8回　阪神奈対抗戦　　　(奈良：キングスポット)"},null,null,null,null,null,null,null,null,{"$f":"【結果】個人成績表!$A$1","v":"第8回　阪神奈対抗戦　　　(奈良：キングスポット)"},null,null,null,null,null,null,null,null,{"$f":"【結果】個人成績表!$A$1","v":"第8回　阪神奈対抗戦　　　(奈良：キングスポット)"},null,null,null,null,null,null,null,null,{"$f":"【結果】個人成績表!$A$1","v":"第8回　阪神奈対抗戦　　　(奈良：キングスポット)"},null,null,null,null,null,null,null,null,{"$f":"【結果】個人成績表!$A$1","v":"第8回　阪神奈対抗戦　　　(奈良：キングスポット)"},null,null,null,null,null,null,null,null,{"$f":"【結果】個人成績表!$A$1","v":"第8回　阪神奈対抗戦　　　(奈良：キングスポット)"}]
[]
[null,"G-No",{"$f":"【進行】結果入力表!B28","v":22},null,null,"T-No",null,null,null,null,"G-No",{"$f":"【進行】結果入力表!B29","v":23},null,null,"T-No",null,null,null,null,"G-No",{"$f":"【進行】結果入力表!B30","v":24},null,null,"T-No",null,null,null,null,"G-No",{"$f":"【進行】結果入力表!B31","v":25},null,null,"T-No",null,null,null,null,"G-No",{"$f":"【進行】結果入力表!B32","v":26},null,null,"T-No",null,null,null,null,"G-No",{"$f":"【進行】結果入力表!B33","v":27},null,null,"T-No",null,null,null,null,"G-No",{"$f":"【進行】結果入力表!B34","v":28},null,null,"T-No"]
[]
[null,{"$f":"VLOOKUP(C43,【進行】結果入力表!$B$7:$J$69,2,FALSE)","v":"HRC"},null,null,"所属",{"$f":"VLOOKUP(C43,【進行】結果入力表!$B$7:$J$69,9,FALSE)","v":"ORC"},null,null,null,null,{"$f":"VLOOKUP(L43,【進行】結果入力表!$B$7:$J$69,2,FALSE)","v":"HRC"},null,null,"所属",{"$f":"VLOOKUP(L43,【進行】結果入力表!$B$7:$J$69,9,FALSE)","v":"ORC"},null,null,null,null,{"$f":"VLOOKUP(U43,【進行】結果入力表!$B$7:$J$69,2,FALSE)","v":"HRC"},null,null,"所属",{"$f":"VLOOKUP(U43,【進行】結果入力表!$B$7:$J$69,9,FALSE)","v":"ORC"},null,null,null,null,{"$f":"VLOOKUP(AD43,【進行】結果入力表!$B$7:$J$69,2,FALSE)","v":"HRC"},null,null,"所属",{"$f":"VLOOKUP(AD43,【進行】結果入力表!$B$7:$J$69,9,FALSE)","v":"ORC"},null,null,null,null,{"$f":"VLOOKUP(AM43,【進行】結果入力表!$B$7:$J$69,2,FALSE)","v":"HRC"},null,null,"所属",{"$f":"VLOOKUP(AM43,【進行】結果入力表!$B$7:$J$69,9,FALSE)","v":"ORC"},null,null,null,null,{"$f":"VLOOKUP(AV43,【進行】結果入力表!$B$7:$J$69,2,FALSE)","v":"HRC"},null,null,"所属",{"$f":"VLOOKUP(AV43,【進行】結果入力表!$B$7:$J$69,9,FALSE)","v":"ORC"},null,null,null,null,{"$f":"VLOOKUP(BE43,【進行】結果入力表!$B$7:$J$69,2,FALSE)","v":"HRC"},null,null,"所属",{"$f":"VLOOKUP(BE43,【進行】結果入力表!$B$7:$J$69,9,FALSE)","v":"ORC"}]
[null,{"$f":"VLOOKUP(C43,【進行】結果入力表!$B$7:$J$69,3,FALSE)","v":"藤中健太郎"},null,null,"氏名",{"$f":"VLOOKUP(C43,【進行】結果入力表!$B$7:$J$69,8,FALSE)","v":"樹本　武士"},null,null,null,null,{"$f":"VLOOKUP(L43,【進行】結果入力表!$B$7:$J$69,3,FALSE)","v":"中平　美輪"},null,null,"氏名",{"$f":"VLOOKUP(L43,【進行】結果入力表!$B$7:$J$69,8,FALSE)","v":"乾　伸綱"},null,null,null,null,{"$f":"VLOOKUP(U43,【進行】結果入力表!$B$7:$J$69,3,FALSE)","v":"高木　俊行"},null,null,"氏名",{"$f":"VLOOKUP(U43,【進行】結果入力表!$B$7:$J$69,8,FALSE)","v":"村上　泰辰"},null,null,null,null,{"$f":"VLOOKUP(AD43,【進行】結果入力表!$B$7:$J$69,3,FALSE)","v":"堂園　雅也"},null,null,"氏名",{"$f":"VLOOKUP(AD43,【進行】結果入力表!$B$7:$J$69,8,FALSE)","v":"山岡　修二"},null,null,null,null,{"$f":"VLOOKUP(AM43,【進行】結果入力表!$B$7:$J$69,3,FALSE)","v":"菊川　博功"},null,null,"氏名",{"$f":"VLOOKUP(AM43,【進行】結果入力表!$B$7:$J$69,8,FALSE)","v":"吉岡　保俊"},null,null,null,null,{"$f":"VLOOKUP(AV43,【進行】結果入力表!$B$7:$J$69,3,FALSE)","v":"丹羽　俊也"},null,null,"氏名",{"$f":"VLOOKUP(AV43,【進行】結果入力表!$B$7:$J$69,8,FALSE)","v":"渡邊　孝行"},null,null,null,null,{"$f":"VLOOKUP(BE43,【進行】結果入力表!$B$7:$J$69,3,FALSE)","v":"高山　普任"},null,null,"氏名",{"$f":"VLOOKUP(BE43,【進行】結果入力表!$B$7:$J$69,8,FALSE)","v":"山崎真紀子"}]
[null,null,null,null,"得点",null,null,null,null,null,null,null,null,"得点",null,null,null,null,null,null,null,null,"得点",null,null,null,null,null,null,null,null,"得点",null,null,null,null,null,null,null,null,"得点",null,null,null,null,null,null,null,null,"得点",null,null,null,null,null,null,null,null,"得点"]
[null,null,null,null,"HR",null,null,null,null,null,null,null,null,"HR",null,null,null,null,null,null,null,null,"HR",null,null,null,null,null,null,null,null,"HR",null,null,null,null,null,null,null,null,"HR",null,null,null,null,null,null,null,null,"HR",null,null,null,null,null,null,null,null,"HR"]
[]
[null,null,null,null,"レフリー：",{"$f":"VLOOKUP(C43,【進行】結果入力表!$B$7:$M$69,11,FALSE)","v":"NRC"},{"$f":"VLOOKUP(C43,【進行】結果入力表!$B$7:$M$69,12,FALSE)","v":"宮野　早織"},null,null,null,null,null,null,"レフリー：",{"$f":"VLOOKUP(L43,【進行】結果入力表!$B$7:$M$69,11,FALSE)","v":"NRC"},{"$f":"VLOOKUP(L43,【進行】結果入力表!$B$7:$M$69,12,FALSE)","v":"吉向　翔平"},null,null,null,null,null,null,"レフリー：",{"$f":"VLOOKUP(U43,【進行】結果入力表!$B$7:$M$69,11,FALSE)","v":"NRC"},{"$f":"VLOOKUP(U43,【進行】結果入力表!$B$7:$M$69,12,FALSE)","v":"近藤　拓馬"},null,null,null,null,null,null,"レフリー：",{"$f":"VLOOKUP(AD43,【進行】結果入力表!$B$7:$M$69,11,FALSE)","v":"NRC"},{"$f":"VLOOKUP(AD43,【進行】結果入力表!$B$7:$M$69,12,FALSE)","v":"金澤　茂昌"},null,null,null,null,null,null,"レフリー：",{"$f":"VLOOKUP(AM43,【進行】結果入力表!$B$7:$M$69,11,FALSE)","v":"NRC"},{"$f":"VLOOKUP(AM43,【進行】結果入力表!$B$7:$M$69,12,FALSE)","v":"斉藤　裕児"},null,null,null,null,null,null,"レフリー：",{"$f":"VLOOKUP(AV43,【進行】結果入力表!$B$7:$M$69,11,FALSE)","v":"NRC"},{"$f":"VLOOKUP(AV43,【進行】結果入力表!$B$7:$M$69,12,FALSE)","v":"岩本　剛"},null,null,null,null,null,null,"レフリー：",{"$f":"VLOOKUP(BE43,【進行】結果入力表!$B$7:$M$69,11,FALSE)","v":"NRC"},{"$f":"VLOOKUP(BE43,【進行】結果入力表!$B$7:$M$69,12,FALSE)","v":"植田　慎也"}]
[null,{"$f":"【結果】個人成績表!$A$1","v":"第8回　阪神奈対抗戦　　　(奈良：キングスポット)"},null,null,null,null,null,null,null,null,{"$f":"【結果】個人成績表!$A$1","v":"第8回　阪神奈対抗戦　　　(奈良：キングスポット)"},null,null,null,null,null,null,null,null,{"$f":"【結果】個人成績表!$A$1","v":"第8回　阪神奈対抗戦　　　(奈良：キングスポット)"},null,null,null,null,null,null,null,null,{"$f":"【結果】個人成績表!$A$1","v":"第8回　阪神奈対抗戦　　　(奈良：キングスポット)"},null,null,null,null,null,null,null,null,{"$f":"【結果】個人成績表!$A$1","v":"第8回　阪神奈対抗戦　　　(奈良：キングスポット)"},null,null,null,null,null,null,null,null,{"$f":"【結果】個人成績表!$A$1","v":"第8回　阪神奈対抗戦　　　(奈良：キングスポット)"},null,null,null,null,null,null,null,null,{"$f":"【結果】個人成績表!$A$1","v":"第8回　阪神奈対抗戦　　　(奈良：キングスポット)"}]
[]
[null,"G-No",{"$f":"【進行】結果入力表!B35","v":29},null,null,"T-No",null,null,null,null,"G-No",{"$f":"【進行】結果入力表!B36","v":30},null,null,"T-No",null,null,null,null,"G-No",{"$f":"【進行】結果入力表!B37","v":31},null,null,"T-No",null,null,null,null,"G-No",{"$f":"【進行】結果入力表!B38","v":32},null,null,"T-No",null,null,null,null,"G-No",{"$f":"【進行】結果入力表!B39","v":33},null,null,"T-No",null,null,null,null,"G-No",{"$f":"【進行】結果入力表!B40","v":34},null,null,"T-No",null,null,null,null,"G-No",{"$f":"【進行】結果入力表!B41","v":35},null,null,"T-No"]
[]
[null,{"$f":"VLOOKUP(C53,【進行】結果入力表!$B$7:$J$69,2,FALSE)","v":"HRC"},null,null,"所属",{"$f":"VLOOKUP(C53,【進行】結果入力表!$B$7:$J$69,9,FALSE)","v":"NRC"},null,null,null,null,{"$f":"VLOOKUP(L53,【進行】結果入力表!$B$7:$J$69,2,FALSE)","v":"HRC"},null,null,"所属",{"$f":"VLOOKUP(L53,【進行】結果入力表!$B$7:$J$69,9,FALSE)","v":"NRC"},null,null,null,null,{"$f":"VLOOKUP(U53,【進行】結果入力表!$B$7:$J$69,2,FALSE)","v":"HRC"},null,null,"所属",{"$f":"VLOOKUP(U53,【進行】結果入力表!$B$7:$J$69,9,FALSE)","v":"NRC"},null,null,null,null,{"$f":"VLOOKUP(AD53,【進行】結果入力表!$B$7:$J$69,2,FALSE)","v":"HRC"},null,null,"所属",{"$f":"VLOOKUP(AD53,【進行】結果入力表!$B$7:$J$69,9,FALSE)","v":"NRC"},null,null,null,null,{"$f":"VLOOKUP(AM53,【進行】結果入力表!$B$7:$J$69,2,FALSE)","v":"HRC"},null,null,"所属",{"$f":"VLOOKUP(AM53,【進行】結果入力表!$B$7:$J$69,9,FALSE)","v":"NRC"},null,null,null,null,{"$f":"VLOOKUP(AV53,【進行】結果入力表!$B$7:$J$69,2,FALSE)","v":"HRC"},null,null,"所属",{"$f":"VLOOKUP(AV53,【進行】結果入力表!$B$7:$J$69,9,FALSE)","v":"NRC"},null,null,null,null,{"$f":"VLOOKUP(BE53,【進行】結果入力表!$B$7:$J$69,2,FALSE)","v":"HRC"},null,null,"所属",{"$f":"VLOOKUP(BE53,【進行】結果入力表!$B$7:$J$69,9,FALSE)","v":"NRC"}]
[null,{"$f":"VLOOKUP(C53,【進行】結果入力表!$B$7:$J$69,3,FALSE)","v":"藤中健太郎"},null,null,"氏名",{"$f":"VLOOKUP(C53,【進行】結果入力表!$B$7:$J$69,8,FALSE)","v":"宮野　早織"},null,null,null,null,{"$f":"VLOOKUP(L53,【進行】結果入力表!$B$7:$J$69,3,FALSE)","v":"中平　美輪"},null,null,"氏名",{"$f":"VLOOKUP(L53,【進行】結果入力表!$B$7:$J$69,8,FALSE)","v":"吉向　翔平"},null,null,null,null,{"$f":"VLOOKUP(U53,【進行】結果入力表!$B$7:$J$69,3,FALSE)","v":"高木　俊行"},null,null,"氏名",{"$f":"VLOOKUP(U53,【進行】結果入力表!$B$7:$J$69,8,FALSE)","v":"近藤　拓馬"},null,null,null,null,{"$f":"VLOOKUP(AD53,【進行】結果入力表!$B$7:$J$69,3,FALSE)","v":"堂園　雅也"},null,null,"氏名",{"$f":"VLOOKUP(AD53,【進行】結果入力表!$B$7:$J$69,8,FALSE)","v":"金澤　茂昌"},null,null,null,null,{"$f":"VLOOKUP(AM53,【進行】結果入力表!$B$7:$J$69,3,FALSE)","v":"菊川　博功"},null,null,"氏名",{"$f":"VLOOKUP(AM53,【進行】結果入力表!$B$7:$J$69,8,FALSE)","v":"斉藤　裕児"},null,null,null,null,{"$f":"VLOOKUP(AV53,【進行】結果入力表!$B$7:$J$69,3,FALSE)","v":"丹羽　俊也"},null,null,"氏名",{"$f":"VLOOKUP(AV53,【進行】結果入力表!$B$7:$J$69,8,FALSE)","v":"岩本　剛"},null,null,null,null,{"$f":"VLOOKUP(BE53,【進行】結果入力表!$B$7:$J$69,3,FALSE)","v":"高山　普任"},null,null,"氏名",{"$f":"VLOOKUP(BE53,【進行】結果入力表!$B$7:$J$69,8,FALSE)","v":"植田　慎也"}]
[null,null,null,null,"得点",null,null,null,null,null,null,null,null,"得点",null,null,null,null,null,null,null,null,"得点",null,null,null,null,null,null,null,null,"得点",null,null,null,null,null,null,null,null,"得点",null,null,null,null,null,null,null,null,"得点",null,null,null,null,null,null,null,null,"得点"]
[null,null,null,null,"HR",null,null,null,null,null,null,null,null,"HR",null,null,null,null,null,null,null,null,"HR",null,null,null,null,null,null,null,null,"HR",null,null,null,null,null,null,null,null,"HR",null,null,null,null,null,null,null,null,"HR",null,null,null,null,null,null,null,null,"HR"]
[]
[null,null,null,null,"レフリー：",{"$f":"VLOOKUP(C53,【進行】結果入力表!$B$7:$M$69,11,FALSE)","v":"ORC"},{"$f":"VLOOKUP(C53,【進行】結果入力表!$B$7:$M$69,12,FALSE)","v":"樹本　武士"},null,null,null,null,null,null,"レフリー：",{"$f":"VLOOKUP(L53,【進行】結果入力表!$B$7:$M$69,11,FALSE)","v":"ORC"},{"$f":"VLOOKUP(L53,【進行】結果入力表!$B$7:$M$69,12,FALSE)","v":"乾　伸綱"},null,null,null,null,null,null,"レフリー：",{"$f":"VLOOKUP(U53,【進行】結果入力表!$B$7:$M$69,11,FALSE)","v":"ORC"},{"$f":"VLOOKUP(U53,【進行】結果入力表!$B$7:$M$69,12,FALSE)","v":"村上　泰辰"},null,null,null,null,null,null,"レフリー：",{"$f":"VLOOKUP(AD53,【進行】結果入力表!$B$7:$M$69,11,FALSE)","v":"ORC"},{"$f":"VLOOKUP(AD53,【進行】結果入力表!$B$7:$M$69,12,FALSE)","v":"山岡　修二"},null,null,null,null,null,null,"レフリー：",{"$f":"VLOOKUP(AM53,【進行】結果入力表!$B$7:$M$69,11,FALSE)","v":"ORC"},{"$f":"VLOOKUP(AM53,【進行】結果入力表!$B$7:$M$69,12,FALSE)","v":"吉岡　保俊"},null,null,null,null,null,null,"レフリー：",{"$f":"VLOOKUP(AV53,【進行】結果入力表!$B$7:$M$69,11,FALSE)","v":"ORC"},{"$f":"VLOOKUP(AV53,【進行】結果入力表!$B$7:$M$69,12,FALSE)","v":"渡邊　孝行"},null,null,null,null,null,null,"レフリー：",{"$f":"VLOOKUP(BE53,【進行】結果入力表!$B$7:$M$69,11,FALSE)","v":"ORC"},{"$f":"VLOOKUP(BE53,【進行】結果入力表!$B$7:$M$69,12,FALSE)","v":"山崎真紀子"}]
[null,{"$f":"【結果】個人成績表!$A$1","v":"第8回　阪神奈対抗戦　　　(奈良：キングスポット)"},null,null,null,null,null,null,null,null,{"$f":"【結果】個人成績表!$A$1","v":"第8回　阪神奈対抗戦　　　(奈良：キングスポット)"},null,null,null,null,null,null,null,null,{"$f":"【結果】個人成績表!$A$1","v":"第8回　阪神奈対抗戦　　　(奈良：キングスポット)"},null,null,null,null,null,null,null,null,{"$f":"【結果】個人成績表!$A$1","v":"第8回　阪神奈対抗戦　　　(奈良：キングスポット)"},null,null,null,null,null,null,null,null,{"$f":"【結果】個人成績表!$A$1","v":"第8回　阪神奈対抗戦　　　(奈良：キングスポット)"},null,null,null,null,null,null,null,null,{"$f":"【結果】個人成績表!$A$1","v":"第8回　阪神奈対抗戦　　　(奈良：キングスポット)"},null,null,null,null,null,null,null,null,{"$f":"【結果】個人成績表!$A$1","v":"第8回　阪神奈対抗戦　　　(奈良：キングスポット)"}]
[]
[null,"G-No",{"$f":"【進行】結果入力表!B42","v":36},null,null,"T-No",null,null,null,null,"G-No",{"$f":"【進行】結果入力表!B43","v":37},null,null,"T-No",null,null,null,null,"G-No",{"$f":"【進行】結果入力表!B44","v":38},null,null,"T-No",null,null,null,null,"G-No",{"$f":"【進行】結果入力表!B45","v":39},null,null,"T-No",null,null,null,null,"G-No",{"$f":"【進行】結果入力表!B46","v":40},null,null,"T-No",null,null,null,null,"G-No",{"$f":"【進行】結果入力表!B47","v":41},null,null,"T-No",null,null,null,null,"G-No",{"$f":"【進行】結果入力表!B48","v":42},null,null,"T-No"]
[]
[null,{"$f":"VLOOKUP(C63,【進行】結果入力表!$B$7:$J$69,2,FALSE)","v":"NRC"},null,null,"所属",{"$f":"VLOOKUP(C63,【進行】結果入力表!$B$7:$J$69,9,FALSE)","v":"ORC"},null,null,null,null,{"$f":"VLOOKUP(L63,【進行】結果入力表!$B$7:$J$69,2,FALSE)","v":"NRC"},null,null,"所属",{"$f":"VLOOKUP(L63,【進行】結果入力表!$B$7:$J$69,9,FALSE)","v":"ORC"},null,null,null,null,{"$f":"VLOOKUP(U63,【進行】結果入力表!$B$7:$J$69,2,FALSE)","v":"NRC"},null,null,"所属",{"$f":"VLOOKUP(U63,【進行】結果入力表!$B$7:$J$69,9,FALSE)","v":"ORC"},null,null,null,null,{"$f":"VLOOKUP(AD63,【進行】結果入力表!$B$7:$J$69,2,FALSE)","v":"NRC"},null,null,"所属",{"$f":"VLOOKUP(AD63,【進行】結果入力表!$B$7:$J$69,9,FALSE)","v":"ORC"},null,null,null,null,{"$f":"VLOOKUP(AM63,【進行】結果入力表!$B$7:$J$69,2,FALSE)","v":"NRC"},null,null,"所属",{"$f":"VLOOKUP(AM63,【進行】結果入力表!$B$7:$J$69,9,FALSE)","v":"ORC"},null,null,null,null,{"$f":"VLOOKUP(AV63,【進行】結果入力表!$B$7:$J$69,2,FALSE)","v":"NRC"},null,null,"所属",{"$f":"VLOOKUP(AV63,【進行】結果入力表!$B$7:$J$69,9,FALSE)","v":"ORC"},null,null,null,null,{"$f":"VLOOKUP(BE63,【進行】結果入力表!$B$7:$J$69,2,FALSE)","v":"NRC"},null,null,"所属",{"$f":"VLOOKUP(BE63,【進行】結果入力表!$B$7:$J$69,9,FALSE)","v":"ORC"}]
[null,{"$f":"VLOOKUP(C63,【進行】結果入力表!$B$7:$J$69,3,FALSE)","v":"宮野　早織"},null,null,"氏名",{"$f":"VLOOKUP(C63,【進行】結果入力表!$B$7:$J$69,8,FALSE)","v":"樹本　武士"},null,null,null,null,{"$f":"VLOOKUP(L63,【進行】結果入力表!$B$7:$J$69,3,FALSE)","v":"吉向　翔平"},null,null,"氏名",{"$f":"VLOOKUP(L63,【進行】結果入力表!$B$7:$J$69,8,FALSE)","v":"乾　伸綱"},null,null,null,null,{"$f":"VLOOKUP(U63,【進行】結果入力表!$B$7:$J$69,3,FALSE)","v":"近藤　拓馬"},null,null,"氏名",{"$f":"VLOOKUP(U63,【進行】結果入力表!$B$7:$J$69,8,FALSE)","v":"村上　泰辰"},null,null,null,null,{"$f":"VLOOKUP(AD63,【進行】結果入力表!$B$7:$J$69,3,FALSE)","v":"金澤　茂昌"},null,null,"氏名",{"$f":"VLOOKUP(AD63,【進行】結果入力表!$B$7:$J$69,8,FALSE)","v":"山岡　修二"},null,null,null,null,{"$f":"VLOOKUP(AM63,【進行】結果入力表!$B$7:$J$69,3,FALSE)","v":"斉藤　裕児"},null,null,"氏名",{"$f":"VLOOKUP(AM63,【進行】結果入力表!$B$7:$J$69,8,FALSE)","v":"吉岡　保俊"},null,null,null,null,{"$f":"VLOOKUP(AV63,【進行】結果入力表!$B$7:$J$69,3,FALSE)","v":"岩本　剛"},null,null,"氏名",{"$f":"VLOOKUP(AV63,【進行】結果入力表!$B$7:$J$69,8,FALSE)","v":"渡邊　孝行"},null,null,null,null,{"$f":"VLOOKUP(BE63,【進行】結果入力表!$B$7:$J$69,3,FALSE)","v":"植田　慎也"},null,null,"氏名",{"$f":"VLOOKUP(BE63,【進行】結果入力表!$B$7:$J$69,8,FALSE)","v":"山崎真紀子"}]
[null,null,null,null,"得点",null,null,null,null,null,null,null,null,"得点",null,null,null,null,null,null,null,null,"得点",null,null,null,null,null,null,null,null,"得点",null,null,null,null,null,null,null,null,"得点",null,null,null,null,null,null,null,null,"得点",null,null,null,null,null,null,null,null,"得点"]
[null,null,null,null,"HR",null,null,null,null,null,null,null,null,"HR",null,null,null,null,null,null,null,null,"HR",null,null,null,null,null,null,null,null,"HR",null,null,null,null,null,null,null,null,"HR",null,null,null,null,null,null,null,null,"HR",null,null,null,null,null,null,null,null,"HR"]
[]
[null,null,null,null,"レフリー：",{"$f":"VLOOKUP(C63,【進行】結果入力表!$B$7:$M$69,11,FALSE)","v":"HRC"},{"$f":"VLOOKUP(C63,【進行】結果入力表!$B$7:$M$69,12,FALSE)","v":"藤中健太郎"},null,null,null,null,null,null,"レフリー：",{"$f":"VLOOKUP(L63,【進行】結果入力表!$B$7:$M$69,11,FALSE)","v":"HRC"},{"$f":"VLOOKUP(L63,【進行】結果入力表!$B$7:$M$69,12,FALSE)","v":"中平　美輪"},null,null,null,null,null,null,"レフリー：",{"$f":"VLOOKUP(U63,【進行】結果入力表!$B$7:$M$69,11,FALSE)","v":"HRC"},{"$f":"VLOOKUP(U63,【進行】結果入力表!$B$7:$M$69,12,FALSE)","v":"高木　俊行"},null,null,null,null,null,null,"レフリー：",{"$f":"VLOOKUP(AD63,【進行】結果入力表!$B$7:$M$69,11,FALSE)","v":"HRC"},{"$f":"VLOOKUP(AD63,【進行】結果入力表!$B$7:$M$69,12,FALSE)","v":"堂園　雅也"},null,null,null,null,null,null,"レフリー：",{"$f":"VLOOKUP(AM63,【進行】結果入力表!$B$7:$M$69,11,FALSE)","v":"HRC"},{"$f":"VLOOKUP(AM63,【進行】結果入力表!$B$7:$M$69,12,FALSE)","v":"菊川　博功"},null,null,null,null,null,null,"レフリー：",{"$f":"VLOOKUP(AV63,【進行】結果入力表!$B$7:$M$69,11,FALSE)","v":"HRC"},{"$f":"VLOOKUP(AV63,【進行】結果入力表!$B$7:$M$69,12,FALSE)","v":"丹羽　俊也"},null,null,null,null,null,null,"レフリー：",{"$f":"VLOOKUP(BE63,【進行】結果入力表!$B$7:$M$69,11,FALSE)","v":"HRC"},{"$f":"VLOOKUP(BE63,【進行】結果入力表!$B$7:$M$69,12,FALSE)","v":"高山　普任"}]
[null,{"$f":"【結果】個人成績表!$A$1","v":"第8回　阪神奈対抗戦　　　(奈良：キングスポット)"},null,null,null,null,null,null,null,null,{"$f":"【結果】個人成績表!$A$1","v":"第8回　阪神奈対抗戦　　　(奈良：キングスポット)"},null,null,null,null,null,null,null,null,{"$f":"【結果】個人成績表!$A$1","v":"第8回　阪神奈対抗戦　　　(奈良：キングスポット)"},null,null,null,null,null,null,null,null,{"$f":"【結果】個人成績表!$A$1","v":"第8回　阪神奈対抗戦　　　(奈良：キングスポット)"},null,null,null,null,null,null,null,null,{"$f":"【結果】個人成績表!$A$1","v":"第8回　阪神奈対抗戦　　　(奈良：キングスポット)"},null,null,null,null,null,null,null,null,{"$f":"【結果】個人成績表!$A$1","v":"第8回　阪神奈対抗戦　　　(奈良：キングスポット)"},null,null,null,null,null,null,null,null,{"$f":"【結果】個人成績表!$A$1","v":"第8回　阪神奈対抗戦　　　(奈良：キングスポット)"}]
[]
[null,"G-No",{"$f":"【進行】結果入力表!B49","v":43},null,null,"T-No",null,null,null,null,"G-No",{"$f":"【進行】結果入力表!B50","v":44},null,null,"T-No",null,null,null,null,"G-No",{"$f":"【進行】結果入力表!B51","v":45},null,null,"T-No",null,null,null,null,"G-No",{"$f":"【進行】結果入力表!B52","v":46},null,null,"T-No",null,null,null,null,"G-No",{"$f":"【進行】結果入力表!B53","v":47},null,null,"T-No",null,null,null,null,"G-No",{"$f":"【進行】結果入力表!B54","v":48},null,null,"T-No",null,null,null,null,"G-No",{"$f":"【進行】結果入力表!B55","v":49},null,null,"T-No"]
[]
[null,{"$f":"VLOOKUP(C73,【進行】結果入力表!$B$7:$J$69,2,FALSE)","v":"HRC"},null,null,"所属",{"$f":"VLOOKUP(C73,【進行】結果入力表!$B$7:$J$69,9,FALSE)","v":"ORC"},null,null,null,null,{"$f":"VLOOKUP(L73,【進行】結果入力表!$B$7:$J$69,2,FALSE)","v":"HRC"},null,null,"所属",{"$f":"VLOOKUP(L73,【進行】結果入力表!$B$7:$J$69,9,FALSE)","v":"ORC"},null,null,null,null,{"$f":"VLOOKUP(U73,【進行】結果入力表!$B$7:$J$69,2,FALSE)","v":"HRC"},null,null,"所属",{"$f":"VLOOKUP(U73,【進行】結果入力表!$B$7:$J$69,9,FALSE)","v":"ORC"},null,null,null,null,{"$f":"VLOOKUP(AD73,【進行】結果入力表!$B$7:$J$69,2,FALSE)","v":"HRC"},null,null,"所属",{"$f":"VLOOKUP(AD73,【進行】結果入力表!$B$7:$J$69,9,FALSE)","v":"ORC"},null,null,null,null,{"$f":"VLOOKUP(AM73,【進行】結果入力表!$B$7:$J$69,2,FALSE)","v":"HRC"},null,null,"所属",{"$f":"VLOOKUP(AM73,【進行】結果入力表!$B$7:$J$69,9,FALSE)","v":"ORC"},null,null,null,null,{"$f":"VLOOKUP(AV73,【進行】結果入力表!$B$7:$J$69,2,FALSE)","v":"HRC"},null,null,"所属",{"$f":"VLOOKUP(AV73,【進行】結果入力表!$B$7:$J$69,9,FALSE)","v":"ORC"},null,null,null,null,{"$f":"VLOOKUP(BE73,【進行】結果入力表!$B$7:$J$69,2,FALSE)","v":"HRC"},null,null,"所属",{"$f":"VLOOKUP(BE73,【進行】結果入力表!$B$7:$J$69,9,FALSE)","v":"ORC"}]
[null,{"$f":"VLOOKUP(C73,【進行】結果入力表!$B$7:$J$69,3,FALSE)","v":"丹羽　俊也"},null,null,"氏名",{"$f":"VLOOKUP(C73,【進行】結果入力表!$B$7:$J$69,8,FALSE)","v":"樹本　武士"},null,null,null,null,{"$f":"VLOOKUP(L73,【進行】結果入力表!$B$7:$J$69,3,FALSE)","v":"高山　普任"},null,null,"氏名",{"$f":"VLOOKUP(L73,【進行】結果入力表!$B$7:$J$69,8,FALSE)","v":"乾　伸綱"},null,null,null,null,{"$f":"VLOOKUP(U73,【進行】結果入力表!$B$7:$J$69,3,FALSE)","v":"藤中健太郎"},null,null,"氏名",{"$f":"VLOOKUP(U73,【進行】結果入力表!$B$7:$J$69,8,FALSE)","v":"村上　泰辰"},null,null,null,null,{"$f":"VLOOKUP(AD73,【進行】結果入力表!$B$7:$J$69,3,FALSE)","v":"中平　美輪"},null,null,"氏名",{"$f":"VLOOKUP(AD73,【進行】結果入力表!$B$7:$J$69,8,FALSE)","v":"山岡　修二"},null,null,null,null,{"$f":"VLOOKUP(AM73,【進行】結果入力表!$B$7:$J$69,3,FALSE)","v":"高木　俊行"},null,null,"氏名",{"$f":"VLOOKUP(AM73,【進行】結果入力表!$B$7:$J$69,8,FALSE)","v":"吉岡　保俊"},null,null,null,null,{"$f":"VLOOKUP(AV73,【進行】結果入力表!$B$7:$J$69,3,FALSE)","v":"堂園　雅也"},null,null,"氏名",{"$f":"VLOOKUP(AV73,【進行】結果入力表!$B$7:$J$69,8,FALSE)","v":"渡邊　孝行"},null,null,null,null,{"$f":"VLOOKUP(BE73,【進行】結果入力表!$B$7:$J$69,3,FALSE)","v":"菊川　博功"},null,null,"氏名",{"$f":"VLOOKUP(BE73,【進行】結果入力表!$B$7:$J$69,8,FALSE)","v":"山崎真紀子"}]
[null,null,null,null,"得点",null,null,null,null,null,null,null,null,"得点",null,null,null,null,null,null,null,null,"得点",null,null,null,null,null,null,null,null,"得点",null,null,null,null,null,null,null,null,"得点",null,null,null,null,null,null,null,null,"得点",null,null,null,null,null,null,null,null,"得点"]
[null,null,null,null,"HR",null,null,null,null,null,null,null,null,"HR",null,null,null,null,null,null,null,null,"HR",null,null,null,null,null,null,null,null,"HR",null,null,null,null,null,null,null,null,"HR",null,null,null,null,null,null,null,null,"HR",null,null,null,null,null,null,null,null,"HR"]
[]
[null,null,null,null,"レフリー：",{"$f":"VLOOKUP(C73,【進行】結果入力表!$B$7:$M$69,11,FALSE)","v":"NRC"},{"$f":"VLOOKUP(C73,【進行】結果入力表!$B$7:$M$69,12,FALSE)","v":"植田　慎也"},null,null,null,null,null,null,"レフリー：",{"$f":"VLOOKUP(L73,【進行】結果入力表!$B$7:$M$69,11,FALSE)","v":"NRC"},{"$f":"VLOOKUP(L73,【進行】結果入力表!$B$7:$M$69,12,FALSE)","v":"宮野　早織"},null,null,null,null,null,null,"レフリー：",{"$f":"VLOOKUP(U73,【進行】結果入力表!$B$7:$M$69,11,FALSE)","v":"NRC"},{"$f":"VLOOKUP(U73,【進行】結果入力表!$B$7:$M$69,12,FALSE)","v":"吉向　翔平"},null,null,null,null,null,null,"レフリー：",{"$f":"VLOOKUP(AD73,【進行】結果入力表!$B$7:$M$69,11,FALSE)","v":"NRC"},{"$f":"VLOOKUP(AD73,【進行】結果入力表!$B$7:$M$69,12,FALSE)","v":"近藤　拓馬"},null,null,null,null,null,null,"レフリー：",{"$f":"VLOOKUP(AM73,【進行】結果入力表!$B$7:$M$69,11,FALSE)","v":"NRC"},{"$f":"VLOOKUP(AM73,【進行】結果入力表!$B$7:$M$69,12,FALSE)","v":"金澤　茂昌"},null,null,null,null,null,null,"レフリー：",{"$f":"VLOOKUP(AV73,【進行】結果入力表!$B$7:$M$69,11,FALSE)","v":"NRC"},{"$f":"VLOOKUP(AV73,【進行】結果入力表!$B$7:$M$69,12,FALSE)","v":"斉藤　裕児"},null,null,null,null,null,null,"レフリー：",{"$f":"VLOOKUP(BE73,【進行】結果入力表!$B$7:$M$69,11,FALSE)","v":"NRC"},{"$f":"VLOOKUP(BE73,【進行】結果入力表!$B$7:$M$69,12,FALSE)","v":"岩本　剛"}]
[null,{"$f":"【結果】個人成績表!$A$1","v":"第8回　阪神奈対抗戦　　　(奈良：キングスポット)"},null,null,null,null,null,null,null,null,{"$f":"【結果】個人成績表!$A$1","v":"第8回　阪神奈対抗戦　　　(奈良：キングスポット)"},null,null,null,null,null,null,null,null,{"$f":"【結果】個人成績表!$A$1","v":"第8回　阪神奈対抗戦　　　(奈良：キングスポット)"},null,null,null,null,null,null,null,null,{"$f":"【結果】個人成績表!$A$1","v":"第8回　阪神奈対抗戦　　　(奈良：キングスポット)"},null,null,null,null,null,null,null,null,{"$f":"【結果】個人成績表!$A$1","v":"第8回　阪神奈対抗戦　　　(奈良：キングスポット)"},null,null,null,null,null,null,null,null,{"$f":"【結果】個人成績表!$A$1","v":"第8回　阪神奈対抗戦　　　(奈良：キングスポット)"},null,null,null,null,null,null,null,null,{"$f":"【結果】個人成績表!$A$1","v":"第8回　阪神奈対抗戦　　　(奈良：キングスポット)"}]
[]
[null,"G-No",{"$f":"【進行】結果入力表!B56","v":50},null,null,"T-No",null,null,null,null,"G-No",{"$f":"【進行】結果入力表!B57","v":51},null,null,"T-No",null,null,null,null,"G-No",{"$f":"【進行】結果入力表!B58","v":52},null,null,"T-No",null,null,null,null,"G-No",{"$f":"【進行】結果入力表!B59","v":53},null,null,"T-No",null,null,null,null,"G-No",{"$f":"【進行】結果入力表!B60","v":54},null,null,"T-No",null,null,null,null,"G-No",{"$f":"【進行】結果入力表!B61","v":55},null,null,"T-No",null,null,null,null,"G-No",{"$f":"【進行】結果入力表!B62","v":56},null,null,"T-No"]
[]
[null,{"$f":"VLOOKUP(C83,【進行】結果入力表!$B$7:$J$69,2,FALSE)","v":"HRC"},null,null,"所属",{"$f":"VLOOKUP(C83,【進行】結果入力表!$B$7:$J$69,9,FALSE)","v":"NRC"},null,null,null,null,{"$f":"VLOOKUP(L83,【進行】結果入力表!$B$7:$J$69,2,FALSE)","v":"HRC"},null,null,"所属",{"$f":"VLOOKUP(L83,【進行】結果入力表!$B$7:$J$69,9,FALSE)","v":"NRC"},null,null,null,null,{"$f":"VLOOKUP(U83,【進行】結果入力表!$B$7:$J$69,2,FALSE)","v":"HRC"},null,null,"所属",{"$f":"VLOOKUP(U83,【進行】結果入力表!$B$7:$J$69,9,FALSE)","v":"NRC"},null,null,null,null,{"$f":"VLOOKUP(AD83,【進行】結果入力表!$B$7:$J$69,2,FALSE)","v":"HRC"},null,null,"所属",{"$f":"VLOOKUP(AD83,【進行】結果入力表!$B$7:$J$69,9,FALSE)","v":"NRC"},null,null,null,null,{"$f":"VLOOKUP(AM83,【進行】結果入力表!$B$7:$J$69,2,FALSE)","v":"HRC"},null,null,"所属",{"$f":"VLOOKUP(AM83,【進行】結果入力表!$B$7:$J$69,9,FALSE)","v":"NRC"},null,null,null,null,{"$f":"VLOOKUP(AV83,【進行】結果入力表!$B$7:$J$69,2,FALSE)","v":"HRC"},null,null,"所属",{"$f":"VLOOKUP(AV83,【進行】結果入力表!$B$7:$J$69,9,FALSE)","v":"NRC"},null,null,null,null,{"$f":"VLOOKUP(BE83,【進行】結果入力表!$B$7:$J$69,2,FALSE)","v":"HRC"},null,null,"所属",{"$f":"VLOOKUP(BE83,【進行】結果入力表!$B$7:$J$69,9,FALSE)","v":"NRC"}]
[null,{"$f":"VLOOKUP(C83,【進行】結果入力表!$B$7:$J$69,3,FALSE)","v":"丹羽　俊也"},null,null,"氏名",{"$f":"VLOOKUP(C83,【進行】結果入力表!$B$7:$J$69,8,FALSE)","v":"植田　慎也"},null,null,null,null,{"$f":"VLOOKUP(L83,【進行】結果入力表!$B$7:$J$69,3,FALSE)","v":"高山　普任"},null,null,"氏名",{"$f":"VLOOKUP(L83,【進行】結果入力表!$B$7:$J$69,8,FALSE)","v":"宮野　早織"},null,null,null,null,{"$f":"VLOOKUP(U83,【進行】結果入力表!$B$7:$J$69,3,FALSE)","v":"藤中健太郎"},null,null,"氏名",{"$f":"VLOOKUP(U83,【進行】結果入力表!$B$7:$J$69,8,FALSE)","v":"吉向　翔平"},null,null,null,null,{"$f":"VLOOKUP(AD83,【進行】結果入力表!$B$7:$J$69,3,FALSE)","v":"中平　美輪"},null,null,"氏名",{"$f":"VLOOKUP(AD83,【進行】結果入力表!$B$7:$J$69,8,FALSE)","v":"近藤　拓馬"},null,null,null,null,{"$f":"VLOOKUP(AM83,【進行】結果入力表!$B$7:$J$69,3,FALSE)","v":"高木　俊行"},null,null,"氏名",{"$f":"VLOOKUP(AM83,【進行】結果入力表!$B$7:$J$69,8,FALSE)","v":"金澤　茂昌"},null,null,null,null,{"$f":"VLOOKUP(AV83,【進行】結果入力表!$B$7:$J$69,3,FALSE)","v":"堂園　雅也"},null,null,"氏名",{"$f":"VLOOKUP(AV83,【進行】結果入力表!$B$7:$J$69,8,FALSE)","v":"斉藤　裕児"},null,null,null,null,{"$f":"VLOOKUP(BE83,【進行】結果入力表!$B$7:$J$69,3,FALSE)","v":"菊川　博功"},null,null,"氏名",{"$f":"VLOOKUP(BE83,【進行】結果入力表!$B$7:$J$69,8,FALSE)","v":"岩本　剛"}]
[null,null,null,null,"得点",null,null,null,null,null,null,null,null,"得点",null,null,null,null,null,null,null,null,"得点",null,null,null,null,null,null,null,null,"得点",null,null,null,null,null,null,null,null,"得点",null,null,null,null,null,null,null,null,"得点",null,null,null,null,null,null,null,null,"得点"]
[null,null,null,null,"HR",null,null,null,null,null,null,null,null,"HR",null,null,null,null,null,null,null,null,"HR",null,null,null,null,null,null,null,null,"HR",null,null,null,null,null,null,null,null,"HR",null,null,null,null,null,null,null,null,"HR",null,null,null,null,null,null,null,null,"HR"]
[]
[null,null,null,null,"レフリー：",{"$f":"VLOOKUP(C83,【進行】結果入力表!$B$7:$M$69,11,FALSE)","v":"ORC"},{"$f":"VLOOKUP(C83,【進行】結果入力表!$B$7:$M$69,12,FALSE)","v":"樹本　武士"},null,null,null,null,null,null,"レフリー：",{"$f":"VLOOKUP(L83,【進行】結果入力表!$B$7:$M$69,11,FALSE)","v":"ORC"},{"$f":"VLOOKUP(L83,【進行】結果入力表!$B$7:$M$69,12,FALSE)","v":"乾　伸綱"},null,null,null,null,null,null,"レフリー：",{"$f":"VLOOKUP(U83,【進行】結果入力表!$B$7:$M$69,11,FALSE)","v":"ORC"},{"$f":"VLOOKUP(U83,【進行】結果入力表!$B$7:$M$69,12,FALSE)","v":"村上　泰辰"},null,null,null,null,null,null,"レフリー：",{"$f":"VLOOKUP(AD83,【進行】結果入力表!$B$7:$M$69,11,FALSE)","v":"ORC"},{"$f":"VLOOKUP(AD83,【進行】結果入力表!$B$7:$M$69,12,FALSE)","v":"山岡　修二"},null,null,null,null,null,null,"レフリー：",{"$f":"VLOOKUP(AM83,【進行】結果入力表!$B$7:$M$69,11,FALSE)","v":"ORC"},{"$f":"VLOOKUP(AM83,【進行】結果入力表!$B$7:$M$69,12,FALSE)","v":"吉岡　保俊"},null,null,null,null,null,null,"レフリー：",{"$f":"VLOOKUP(AV83,【進行】結果入力表!$B$7:$M$69,11,FALSE)","v":"ORC"},{"$f":"VLOOKUP(AV83,【進行】結果入力表!$B$7:$M$69,12,FALSE)","v":"渡邊　孝行"},null,null,null,null,null,null,"レフリー：",{"$f":"VLOOKUP(BE83,【進行】結果入力表!$B$7:$M$69,11,FALSE)","v":"ORC"},{"$f":"VLOOKUP(BE83,【進行】結果入力表!$B$7:$M$69,12,FALSE)","v":"山崎真紀子"}]
[null,{"$f":"【結果】個人成績表!$A$1","v":"第8回　阪神奈対抗戦　　　(奈良：キングスポット)"},null,null,null,null,null,null,null,null,{"$f":"【結果】個人成績表!$A$1","v":"第8回　阪神奈対抗戦　　　(奈良：キングスポット)"},null,null,null,null,null,null,null,null,{"$f":"【結果】個人成績表!$A$1","v":"第8回　阪神奈対抗戦　　　(奈良：キングスポット)"},null,null,null,null,null,null,null,null,{"$f":"【結果】個人成績表!$A$1","v":"第8回　阪神奈対抗戦　　　(奈良：キングスポット)"},null,null,null,null,null,null,null,null,{"$f":"【結果】個人成績表!$A$1","v":"第8回　阪神奈対抗戦　　　(奈良：キングスポット)"},null,null,null,null,null,null,null,null,{"$f":"【結果】個人成績表!$A$1","v":"第8回　阪神奈対抗戦　　　(奈良：キングスポット)"},null,null,null,null,null,null,null,null,{"$f":"【結果】個人成績表!$A$1","v":"第8回　阪神奈対抗戦　　　(奈良：キングスポット)"}]
[]
[null,"G-No",{"$f":"【進行】結果入力表!B63","v":57},null,null,"T-No",null,null,null,null,"G-No",{"$f":"【進行】結果入力表!B64","v":58},null,null,"T-No",null,null,null,null,"G-No",{"$f":"【進行】結果入力表!B65","v":59},null,null,"T-No",null,null,null,null,"G-No",{"$f":"【進行】結果入力表!B66","v":60},null,null,"T-No",null,null,null,null,"G-No",{"$f":"【進行】結果入力表!B67","v":61},null,null,"T-No",null,null,null,null,"G-No",{"$f":"【進行】結果入力表!B68","v":62},null,null,"T-No",null,null,null,null,"G-No",{"$f":"【進行】結果入力表!B69","v":63},null,null,"T-No"]
[]
[null,{"$f":"VLOOKUP(C93,【進行】結果入力表!$B$7:$J$69,2,FALSE)","v":"NRC"},null,null,"所属",{"$f":"VLOOKUP(C93,【進行】結果入力表!$B$7:$J$69,9,FALSE)","v":"ORC"},null,null,null,null,{"$f":"VLOOKUP(L93,【進行】結果入力表!$B$7:$J$69,2,FALSE)","v":"NRC"},null,null,"所属",{"$f":"VLOOKUP(L93,【進行】結果入力表!$B$7:$J$69,9,FALSE)","v":"ORC"},null,null,null,null,{"$f":"VLOOKUP(U93,【進行】結果入力表!$B$7:$J$69,2,FALSE)","v":"NRC"},null,null,"所属",{"$f":"VLOOKUP(U93,【進行】結果入力表!$B$7:$J$69,9,FALSE)","v":"ORC"},null,null,null,null,{"$f":"VLOOKUP(AD93,【進行】結果入力表!$B$7:$J$69,2,FALSE)","v":"NRC"},null,null,"所属",{"$f":"VLOOKUP(AD93,【進行】結果入力表!$B$7:$J$69,9,FALSE)","v":"ORC"},null,null,null,null,{"$f":"VLOOKUP(AM93,【進行】結果入力表!$B$7:$J$69,2,FALSE)","v":"NRC"},null,null,"所属",{"$f":"VLOOKUP(AM93,【進行】結果入力表!$B$7:$J$69,9,FALSE)","v":"ORC"},null,null,null,null,{"$f":"VLOOKUP(AV93,【進行】結果入力表!$B$7:$J$69,2,FALSE)","v":"NRC"},null,null,"所属",{"$f":"VLOOKUP(AV93,【進行】結果入力表!$B$7:$J$69,9,FALSE)","v":"ORC"},null,null,null,null,{"$f":"VLOOKUP(BE93,【進行】結果入力表!$B$7:$J$69,2,FALSE)","v":"NRC"},null,null,"所属",{"$f":"VLOOKUP(BE93,【進行】結果入力表!$B$7:$J$69,9,FALSE)","v":"ORC"}]
[null,{"$f":"VLOOKUP(C93,【進行】結果入力表!$B$7:$J$69,3,FALSE)","v":"植田　慎也"},null,null,"氏名",{"$f":"VLOOKUP(C93,【進行】結果入力表!$B$7:$J$69,8,FALSE)","v":"樹本　武士"},null,null,null,null,{"$f":"VLOOKUP(L93,【進行】結果入力表!$B$7:$J$69,3,FALSE)","v":"宮野　早織"},null,null,"氏名",{"$f":"VLOOKUP(L93,【進行】結果入力表!$B$7:$J$69,8,FALSE)","v":"乾　伸綱"},null,null,null,null,{"$f":"VLOOKUP(U93,【進行】結果入力表!$B$7:$J$69,3,FALSE)","v":"吉向　翔平"},null,null,"氏名",{"$f":"VLOOKUP(U93,【進行】結果入力表!$B$7:$J$69,8,FALSE)","v":"村上　泰辰"},null,null,null,null,{"$f":"VLOOKUP(AD93,【進行】結果入力表!$B$7:$J$69,3,FALSE)","v":"近藤　拓馬"},null,null,"氏名",{"$f":"VLOOKUP(AD93,【進行】結果入力表!$B$7:$J$69,8,FALSE)","v":"山岡　修二"},null,null,null,null,{"$f":"VLOOKUP(AM93,【進行】結果入力表!$B$7:$J$69,3,FALSE)","v":"金澤　茂昌"},null,null,"氏名",{"$f":"VLOOKUP(AM93,【進行】結果入力表!$B$7:$J$69,8,FALSE)","v":"吉岡　保俊"},null,null,null,null,{"$f":"VLOOKUP(AV93,【進行】結果入力表!$B$7:$J$69,3,FALSE)","v":"斉藤　裕児"},null,null,"氏名",{"$f":"VLOOKUP(AV93,【進行】結果入力表!$B$7:$J$69,8,FALSE)","v":"渡邊　孝行"},null,null,null,null,{"$f":"VLOOKUP(BE93,【進行】結果入力表!$B$7:$J$69,3,FALSE)","v":"岩本　剛"},null,null,"氏名",{"$f":"VLOOKUP(BE93,【進行】結果入力表!$B$7:$J$69,8,FALSE)","v":"山崎真紀子"}]
[null,null,null,null,"得点",null,null,null,null,null,null,null,null,"得点",null,null,null,null,null,null,null,null,"得点",null,null,null,null,null,null,null,null,"得点",null,null,null,null,null,null,null,null,"得点",null,null,null,null,null,null,null,null,"得点",null,null,null,null,null,null,null,null,"得点"]
[null,null,null,null,"HR",null,null,null,null,null,null,null,null,"HR",null,null,null,null,null,null,null,null,"HR",null,null,null,null,null,null,null,null,"HR",null,null,null,null,null,null,null,null,"HR",null,null,null,null,null,null,null,null,"HR",null,null,null,null,null,null,null,null,"HR"]
[]
[null,null,null,null,"レフリー：",{"$f":"VLOOKUP(C93,【進行】結果入力表!$B$7:$M$69,11,FALSE)","v":"HRC"},{"$f":"VLOOKUP(C93,【進行】結果入力表!$B$7:$M$69,12,FALSE)","v":"丹羽　俊也"},null,null,null,null,null,null,"レフリー：",{"$f":"VLOOKUP(L93,【進行】結果入力表!$B$7:$M$69,11,FALSE)","v":"HRC"},{"$f":"VLOOKUP(L93,【進行】結果入力表!$B$7:$M$69,12,FALSE)","v":"高山　普任"},null,null,null,null,null,null,"レフリー：",{"$f":"VLOOKUP(U93,【進行】結果入力表!$B$7:$M$69,11,FALSE)","v":"HRC"},{"$f":"VLOOKUP(U93,【進行】結果入力表!$B$7:$M$69,12,FALSE)","v":"藤中健太郎"},null,null,null,null,null,null,"レフリー：",{"$f":"VLOOKUP(AD93,【進行】結果入力表!$B$7:$M$69,11,FALSE)","v":"HRC"},{"$f":"VLOOKUP(AD93,【進行】結果入力表!$B$7:$M$69,12,FALSE)","v":"中平　美輪"},null,null,null,null,null,null,"レフリー：",{"$f":"VLOOKUP(AM93,【進行】結果入力表!$B$7:$M$69,11,FALSE)","v":"HRC"},{"$f":"VLOOKUP(AM93,【進行】結果入力表!$B$7:$M$69,12,FALSE)","v":"高木　俊行"},null,null,null,null,null,null,"レフリー：",{"$f":"VLOOKUP(AV93,【進行】結果入力表!$B$7:$M$69,11,FALSE)","v":"HRC"},{"$f":"VLOOKUP(AV93,【進行】結果入力表!$B$7:$M$69,12,FALSE)","v":"堂園　雅也"},null,null,null,null,null,null,"レフリー：",{"$f":"VLOOKUP(BE93,【進行】結果入力表!$B$7:$M$69,11,FALSE)","v":"HRC"},{"$f":"VLOOKUP(BE93,【進行】結果入力表!$B$7:$M$69,12,FALSE)","v":"菊川　博功"}]

{"sheet":"【進行】結果入力表","index":2,"n_rows":69,"n_cols":15,"rows_kept":69,"cut":false,"hidden":false,"merged":[]}
[]
[]
[]
[]
[]
["節","G-No","所属A","選手名A","HR","得点","得点","HR","選手名B","所属B",null,"レフリー",null,null,"※敗者側のスコアを入力すると相手側に”ｗ”が自動表示されます。"]
["第1節",1,{"$f":"IF(【準備】登録!B11=\"\",\"\",【準備】登録!B11)","v":"HRC"},{"$f":"IF(【準備】登録!$D$11=\"\",\"\",【準備】登録!$D$11)","v":"高木　俊行"},106,"w",150,null,{"$f":"IF(【準備】登録!$D$13=\"\",\"\",【準備】登録!$D$13)","v":"樹本　武士"},{"$f":"IF(【準備】登録!B13=\"\",\"\",【準備】登録!B13)","v":"ORC"},null,{"$f":"J14","v":"NRC"},{"$f":"I14","v":"吉向　翔平"},null,"※入力行を間違えた場合は「Ctrl＋ｑ」でその行がクリアされます。"]
["第1節",{"$f":"B7+1","v":2},{"$f":"$C$7","v":"HRC"},{"$f":"IF(【準備】登録!$G$11=\"\",\"\",【準備】登録!$G$11)","v":"堂園　雅也"},null,"w",141,null,{"$f":"IF(【準備】登録!$G$13=\"\",\"\",【準備】登録!$G$13)","v":"乾　伸綱"},{"$f":"$J$7","v":"ORC"},null,"NRC","近藤　拓馬"]
["第1節",{"$f":"B8+1","v":3},"HRC",{"$f":"IF(【準備】登録!$J$11=\"\",\"\",【準備】登録!$J$11)","v":"菊川　博功"},null,"w",179,null,{"$f":"IF(【準備】登録!$J$13=\"\",\"\",【準備】登録!$J$13)","v":"村上　泰辰"},"ORC",null,"NRC","金澤　茂昌",null,"※各選手は節毎に２試合を行い、計３節、６試合を行います。"]
["第1節",4,"HRC",{"$f":"IF(【準備】登録!$M$11=\"\",\"\",【準備】登録!$M$11)","v":"丹羽　俊也"},null,103,"w",109,{"$f":"IF(【準備】登録!$M$13=\"\",\"\",【準備】登録!$M$13)","v":"山岡　修二"},"ORC",null,"NRC","斉藤　裕児",null,"※節抜きには対応しておりません。"]
["第1節",5,"HRC",{"$f":"IF(【準備】登録!$P$11=\"\",\"\",【準備】登録!$P$11)","v":"高山　普任"},null,"w",115,null,{"$f":"IF(【準備】登録!$P$13=\"\",\"\",【準備】登録!$P$13)","v":"吉岡　保俊"},"ORC",null,"NRC","岩本　剛"]
["第1節",6,"HRC",{"$f":"IF(【準備】登録!$S$11=\"\",\"\",【準備】登録!$S$11)","v":"藤中健太郎"},null,150,"w",null,{"$f":"IF(【準備】登録!$S$13=\"\",\"\",【準備】登録!$S$13)","v":"渡邊　孝行"},"ORC",null,"NRC","植田　慎也"]
["第1節",7,"HRC",{"$f":"IF(【準備】登録!$V$11=\"\",\"\",【準備】登録!$V$11)","v":"中平　美輪"},null,"w",79,null,{"$f":"IF(【準備】登録!$V$13=\"\",\"\",【準備】登録!$V$13)","v":"山崎真紀子"},"ORC",null,"NRC","宮野　早織"]
["第1節",8,"HRC",{"$f":"D7","v":"高木　俊行"},null,"w",96,null,{"$f":"IF(【準備】登録!$D$12=\"\",\"\",【準備】登録!$D$12)","v":"吉向　翔平"},{"$f":"$C$21","v":"NRC"},null,{"$f":"J7","v":"ORC"},{"$f":"I7","v":"樹本　武士"}]
["第1節",9,"HRC","堂園　雅也",null,137,"w",null,{"$f":"IF(【準備】登録!$G$12=\"\",\"\",【準備】登録!$G$12)","v":"近藤　拓馬"},"NRC",null,"ORC","乾　伸綱"]
["第1節",10,"HRC","菊川　博功",null,"w",115,null,{"$f":"IF(【準備】登録!$J$12=\"\",\"\",【準備】登録!$J$12)","v":"金澤　茂昌"},"NRC",null,"ORC","村上　泰辰"]
["第1節",11,"HRC","丹羽　俊也",null,87,"w",null,{"$f":"IF(【準備】登録!$M$12=\"\",\"\",【準備】登録!$M$12)","v":"斉藤　裕児"},"NRC",null,"ORC","山岡　修二"]
["第1節",12,"HRC","高山　普任",null,"w",74,null,{"$f":"IF(【準備】登録!$P$12=\"\",\"\",【準備】登録!$P$12)","v":"岩本　剛"},"NRC",null,"ORC","吉岡　保俊"]
["第1節",13,"HRC","藤中健太郎",null,"w",36,null,{"$f":"IF(【準備】登録!$S$12=\"\",\"\",【準備】登録!$S$12)","v":"植田　慎也"},"NRC",null,"ORC","渡邊　孝行"]
["第1節",14,"HRC","中平　美輪",null,"w",92,null,{"$f":"IF(【準備】登録!$V$12=\"\",\"\",【準備】登録!$V$12)","v":"宮野　早織"},"NRC",null,"ORC","山崎真紀子"]
["第1節",15,{"$f":"IF(【準備】登録!B12=\"\",\"\",【準備】登録!B12)","v":"NRC"},{"$f":"I14","v":"吉向　翔平"},null,"w",86,null,{"$f":"I7","v":"樹本　武士"},{"$f":"$J$7","v":"ORC"},null,{"$f":"C7","v":"HRC"},{"$f":"D14","v":"高木　俊行"}]
["第1節",16,{"$f":"$C$21","v":"NRC"},"近藤　拓馬",null,"w",109,null,"乾　伸綱","ORC",null,"HRC","堂園　雅也"]
["第1節",17,"NRC","金澤　茂昌",null,1,"w",119,"村上　泰辰","ORC",null,"HRC","菊川　博功"]
["第1節",18,"NRC","斉藤　裕児",null,82,"w",null,"山岡　修二","ORC",null,"HRC","丹羽　俊也"]
["第1節",19,"NRC","岩本　剛",null,93,"w",null,"吉岡　保俊","ORC",null,"HRC","高山　普任"]
["第1節",20,"NRC","植田　慎也",null,"w",115,null,"渡邊　孝行","ORC",null,"HRC","藤中健太郎"]
["第1節",21,"NRC","宮野　早織",null,77,"w",null,"山崎真紀子","ORC",null,"HRC","中平　美輪"]
["第2節",22,{"$f":"$C$7","v":"HRC"},{"$f":"D35","v":"藤中健太郎"},null,39,"w",null,{"$f":"IF(【準備】登録!$D$13=\"\",\"\",【準備】登録!$D$13)","v":"樹本　武士"},"ORC",null,{"$f":"J35","v":"NRC"},{"$f":"I35","v":"宮野　早織"}]
["第2節",23,"HRC","中平　美輪",null,97,"w",null,{"$f":"IF(【準備】登録!$G$13=\"\",\"\",【準備】登録!$G$13)","v":"乾　伸綱"},"ORC",null,"NRC","吉向　翔平"]
["第2節",24,"HRC","高木　俊行",null,10,"w",110,{"$f":"IF(【準備】登録!$J$13=\"\",\"\",【準備】登録!$J$13)","v":"村上　泰辰"},"ORC",null,"NRC","近藤　拓馬"]
["第2節",25,"HRC","堂園　雅也",null,35,"w",null,{"$f":"IF(【準備】登録!$M$13=\"\",\"\",【準備】登録!$M$13)","v":"山岡　修二"},"ORC",null,"NRC","金澤　茂昌"]
["第2節",26,"HRC","菊川　博功",null,29,"w",null,{"$f":"IF(【準備】登録!$P$13=\"\",\"\",【準備】登録!$P$13)","v":"吉岡　保俊"},"ORC",null,"NRC","斉藤　裕児"]
["第2節",27,"HRC","丹羽　俊也",null,149,"w",null,{"$f":"IF(【準備】登録!$S$13=\"\",\"\",【準備】登録!$S$13)","v":"渡邊　孝行"},"ORC",null,"NRC","岩本　剛"]
["第2節",28,"HRC","高山　普任",110,"w",14,null,{"$f":"IF(【準備】登録!$V$13=\"\",\"\",【準備】登録!$V$13)","v":"山崎真紀子"},"ORC",null,"NRC","植田　慎也"]
["第2節",29,"HRC",{"$f":"IF($D$7=\"\",\"\",IF(【準備】登録!Y11=\"\",【準備】登録!S11,【準備】登録!$V$11))","v":"藤中健太郎"},null,66,"w",null,{"$f":"IF($D$7=\"\",\"\",IF(【準備】登録!Y12=\"\",【準備】登録!V12,【準備】登録!$Y$12))","v":"宮野　早織"},{"$f":"$C$21","v":"NRC"},null,{"$f":"J28","v":"ORC"},{"$f":"I28","v":"樹本　武士"}]
["第2節",30,"HRC",{"$f":"IF($D$7=\"\",\"\",IF(【準備】登録!$Y$11=\"\",【準備】登録!V11,【準備】登録!Y11))","v":"中平　美輪"},null,45,"w",null,{"$f":"IF($D$7=\"\",\"\",【準備】登録!$D$12)","v":"吉向　翔平"},"NRC",null,"ORC","乾　伸綱"]
["第2節",31,"HRC",{"$f":"IF($D$7=\"\",\"\",【準備】登録!$D$11)","v":"高木　俊行"},null,"w",110,null,{"$f":"IF($D$7=\"\",\"\",【準備】登録!$G$12)","v":"近藤　拓馬"},"NRC",null,"ORC","村上　泰辰"]
["第2節",32,"HRC",{"$f":"IF($D$7=\"\",\"\",【準備】登録!$G$11)","v":"堂園　雅也"},null,"w",135,null,{"$f":"IF($D$7=\"\",\"\",【準備】登録!$J$12)","v":"金澤　茂昌"},"NRC",null,"ORC","山岡　修二"]
["第2節",33,"HRC",{"$f":"IF($D$7=\"\",\"\",【準備】登録!$J$11)","v":"菊川　博功"},null,"w",138,null,{"$f":"IF($D$7=\"\",\"\",【準備】登録!$M$12)","v":"斉藤　裕児"},"NRC",null,"ORC","吉岡　保俊"]
["第2節",34,"HRC",{"$f":"IF($D$7=\"\",\"\",【準備】登録!$M$11)","v":"丹羽　俊也"},null,157,"w",null,{"$f":"IF($D$7=\"\",\"\",【準備】登録!$P$12)","v":"岩本　剛"},"NRC",null,"ORC","渡邊　孝行"]
["第2節",35,"HRC",{"$f":"IF($D$7=\"\",\"\",【準備】登録!$P$11)","v":"高山　普任"},null,"w",86,null,{"$f":"IF($D$7=\"\",\"\",【準備】登録!$S$12)","v":"植田　慎也"},"NRC",null,"ORC","山崎真紀子"]
["第2節",36,{"$f":"$C$21","v":"NRC"},{"$f":"I35","v":"宮野　早織"},null,56,"w",null,{"$f":"I28","v":"樹本　武士"},{"$f":"$J$7","v":"ORC"},null,{"$f":"C35","v":"HRC"},"藤中健太郎"]
["第2節",37,"NRC","吉向　翔平",null,"w",123,null,"乾　伸綱","ORC",null,"HRC","中平　美輪"]
["第2節",38,"NRC","近藤　拓馬",null,115,"w",null,"村上　泰辰","ORC",null,"HRC","高木　俊行"]
["第2節",39,"NRC","金澤　茂昌",null,104,"w",null,"山岡　修二","ORC",null,"HRC","堂園　雅也"]
["第2節",40,"NRC","斉藤　裕児",null,100,"w",null,"吉岡　保俊","ORC",null,"HRC","菊川　博功"]
["第2節",41,"NRC","岩本　剛",null,103,"w",null,"渡邊　孝行","ORC",null,"HRC","丹羽　俊也"]
["第2節",42,"NRC","植田　慎也",null,123,"w",null,"山崎真紀子","ORC",null,"HRC","高山　普任"]
["第3節",43,{"$f":"$C$7","v":"HRC"},{"$f":"D56","v":"丹羽　俊也"},null,"w",123,null,{"$f":"IF($D$7=\"\",\"\",【準備】登録!$D$13)","v":"樹本　武士"},"ORC",null,{"$f":"J56","v":"NRC"},{"$f":"I56","v":"植田　慎也"}]
["第3節",44,"HRC","高山　普任",124,160,"w",null,{"$f":"IF($D$7=\"\",\"\",【準備】登録!$G$13)","v":"乾　伸綱"},"ORC",null,"NRC","宮野　早織"]
["第3節",45,"HRC","藤中健太郎",null,2,"w",null,{"$f":"IF($D$7=\"\",\"\",【準備】登録!$J$13)","v":"村上　泰辰"},"ORC",null,"NRC","吉向　翔平"]
["第3節",46,"HRC","中平　美輪",null,10,"w",109,{"$f":"IF($D$7=\"\",\"\",【準備】登録!$M$13)","v":"山岡　修二"},"ORC",null,"NRC","近藤　拓馬"]
["第3節",47,"HRC","高木　俊行",null,156,"w",null,{"$f":"IF($D$7=\"\",\"\",【準備】登録!$P$13)","v":"吉岡　保俊"},"ORC",null,"NRC","金澤　茂昌"]
["第3節",48,"HRC","堂園　雅也",125,"w",87,null,{"$f":"IF($D$7=\"\",\"\",【準備】登録!$S$13)","v":"渡邊　孝行"},"ORC",null,"NRC","斉藤　裕児"]
["第3節",49,"HRC","菊川　博功",null,"w",75,null,{"$f":"IF($D$7=\"\",\"\",【準備】登録!$V$13)","v":"山崎真紀子"},"ORC",null,"NRC","岩本　剛"]
["第3節",50,"HRC",{"$f":"IF($D$7=\"\",\"\",IF(【準備】登録!Y11=\"\",【準備】登録!M11,【準備】登録!$P$11))","v":"丹羽　俊也"},null,"w",76,null,{"$f":"IF($D$7=\"\",\"\",IF(【準備】登録!Y12=\"\",【準備】登録!S12,【準備】登録!$V$12))","v":"植田　慎也"},{"$f":"$C$21","v":"NRC"},null,{"$f":"J49","v":"ORC"},{"$f":"I49","v":"樹本　武士"}]
["第3節",51,"HRC",{"$f":"IF($D$7=\"\",\"\",IF(【準備】登録!Y11=\"\",【準備】登録!P11,【準備】登録!$S$11))","v":"高山　普任"},null,"w",75,null,{"$f":"IF($D$7=\"\",\"\",IF(【準備】登録!Y12=\"\",【準備】登録!V12,【準備】登録!$Y$12))","v":"宮野　早織"},"NRC",null,"ORC","乾　伸綱"]
["第3節",52,"HRC",{"$f":"IF($D$7=\"\",\"\",IF(【準備】登録!Y11=\"\",【準備】登録!S11,【準備】登録!$V$11))","v":"藤中健太郎"},null,3,"w",null,{"$f":"IF($D$7=\"\",\"\",【準備】登録!$D$12)","v":"吉向　翔平"},"NRC",null,"ORC","村上　泰辰"]
["第3節",53,"HRC",{"$f":"IF($D$7=\"\",\"\",IF(【準備】登録!Y11=\"\",【準備】登録!V11,【準備】登録!$Y$11))","v":"中平　美輪"},null,56,"w",null,{"$f":"IF($D$7=\"\",\"\",【準備】登録!$G$12)","v":"近藤　拓馬"},"NRC",null,"ORC","山岡　修二"]
["第3節",54,"HRC",{"$f":"IF($D$7=\"\",\"\",【準備】登録!$D$11)","v":"高木　俊行"},null,"w",142,null,{"$f":"IF($D$7=\"\",\"\",【準備】登録!$J$12)","v":"金澤　茂昌"},"NRC",null,"ORC","吉岡　保俊"]
["第3節",55,"HRC",{"$f":"IF($D$7=\"\",\"\",【準備】登録!$G$11)","v":"堂園　雅也"},null,"w",36,null,{"$f":"IF($D$7=\"\",\"\",【準備】登録!$M$12)","v":"斉藤　裕児"},"NRC",null,"ORC","渡邊　孝行"]
["第3節",56,"HRC",{"$f":"IF($D$7=\"\",\"\",【準備】登録!$J$11)","v":"菊川　博功"},null,"w",82,null,{"$f":"IF($D$7=\"\",\"\",【準備】登録!$P$12)","v":"岩本　剛"},"NRC",null,"ORC","山崎真紀子"]
["第3節",57,{"$f":"$C$21","v":"NRC"},{"$f":"I56","v":"植田　慎也"},null,"w",115,null,{"$f":"I49","v":"樹本　武士"},{"$f":"$J$7","v":"ORC"},null,{"$f":"C56","v":"HRC"},"丹羽　俊也"]
["第3節",58,"NRC","宮野　早織",null,9,"w",null,"乾　伸綱","ORC",null,"HRC","高山　普任"]
["第3節",59,"NRC","吉向　翔平",null,33,"w",102,"村上　泰辰","ORC",null,"HRC","藤中健太郎"]
["第3節",60,"NRC","近藤　拓馬",null,67,"w",null,"山岡　修二","ORC",null,"HRC","中平　美輪"]
["第3節",61,"NRC","金澤　茂昌",null,"w",153,null,"吉岡　保俊","ORC",null,"HRC","高木　俊行"]
["第3節",62,"NRC","斉藤　裕児",null,"w",170,null,"渡邊　孝行","ORC",null,"HRC","堂園　雅也"]
["第3節",63,"NRC","岩本　剛",null,124,"w",null,"山崎真紀子","ORC",null,"HRC","菊川　博功"]

{"sheet":"【結果】個人成績表","index":3,"n_rows":35,"n_cols":92,"rows_kept":35,"cut":false,"hidden":false,"merged":[[3,64,3,69],[31,61,31,62],[32,61,32,62],[33,61,33,62],[28,61,28,62],[29,61,29,62],[30,61,30,62],[21,61,21,62],[22,61,22,62],[15,61,15,62],[27,61,27,62],[23,61,23,62],[24,61,24,62],[25,61,25,62],[26,61,26,62],[19,61,19,62],[20,61,20,62],[12,61,12,62],[13,61,13,62],[14,61,14,62],[18,61,18,62],[3,5,3,22],[3,23,3,42],[3,43,3,62],[13,51,13,52],[14,51,14,52],[9,61,9,62],[10,61,10,62],[16,61,16,62],[17,61,17,62],[11,61,11,62],[8,21,8,22],[9,21,9,22],[12,23,12,24],[13,23,13,24],[11,23,11,24],[11,11,11,12],[11,19,11,20],[5,43,5,44],[5,51,5,52],[6,51,6,52],[6,49,6,50],[5,53,5,54],[6,53,6,54],[13,49,13,50],[33,51,33,52],[4,61,4,62],[5,61,5,62],[6,61,6,62],[7,61,7,62],[8,61,8,62],[11,51,11,52],[12,51,12,52],[7,59,7,60],[7,51,7,52],[5,59,5,60],[4,59,4,60],[7,53,7,54],[10,53,10,54],[10,59,10,60],[10,51,10,52],[13,53,13,54],[13,59,13,60],[12,53,12,54],[12,59,12,60],[22,59,22,60],[22,53,22,54],[26,53,26,54],[26,51,26,52],[18,43,18,44],[21,43,21,44],[31,51,31,52],[32,51,32,52],[27,43,27,44],[28,43,28,44],[29,43,29,44],[30,43,30,44],[31,49,31,50],[18,49,18,50],[18,51,18,52],[29,49,29,50],[29,51,29,52],[22,51,22,52],[23,51,23,52],[22,43,22,44],[26,49,26,50],[22,49,22,50],[22,41,22,42],[31,39,31,40],[25,31,25,32],[23,31,23,32],[24,39,24,40],[27,31,27,32],[30,39,30,40],[30,33,30,34],[27,39,27,40],[27,33,27,34],[31,33,31,34],[25,39,25,40],[25,33,25,34],[26,31,26,32],[24,31,24,32],[22,31,22,32],[22,39,22,40],[22,33,22,34],[24,33,24,34],[21,31,21,32],[16,31,16,32],[19,31,19,32],[20,31,20,32],[31,41,31,42],[5,41,5,42],[6,41,6,42],[7,41,7,42],[8,41,8,42],[9,41,9,42],[10,41,10,42],[12,41,12,42],[16,41,16,42],[17,41,17,42],[18,41,18,42],[21,41,21,42],[28,41,28,42],[29,41,29,42],[24,41,24,42],[26,41,26,42],[11,41,11,42],[20,41,20,42],[27,41,27,42],[15,41,15,42],[24,29,24,30],[24,23,24,24],[25,29,25,30],[19,21,19,22],[12,11,12,12],[13,21,13,22],[23,13,23,14],[23,19,23,20],[23,21,23,22],[13,19,13,20],[15,23,15,24],[16,29,16,30],[20,21,20,22],[15,29,15,30],[20,29,20,30],[25,13,25,14],[16,23,16,24],[14,21,14,22],[15,21,15,22],[20,23,20,24],[21,23,21,24],[21,29,21,30],[25,11,25,12],[13,29,13,30],[10,19,10,20],[11,13,11,14],[4,11,4,12],[5,11,5,12],[7,11,7,12],[15,19,15,20],[15,13,15,14],[16,19,16,20],[16,13,16,14],[15,11,15,12],[8,19,8,20],[9,19,9,20],[14,19,14,20],[14,13,14,14],[12,13,12,14],[12,19,12,20],[16,5,16,6],[16,9,16,10],[16,11,16,12],[26,21,26,22],[13,11,13,12],[13,13,13,14],[26,19,26,20],[26,13,26,14],[24,0,33,0],[26,1,26,3],[27,1,27,3],[29,1,29,3],[4,0,13,0],[14,0,23,0],[4,1,4,3],[5,1,5,3],[23,1,23,3],[4,9,4,10],[4,19,4,20],[5,13,5,14],[6,13,6,14],[5,19,5,20],[6,19,6,20],[11,5,11,6],[10,1,10,3],[11,1,11,3],[13,1,13,3],[14,1,14,3],[18,1,18,3],[19,1,19,3],[15,1,15,3],[17,1,17,3],[16,1,16,3],[14,5,14,6],[6,5,6,6],[7,5,7,6],[4,5,4,6],[5,5,5,6],[9,9,9,10],[10,9,10,10],[7,13,7,14],[8,13,8,14],[9,13,9,14],[10,13,10,14],[10,11,10,12],[5,9,5,10],[6,9,6,10],[7,9,7,10],[8,9,8,10],[4,13,4,14],[4,21,4,22],[5,21,5,22],[6,21,6,22],[7,21,7,22],[7,19,7,20],[9,23,9,24],[4,23,4,24],[6,1,6,3],[7,1,7,3],[20,1,20,3],[21,1,21,3],[6,11,6,12],[10,21,10,22],[8,11,8,12],[9,11,9,12],[8,5,8,6],[9,5,9,6],[11,9,11,10],[12,9,12,10],[13,9,13,10],[10,5,10,6],[14,11,14,12],[12,5,12,6],[13,5,13,6],[15,5,15,6],[15,9,15,10],[12,1,12,3],[8,1,8,3],[9,1,9,3],[17,5,17,6],[21,5,21,6],[21,19,21,20],[21,13,21,14],[6,39,6,40],[6,33,6,34],[5,39,5,40],[5,33,5,34],[12,31,12,32],[12,33,12,34],[12,29,12,30],[7,29,7,30],[9,29,9,30],[6,29,6,30],[6,43,6,44],[5,49,5,50],[6,59,6,60],[8,43,8,44],[8,49,8,50],[8,53,8,54],[7,23,7,24],[7,39,7,40],[7,43,7,44],[7,49,7,50],[7,33,7,34],[8,23,8,24],[8,31,8,32],[8,59,8,60],[8,51,8,52],[5,31,5,32],[6,31,6,32],[5,23,5,24],[6,23,6,24],[8,39,8,40],[8,33,8,34],[5,29,5,30],[8,29,8,30],[7,31,7,32],[4,29,4,30],[4,33,4,34],[4,39,4,40],[4,31,4,32],[4,53,4,54],[4,51,4,52],[4,49,4,50],[4,43,4,44],[4,41,4,42],[10,23,10,24],[10,39,10,40],[10,43,10,44],[10,49,10,50],[9,31,9,32],[10,31,10,32],[9,49,9,50],[10,33,10,34],[11,33,11,34],[11,29,11,30],[11,31,11,32],[11,39,11,40],[9,39,9,40],[10,29,10,30],[11,43,11,44],[9,33,9,34],[13,33,13,34],[13,39,13,40],[13,31,13,32],[14,39,14,40],[11,49,11,50],[9,59,9,60],[9,51,9,52],[9,43,9,44],[9,53,9,54],[11,53,11,54],[11,59,11,60],[12,39,12,40],[13,41,13,42],[14,41,14,42],[12,43,12,44],[12,49,12,50],[14,49,14,50],[13,43,13,44],[16,51,16,52],[17,39,17,40],[17,33,17,34],[17,59,17,60],[14,9,14,10],[14,23,14,24],[14,33,14,34],[14,29,14,30],[14,31,14,32],[16,21,16,22],[17,21,17,22],[15,31,15,32],[17,49,17,50],[17,51,17,52],[17,43,17,44],[17,19,17,20],[17,13,17,14],[17,9,17,10],[17,11,17,12],[17,23,17,24],[17,29,17,30],[17,31,17,32],[18,59,18,60],[18,53,18,54],[18,23,18,24],[18,21,18,22],[18,39,18,40],[11,21,11,22],[12,21,12,22],[14,59,14,60],[14,53,14,54],[17,53,17,54],[15,39,15,40],[14,43,14,44],[15,43,15,44],[15,59,15,60],[15,53,15,54],[15,49,15,50],[15,51,15,52],[15,33,15,34],[16,39,16,40],[16,33,16,34],[16,43,16,44],[16,59,16,60],[16,53,16,54],[16,49,16,50],[18,33,18,34],[18,29,18,30],[18,31,18,32],[18,5,18,6],[18,19,18,20],[18,13,18,14],[18,9,18,10],[18,11,18,12],[20,5,20,6],[20,19,20,20],[20,13,20,14],[20,9,20,10],[20,11,20,12],[19,59,19,60],[19,53,19,54],[19,49,19,50],[19,51,19,52],[20,43,20,44],[19,5,19,6],[19,19,19,20],[19,13,19,14],[19,9,19,10],[19,11,19,12],[19,43,19,44],[19,41,19,42],[19,23,19,24],[19,39,19,40],[19,33,19,34],[19,29,19,30],[21,39,21,40],[21,33,21,34],[20,59,20,60],[20,53,20,54],[21,59,21,60],[21,53,21,54],[21,49,21,50],[21,51,21,52],[20,49,20,50],[20,51,20,52],[20,39,20,40],[20,33,20,34],[21,9,21,10],[21,11,21,12],[22,23,22,24],[22,29,22,30],[22,1,22,3],[22,5,22,6],[22,19,22,20],[22,13,22,14],[22,9,22,10],[22,11,22,12],[22,21,22,22],[21,21,21,22],[23,5,23,6],[23,59,23,60],[23,43,23,44],[23,49,23,50],[23,41,23,42],[23,53,23,54],[23,9,23,10],[23,23,23,24],[23,29,23,30],[23,11,23,12],[23,33,23,34],[23,39,23,40],[25,59,25,60],[25,53,25,54],[25,49,25,50],[24,1,24,3],[24,5,24,6],[24,19,24,20],[24,13,24,14],[24,9,24,10],[25,41,25,42],[24,59,24,60],[24,53,24,54],[24,49,24,50],[24,43,24,44],[25,43,25,44],[24,51,24,52],[25,51,25,52],[25,1,25,3],[25,5,25,6],[25,19,25,20],[25,9,25,10],[24,11,24,12],[24,21,24,22],[25,21,25,22],[25,23,25,24],[26,5,26,6],[26,9,26,10],[26,11,26,12],[27,59,27,60],[27,53,27,54],[27,49,27,50],[27,51,27,52],[26,23,26,24],[26,39,26,40],[26,33,26,34],[26,29,26,30],[26,43,26,44],[26,59,26,60],[27,5,27,6],[27,19,27,20],[27,13,27,14],[27,9,27,10],[27,23,27,24],[27,21,27,22],[27,29,27,30],[27,11,27,12],[28,59,28,60],[28,21,28,22],[28,53,28,54],[28,49,28,50],[28,51,28,52],[28,23,28,24],[28,39,28,40],[28,33,28,34],[28,29,28,30],[28,31,28,32],[29,5,29,6],[29,19,29,20],[29,13,29,14],[29,9,29,10],[29,11,29,12],[28,1,28,3],[30,11,30,12],[29,23,29,24],[29,39,29,40],[29,33,29,34],[29,29,29,30],[29,31,29,32],[30,21,30,22],[30,23,30,24],[29,21,29,22],[28,5,28,6],[28,19,28,20],[28,13,28,14],[28,9,28,10],[28,11,28,12],[32,19,32,20],[32,13,32,14],[32,11,32,12],[31,23,31,24],[31,9,31,10],[31,11,31,12],[31,1,31,3],[31,5,31,6],[30,1,30,3],[30,5,30,6],[30,19,30,20],[30,13,30,14],[30,9,30,10],[32,9,32,10],[32,23,32,24],[29,53,29,54],[32,39,32,40],[32,33,32,34],[32,21,32,22],[33,1,33,3],[33,5,33,6],[33,19,33,20],[33,13,33,14],[33,9,33,10],[33,11,33,12],[33,33,33,34],[33,39,33,40],[33,23,33,24],[32,29,32,30],[32,31,32,32],[33,31,33,32],[33,21,33,22],[31,19,31,20],[31,13,31,14],[30,29,30,30],[30,31,30,32],[31,21,31,22],[32,1,32,3],[32,5,32,6],[0,0,0,69],[1,64,1,69],[33,49,33,50],[33,29,33,30],[33,53,33,54],[33,59,33,60],[33,43,33,44],[31,43,31,44],[31,59,31,60],[31,53,31,54],[32,59,32,60],[32,53,32,54],[32,49,32,50],[32,43,32,44],[32,41,32,42],[33,41,33,42],[31,29,31,30],[31,31,31,32],[30,59,30,60],[30,53,30,54],[30,49,30,50],[30,51,30,52],[30,41,30,42],[29,59,29,60]]}
[{"$f":"【準備】登録!D2&【準備】登録!E2&【準備】登録!F2&\"　\"&【準備】登録!G2&【準備】登録!I2&\"　　　\"&\"(\"&【準備】登録!K6&\"：\"&【準備】登録!D6&\")\"","v":"第8回　阪神奈対抗戦　　　(奈良：キングスポット)"}]
[null,null,null,null,null,null,null,null,null,null,null,null,null,null,null,null,null,null,null,null,null,null,null,null,null,null,null,null,null,null,null,null,null,null,null,null,null,null,null,null,null,null,null,null,null,null,null,null,null,null,null,null,null,null,null,null,null,null,null,null,null,null,null,null,{"$f":"【準備】登録!D4","v":"2015-10-25"}]
[]
[null,null,null,null,null,"第１節",null,null,null,null,null,null,null,null,null,null,null,null,null,null,null,null,null,"第２節",null,null,null,null,null,null,null,null,null,null,null,null,null,null,null,null,null,null,null,"第３節",null,null,null,null,null,null,null,null,null,null,null,null,null,null,null,null,null,null,null,"順","HR記録",null,null,null,null,null,null,"HR",null,null,"HR_Point","HR_Rank","氏名","クラブ","MAX",null,"途中経過"]
[{"$f":"IF(【準備】登録!B11=\"\",\"\",【準備】登録!B11)","v":"HRC"},"選手名",null,null,"持点",{"$f":"A25","v":"ORC"},null,"W","L","TP",null,"TP",null,{"$f":"A15","v":"NRC"},null,"W","L","W","L","TP",null,"TP",null,{"$f":"F5","v":"ORC"},null,"W","L","W","L","TP",null,"TP",null,{"$f":"N5","v":"NRC"},null,"W","L","W","L","TP",null,"TP",null,{"$f":"F5","v":"ORC"},null,"W","L","W","L","TP",null,"TP",null,{"$f":"N5","v":"NRC"},null,"W","L","W","L","TP",null,"TP",null,"R","1G","2G","3G","4G","5G","6G",null,"A","B","P",null,null,null,null,null,null,"W","L","TP","R_P",null,"HR_123","所　属","名 　前","HR_Rank","W","L","R_P"]
[null,{"$f":"IF(【準備】登録!$D$11=0,\"\",【準備】登録!$D$11)","v":"高木　俊行"},null,null,{"$f":"【準備】登録!F11","v":180},{"$f":"IF(【進行】結果入力表!F7=\"\",\"\",【進行】結果入力表!F7)","v":"w"},null,{"$f":"IF(F6=\"\",\"\",IF(F6=\"w\",1,0))","v":1},{"$f":"IF(F6=\"\",\"\",IF(F6=\"w\",0,1))","v":0},{"$f":"IF(F6=\"\",\"\",IF(F6=\"w\",E6,F6))","v":180},null,{"$f":"IF($F6=\"\",\"\",J6/$E6*180)","v":180},null,{"$f":"IF(【進行】結果入力表!F14=\"\",\"\",【進行】結果入力表!F14)","v":"w"},null,{"$f":"IF(N6=\"\",\"\",IF(N6=\"w\",1,0))","v":1},{"$f":"IF(N6=\"\",\"\",IF(N6=\"w\",0,1))","v":0},{"$f":"IF(N6=\"\",\"\",SUM(H6,P6))","v":2},{"$f":"IF(N6=\"\",\"\",SUM(I6,Q6))","v":0},{"$f":"IF(N6=\"\",\"\",IF(N6=\"w\",E6+J6,N6+J6))","v":360},null,{"$f":"IF($N6=\"\",\"\",T6/$E6*180)","v":360},null,{"$f":"IF(【進行】結果入力表!F30=\"\",\"\",【進行】結果入力表!F30)","v":10},null,{"$f":"IF(X6=\"\",\"\",IF(X6=\"w\",1,0))","v":0},{"$f":"IF(X6=\"\",\"\",IF(X6=\"w\",0,1))","v":1},{"$f":"IF(X6=\"\",\"\",SUM(R6,Z6))","v":2},{"$f":"IF(X6=\"\",\"\",SUM(S6,AA6))","v":1},{"$f":"IF(X6=\"\",\"\",IF(X6=\"w\",T6+E6,X6+T6))","v":370},null,{"$f":"IF($X6=\"\",\"\",AD6/$E6*180)","v":369.99999999999994},null,{"$f":"IF(【進行】結果入力表!F37=\"\",\"\",【進行】結果入力表!F37)","v":"w"},null,{"$f":"IF(AH6=\"\",\"\",IF(AH6=\"w\",1,0))","v":1},{"$f":"IF(AH6=\"\",\"\",IF(AH6=\"w\",0,1))","v":0},{"$f":"IF(AH6=\"\",\"\",SUM(AB6,AJ6))","v":3},{"$f":"IF(AH6=\"\",\"\",SUM(AC6,AK6))","v":1},{"$f":"IF(AH6=\"\",\"\",IF(AH6=\"w\",AD6+E6,AH6+AD6))","v":550},null,{"$f":"IF($AH6=\"\",\"\",AN6/$E6*180)","v":550},null,{"$f":"IF(【進行】結果入力表!F53=\"\",\"\",【進行】結果入力表!F53)","v":156},null,{"$f":"IF(AR6=\"\",\"\",IF(AR6=\"w\",1,0))","v":0},{"$f":"IF(AR6=\"\",\"\",IF(AR6=\"w\",0,1))","v":1},{"$f":"IF(AR6=\"\",\"\",IF(AR6=\"w\",AL6+1,AL6))","v":3},{"$f":"IF(AR6=\"\",\"\",IF(AR6=\"w\",AM6,AM6+1))","v":2},{"$f":"IF(AR6=\"\",\"\",IF(AR6=\"w\",AN6+E6,AR6+AN6))","v":706},null,{"$f":"IF($AR6=\"\",\"\",AX6/$E6*180)","v":706},null,{"$f":"IF(【進行】結果入力表!F60=\"\",\"\",【進行】結果入力表!F60)","v":"w"},null,{"$f":"IF(BB6=\"\",\"\",IF(BB6=\"w\",1,0))","v":1},{"$f":"IF(BB6=\"\",\"\",IF(BB6=\"w\",0,1))","v":0},{"$f":"IF(BB6=\"\",\"\",IF(BB6=\"w\",AV6+1,AV6))","v":4},{"$f":"IF(BB6=\"\",\"\",IF(BB6=\"w\",AW6,AW6+1))","v":2},{"$f":"IF(BB6=\"\",\"\",IF(BB6=\"w\",AX6+E6,BB6+AX6))","v":886},null,{"$f":"IF($BB6=\"\",\"\",BH6/$E6*180)","v":886},null,{"$f":"IF(SUM(H6:I6,R6:S6)=0,\"\",IF(B$13=\"\",RANK($CF$6:$CF$12,$CF$6:$CF$12,0),RANK($CF$6:$CF$13,$CF$6:$CF$13,0)))","v":4},{"$f":"IF(【進行】結果入力表!E7=\"\",\"\",【進行】結果入力表!E7)","v":106},{"$f":"IF(【進行】結果入力表!E14=\"\",\"\",【進行】結果入力表!E14)","v":""},{"$f":"IF(【進行】結果入力表!E30=\"\",\"\",【進行】結果入力表!E30)","v":""},{"$f":"IF(【進行】結果入力表!E37=\"\",\"\",【進行】結果入力表!E37)","v":""},{"$f":"IF(【進行】結果入力表!E53=\"\",\"\",【進行】結果入力表!E53)","v":""},{"$f":"IF(【進行】結果入力表!E60=\"\",\"\",【進行】結果入力表!E60)","v":""},null,{"$f":"COUNTIF($BM6:$BR6,BT$5)","v":0},0,{"$f":"MAX($BM6:$BR6)","v":106},{"$f":"BT6*10000+BU6*1000+BV6","v":106},{"$f":"RANK(BW6,$BW$6:$BW$33)","v":5},{"$f":"B6","v":"高木　俊行"},{"$f":"$A$5","v":"HRC"},{"$f":"IF(BT6>0,\"A\"&E6,IF(BU6>0,\"B\"&E6,BV6))","v":106},null,{"$f":"COUNTIF(F6:BC6,\"w\")","v":4},{"$f":"COUNT(F6,N6,AH6,X6,AR6,BB6)","v":2},{"$f":"CC6*180+SUM(F6,N6,AH6,X6,AR6,BB6)*180/E6","v":886},{"$f":"CC6*100000+CE6","v":400886},null,{"$f":"IF(ISERROR(RANK($CK6,$CK$6:$CK$8,1)),\"\",RANK($CK6,$CK$6:$CK$8,1))","v":1},{"$f":"A5","v":"HRC"},{"$f":"IF(ISERROR(VLOOKUP(1,BL6:CF13,14,FALSE)),\"\",VLOOKUP(1,BL6:CF13,14,FALSE))","v":"高山　普任"},{"$f":"IF(ISERROR(VLOOKUP(1,BL6:CF13,13,FALSE)),\"\",VLOOKUP(1,BL6:CF13,13,FALSE))","v":2},{"$f":"IF(ISERROR(VLOOKUP(1,BL6:CF13,18,FALSE)),\"\",VLOOKUP(1,BL6:CF13,18,FALSE))","v":5},{"$f":"IF(ISERROR(VLOOKUP(1,BL6:CF13,19,FALSE)),\"\",VLOOKUP(1,BL6:CF13,19,FALSE))","v":1},{"$f":"IF(ISERROR(VLOOKUP(1,BL6:CF13,20,FALSE)),\"\",VLOOKUP(1,BL6:CF13,21,FALSE))","v":501060}]
[null,{"$f":"IF(【準備】登録!$D$11=0,\"\",【準備】登録!$G$11)","v":"堂園　雅也"},null,null,{"$f":"【準備】登録!I11","v":180},{"$f":"IF(【進行】結果入力表!F8=\"\",\"\",【進行】結果入力表!F8)","v":"w"},null,1,0,180,null,180,null,{"$f":"IF(【進行】結果入力表!F15=\"\",\"\",【進行】結果入力表!F15)","v":137},null,0,1,1,1,317,null,317,null,{"$f":"IF(【進行】結果入力表!F31=\"\",\"\",【進行】結果入力表!F31)","v":35},null,0,1,1,2,352,null,352,null,{"$f":"IF(【進行】結果入力表!F38=\"\",\"\",【進行】結果入力表!F38)","v":"w"},null,1,0,2,2,532,null,532,null,{"$f":"IF(【進行】結果入力表!F54=\"\",\"\",【進行】結果入力表!F54)","v":"w"},null,1,0,3,2,712,null,712,null,{"$f":"IF(【進行】結果入力表!F61=\"\",\"\",【進行】結果入力表!F61)","v":"w"},null,1,0,4,2,892,null,892,null,3,{"$f":"IF(【進行】結果入力表!E8=\"\",\"\",【進行】結果入力表!E8)","v":""},{"$f":"IF(【進行】結果入力表!E15=\"\",\"\",【進行】結果入力表!E15)","v":""},{"$f":"IF(【進行】結果入力表!E31=\"\",\"\",【進行】結果入力表!E31)","v":""},{"$f":"IF(【進行】結果入力表!E38=\"\",\"\",【進行】結果入力表!E38)","v":""},{"$f":"IF(【進行】結果入力表!E54=\"\",\"\",【進行】結果入力表!E54)","v":125},{"$f":"IF(【進行】結果入力表!E61=\"\",\"\",【進行】結果入力表!E61)","v":""},null,0,0,125,125,1,"堂園　雅也","HRC",125,null,4,2,892,400892,null,{"$f":"IF(ISERROR(RANK($CK7,$CK$6:$CK$8,1)),\"\",RANK($CK7,$CK$6:$CK$8,1))","v":3},{"$f":"A15","v":"NRC"},{"$f":"IF(ISERROR(VLOOKUP(1,BL16:CF23,14,FALSE)),\"\",VLOOKUP(1,BL16:CF23,14,FALSE))","v":"吉向　翔平"},{"$f":"IF(ISERROR(VLOOKUP(1,BL16:CF23,13,FALSE)),\"\",VLOOKUP(1,BL16:CF23,13,FALSE))","v":6},{"$f":"IF(ISERROR(VLOOKUP(1,BL16:CF23,18,FALSE)),\"\",VLOOKUP(1,BL16:CF23,18,FALSE))","v":4},{"$f":"IF(ISERROR(VLOOKUP(1,BL16:CF23,19,FALSE)),\"\",VLOOKUP(1,BL16:CF23,19,FALSE))","v":2},{"$f":"IF(ISERROR(VLOOKUP(1,BL16:CF23,20,FALSE)),\"\",VLOOKUP(1,BL16:CF23,21,FALSE))","v":400849}]
[null,{"$f":"IF(【準備】登録!$D$11=0,\"\",【準備】登録!$J$11)","v":"菊川　博功"},null,null,{"$f":"【準備】登録!L11","v":180},{"$f":"IF(【進行】結果入力表!F9=\"\",\"\",【進行】結果入力表!F9)","v":"w"},null,1,0,180,null,180,null,{"$f":"IF(【進行】結果入力表!F16=\"\",\"\",【進行】結果入力表!F16)","v":"w"},null,1,0,2,0,360,null,360,null,{"$f":"IF(【進行】結果入力表!F32=\"\",\"\",【進行】結果入力表!F32)","v":29},null,0,1,2,1,389,null,389,null,{"$f":"IF(【進行】結果入力表!F39=\"\",\"\",【進行】結果入力表!F39)","v":"w"},null,1,0,3,1,569,null,569,null,{"$f":"IF(【進行】結果入力表!F55=\"\",\"\",【進行】結果入力表!F55)","v":"w"},null,1,0,4,1,749,null,749,null,{"$f":"IF(【進行】結果入力表!F62=\"\",\"\",【進行】結果入力表!F62)","v":"w"},null,1,0,5,1,929,null,929,null,2,{"$f":"IF(【進行】結果入力表!E9=\"\",\"\",【進行】結果入力表!E9)","v":""},{"$f":"IF(【進行】結果入力表!E16=\"\",\"\",【進行】結果入力表!E16)","v":""},{"$f":"IF(【進行】結果入力表!E32=\"\",\"\",【進行】結果入力表!E32)","v":""},{"$f":"IF(【進行】結果入力表!E39=\"\",\"\",【進行】結果入力表!E39)","v":""},{"$f":"IF(【進行】結果入力表!E55=\"\",\"\",【進行】結果入力表!E55)","v":""},{"$f":"IF(【進行】結果入力表!E62=\"\",\"\",【進行】結果入力表!E62)","v":""},null,0,0,0,0,6,"菊川　博功","HRC",0,null,5,1,929,500929,null,{"$f":"IF(ISERROR(RANK($CK8,$CK$6:$CK$8,1)),\"\",RANK($CK8,$CK$6:$CK$8,1))","v":2},{"$f":"A25","v":"ORC"},{"$f":"IF(ISERROR(VLOOKUP(1,BL26:CF33,14,FALSE)),\"\",VLOOKUP(1,BL26:CF33,14,FALSE))","v":"山岡　修二"},{"$f":"IF(ISERROR(VLOOKUP(1,BL26:CF33,13,FALSE)),\"\",VLOOKUP(1,BL26:CF33,13,FALSE))","v":4},{"$f":"IF(ISERROR(VLOOKUP(1,BL26:CF33,18,FALSE)),\"\",VLOOKUP(1,BL26:CF33,18,FALSE))","v":6},{"$f":"IF(ISERROR(VLOOKUP(1,BL26:CF33,19,FALSE)),\"\",VLOOKUP(1,BL26:CF33,19,FALSE))","v":0},{"$f":"IF(ISERROR(VLOOKUP(1,BL26:CF33,20,FALSE)),\"\",VLOOKUP(1,BL26:CF33,21,FALSE))","v":601080}]
[null,{"$f":"IF(【準備】登録!$D$11=0,\"\",【準備】登録!$M$11)","v":"丹羽　俊也"},null,null,{"$f":"【準備】登録!O11","v":180},{"$f":"IF(【進行】結果入力表!F10=\"\",\"\",【進行】結果入力表!F10)","v":103},null,0,1,103,null,103,null,{"$f":"IF(【進行】結果入力表!F17=\"\",\"\",【進行】結果入力表!F17)","v":87},null,0,1,0,2,190,null,190,null,{"$f":"IF(【進行】結果入力表!F33=\"\",\"\",【進行】結果入力表!F33)","v":149},null,0,1,0,3,339,null,339,null,{"$f":"IF(【進行】結果入力表!F40=\"\",\"\",【進行】結果入力表!F40)","v":157},null,0,1,0,4,496,null,496,null,{"$f":"IF(【進行】結果入力表!F49=\"\",\"\",【進行】結果入力表!F49)","v":"w"},null,1,0,1,4,676,null,676,null,{"$f":"IF(【進行】結果入力表!F56=\"\",\"\",【進行】結果入力表!F56)","v":"w"},null,1,0,2,4,856,null,856,null,5,{"$f":"IF(【進行】結果入力表!E10=\"\",\"\",【進行】結果入力表!E10)","v":""},{"$f":"IF(【進行】結果入力表!E17=\"\",\"\",【進行】結果入力表!E17)","v":""},{"$f":"IF(【進行】結果入力表!E33=\"\",\"\",【進行】結果入力表!E33)","v":""},{"$f":"IF(【進行】結果入力表!E40=\"\",\"\",【進行】結果入力表!E40)","v":""},{"$f":"IF(【進行】結果入力表!E49=\"\",\"\",【進行】結果入力表!E49)","v":""},{"$f":"IF(【進行】結果入力表!E56=\"\",\"\",【進行】結果入力表!E56)","v":""},null,0,0,0,0,6,"丹羽　俊也","HRC",0,null,2,4,856,200856]
[null,{"$f":"IF(【準備】登録!$D$11=0,\"\",【準備】登録!$P$11)","v":"高山　普任"},null,null,{"$f":"【準備】登録!R11","v":180},{"$f":"IF(【進行】結果入力表!F11=\"\",\"\",【進行】結果入力表!F11)","v":"w"},null,1,0,180,null,180,null,{"$f":"IF(【進行】結果入力表!F18=\"\",\"\",【進行】結果入力表!F18)","v":"w"},null,1,0,2,0,360,null,360,null,{"$f":"IF(【進行】結果入力表!F34=\"\",\"\",【進行】結果入力表!F34)","v":"w"},null,1,0,3,0,540,null,540,null,{"$f":"IF(【進行】結果入力表!F41=\"\",\"\",【進行】結果入力表!F41)","v":"w"},null,1,0,4,0,720,null,720,null,{"$f":"IF(【進行】結果入力表!F50=\"\",\"\",【進行】結果入力表!F50)","v":160},null,0,1,4,1,880,null,880.00000000000011,null,{"$f":"IF(【進行】結果入力表!F57=\"\",\"\",【進行】結果入力表!F57)","v":"w"},null,1,0,5,1,1060,null,1060,null,1,{"$f":"IF(【進行】結果入力表!E11=\"\",\"\",【進行】結果入力表!E11)","v":""},{"$f":"IF(【進行】結果入力表!E18=\"\",\"\",【進行】結果入力表!E18)","v":""},{"$f":"IF(【進行】結果入力表!E34=\"\",\"\",【進行】結果入力表!E34)","v":110},{"$f":"IF(【進行】結果入力表!E41=\"\",\"\",【進行】結果入力表!E41)","v":""},{"$f":"IF(【進行】結果入力表!E50=\"\",\"\",【進行】結果入力表!E50)","v":124},{"$f":"IF(【進行】結果入力表!E57=\"\",\"\",【進行】結果入力表!E57)","v":""},null,0,0,124,124,2,"高山　普任","HRC",124,null,5,1,1060,501060,null,null,null,"↓並び替え（総合結果表の表示用）"]
[null,{"$f":"IF(【準備】登録!$D$11=0,\"\",【準備】登録!$S$11)","v":"藤中健太郎"},null,null,{"$f":"【準備】登録!U11","v":180},{"$f":"IF(【進行】結果入力表!F12=\"\",\"\",【進行】結果入力表!F12)","v":150},null,0,1,150,null,150,null,{"$f":"IF(【進行】結果入力表!F19=\"\",\"\",【進行】結果入力表!F19)","v":"w"},null,1,0,1,1,330,null,330,null,{"$f":"IF(【進行】結果入力表!F28=\"\",\"\",【進行】結果入力表!F28)","v":39},null,0,1,1,2,369,null,368.99999999999994,null,{"$f":"IF(【進行】結果入力表!F35=\"\",\"\",【進行】結果入力表!F35)","v":66},null,0,1,1,3,435,null,435,null,{"$f":"IF(【進行】結果入力表!F51=\"\",\"\",【進行】結果入力表!F51)","v":2},null,0,1,1,4,437,null,436.99999999999994,null,{"$f":"IF(【進行】結果入力表!F58=\"\",\"\",【進行】結果入力表!F58)","v":3},null,0,1,1,5,440,null,440.00000000000006,null,7,{"$f":"IF(【進行】結果入力表!E12=\"\",\"\",【進行】結果入力表!E12)","v":""},{"$f":"IF(【進行】結果入力表!E19=\"\",\"\",【進行】結果入力表!E19)","v":""},{"$f":"IF(【進行】結果入力表!E28=\"\",\"\",【進行】結果入力表!E28)","v":""},{"$f":"IF(【進行】結果入力表!E35=\"\",\"\",【進行】結果入力表!E35)","v":""},{"$f":"IF(【進行】結果入力表!E51=\"\",\"\",【進行】結果入力表!E51)","v":""},{"$f":"IF(【進行】結果入力表!E58=\"\",\"\",【進行】結果入力表!E58)","v":""},null,0,0,0,0,6,"藤中健太郎","HRC",0,null,1,5,440,100440]
[null,{"$f":"IF(【準備】登録!$D$11=0,\"\",【準備】登録!$V$11)","v":"中平　美輪"},null,null,{"$f":"【準備】登録!X11","v":140},{"$f":"IF(【進行】結果入力表!F13=\"\",\"\",【進行】結果入力表!F13)","v":"w"},null,1,0,140,null,180,null,{"$f":"IF(【進行】結果入力表!F20=\"\",\"\",【進行】結果入力表!F20)","v":"w"},null,1,0,2,0,280,null,360,null,{"$f":"IF(【進行】結果入力表!F29=\"\",\"\",【進行】結果入力表!F29)","v":97},null,0,1,2,1,377,null,484.71428571428578,null,{"$f":"IF(【進行】結果入力表!F36=\"\",\"\",【進行】結果入力表!F36)","v":45},null,0,1,2,2,422,null,542.57142857142856,null,{"$f":"IF(【進行】結果入力表!F52=\"\",\"\",【進行】結果入力表!F52)","v":10},null,0,1,2,3,432,null,555.42857142857144,null,{"$f":"IF(【進行】結果入力表!F59=\"\",\"\",【進行】結果入力表!F59)","v":56},null,0,1,2,4,488,null,627.42857142857144,null,6,{"$f":"IF(【進行】結果入力表!E13=\"\",\"\",【進行】結果入力表!E13)","v":""},{"$f":"IF(【進行】結果入力表!E20=\"\",\"\",【進行】結果入力表!E20)","v":""},{"$f":"IF(【進行】結果入力表!E29=\"\",\"\",【進行】結果入力表!E29)","v":""},{"$f":"IF(【進行】結果入力表!E36=\"\",\"\",【進行】結果入力表!E36)","v":""},{"$f":"IF(【進行】結果入力表!E52=\"\",\"\",【進行】結果入力表!E52)","v":""},{"$f":"IF(【進行】結果入力表!E59=\"\",\"\",【進行】結果入力表!E59)","v":""},null,0,0,0,0,6,"中平　美輪","HRC",0,null,2,4,627.42857142857144,200627.42857142858]
[]
[null,"Total",null,null,null,null,null,{"$f":"IF(COUNTBLANK(H6:H13)=8,\"\",SUM(H6:H13))","v":5},{"$f":"IF(COUNTBLANK(I6:I13)=8,\"\",SUM(I6:I13))","v":2},{"$f":"IF($B6=\"\",\"\",SUM(J6:J13))","v":1113},{"$f":"IF($B6=\"\",\"\",SUM(K6:K13))","v":0},{"$f":"IF(COUNTBLANK(L6:L13)=8,\"\",SUM(L6:L13))","v":1153},{"$f":"IF($B6=\"\",\"\",SUM(M6:M13))","v":0},null,null,{"$f":"SUM(P6:P13)","v":5},{"$f":"SUM(Q6:Q13)","v":2},{"$f":"IF(COUNTBLANK(R6:R13)=8,\"\",SUM(H14,P14))","v":10},{"$f":"IF(COUNTBLANK(S6:S13)=8,\"\",SUM(I14,Q14))","v":4},{"$f":"IF($B6=\"\",\"\",SUM(T6:T13))","v":2197},{"$f":"IF($B6=\"\",\"\",SUM(U6:U13))","v":0},{"$f":"IF(COUNTBLANK(V6:V13)=8,\"\",SUM(V6:V13))","v":2277},{"$f":"IF($B6=\"\",\"\",SUM(W6:W13))","v":0},null,null,{"$f":"SUM(Z6:Z13)","v":1},{"$f":"SUM(AA6:AA13)","v":6},{"$f":"IF(COUNTBLANK(AB6:AB13)=8,\"\",SUM(R14,Z14))","v":11},{"$f":"IF(COUNTBLANK(AC6:AC13)=8,\"\",SUM(S14,AA14))","v":10},{"$f":"IF($B6=\"\",\"\",SUM(AD6:AD13))","v":2736},{"$f":"IF($B6=\"\",\"\",SUM(AE6:AE13))","v":0},{"$f":"IF(COUNTBLANK(AF6:AF13)=8,\"\",SUM(AF6:AF13))","v":2843.7142857142858},{"$f":"IF($B6=\"\",\"\",SUM(AG6:AG13))","v":0},null,null,{"$f":"SUM(AJ6:AJ13)","v":4},{"$f":"SUM(AK6:AK13)","v":3},{"$f":"IF(COUNTBLANK(AL6:AL13)=8,\"\",SUM(AB14,AJ14))","v":15},{"$f":"IF(COUNTBLANK(AM6:AM13)=8,\"\",SUM(AC14,AK14))","v":13},{"$f":"IF($B6=\"\",\"\",SUM(AN6:AN13))","v":3724},{"$f":"IF($B6=\"\",\"\",SUM(AO6:AO13))","v":0},{"$f":"IF(COUNTBLANK(AP6:AP13)=8,\"\",SUM(AP6:AP13))","v":3844.5714285714284},{"$f":"IF($B6=\"\",\"\",SUM(AQ6:AQ13))","v":0},null,null,{"$f":"SUM(AT6:AT13)","v":3},{"$f":"SUM(AU6:AU13)","v":4},{"$f":"IF(COUNTBLANK(AV6:AV13)=8,\"\",SUM(AL14,AT14))","v":18},{"$f":"IF(COUNTBLANK(AW6:AW13)=8,\"\",SUM(AM14,AU14))","v":17},{"$f":"IF($B6=\"\",\"\",SUM(AX6:AX13))","v":4592},{"$f":"IF($B6=\"\",\"\",SUM(AY6:AY13))","v":0},{"$f":"IF(COUNTBLANK(AZ6:AZ13)=8,\"\",SUM(AZ6:AZ13))","v":4715.4285714285716},{"$f":"IF($B6=\"\",\"\",SUM(BA6:BA13))","v":0},null,null,{"$f":"SUM(BD6:BD13)","v":5},{"$f":"SUM(BE6:BE13)","v":2},{"$f":"IF(COUNTBLANK(BF6:BF13)=8,\"\",SUM(AV14,BD14))","v":23},{"$f":"IF(COUNTBLANK(BG6:BG13)=8,\"\",SUM(AW14,BE14))","v":19},{"$f":"IF(COUNTIF(BH6:BI13,\"\")=16,\"\",SUM(BH6:BH13))","v":5551},{"$f":"IF($B6=\"\",\"\",SUM(BI6:BI13))","v":0},{"$f":"IF(COUNTBLANK(BJ6:BJ13)=8,\"\",SUM(BJ6:BJ13))","v":5690.4285714285716},{"$f":"IF($B6=\"\",\"\",SUM(BK6:BK13))","v":0},null,null,null,null,null,null,null,null,null,null,null,null,null,null,null,null,null,{"$f":"SUM(CC6:CC13)","v":23},{"$f":"SUM(CD6:CD13)","v":19},{"$f":"SUM(CE6:CE13)","v":5690.4285714285716},{"$f":"SUM(CF6:CF13)","v":2305690.4285714286}]
[{"$f":"IF(【準備】登録!B12=\"\",\"\",【準備】登録!B12)","v":"NRC"},{"$f":"B5","v":"選手名"},null,null,{"$f":"E5","v":"持点"},{"$f":"A5","v":"HRC"},null,"W","L","TP",null,"TP",null,{"$f":"A25","v":"ORC"},null,"W","L","W","L","TP",null,"TP",null,{"$f":"A5","v":"HRC"},null,"W","L","W","L","TP",null,"TP",null,{"$f":"A25","v":"ORC"},null,"W","L","W","L","TP",null,"TP",null,{"$f":"A5","v":"HRC"},null,"W","L","W","L","TP",null,"TP",null,{"$f":"A25","v":"ORC"},null,"W","L","W","L","TP",null,"TP",null,"R",{"$f":"BM$5","v":"1G"},"2G","3G","4G","5G","6G",null,null,null,null,null,null,null,null,null,null,{"$f":"CC$5","v":"W"},{"$f":"CD$5","v":"L"},{"$f":"CE$5","v":"TP"},{"$f":"CF$5","v":"R_P"},null,null,"所　属","名 　前",null,"W","L","R_P"]
[null,{"$f":"IF(【準備】登録!$D$11=0,\"\",【準備】登録!$D$12)","v":"吉向　翔平"},null,null,{"$f":"【準備】登録!F12","v":180},{"$f":"IF(【進行】結果入力表!G14=\"\",\"\",【進行】結果入力表!G14)","v":96},null,{"$f":"IF(F16=\"\",\"\",IF(F16=\"w\",1,0))","v":0},{"$f":"IF(F16=\"\",\"\",IF(F16=\"w\",0,1))","v":1},{"$f":"IF(F16=\"\",\"\",IF(F16=\"w\",E16,F16))","v":96},null,{"$f":"IF($F16=\"\",\"\",J16/$E16*180)","v":96},null,{"$f":"IF(【進行】結果入力表!F21=\"\",\"\",【進行】結果入力表!F21)","v":"w"},null,{"$f":"IF(N16=\"\",\"\",IF(N16=\"w\",1,0))","v":1},{"$f":"IF(N16=\"\",\"\",IF(N16=\"w\",0,1))","v":0},{"$f":"IF(N16=\"\",\"\",SUM(H16,P16))","v":1},{"$f":"IF(N16=\"\",\"\",SUM(I16,Q16))","v":1},{"$f":"IF(N16=\"\",\"\",IF(N16=\"w\",E16+J16,N16+J16))","v":276},null,{"$f":"IF($N16=\"\",\"\",T16/$E16*180)","v":276},null,{"$f":"IF(【進行】結果入力表!G36=\"\",\"\",【進行】結果入力表!G36)","v":"w"},null,{"$f":"IF(X16=\"\",\"\",IF(X16=\"w\",1,0))","v":1},{"$f":"IF(X16=\"\",\"\",IF(X16=\"w\",0,1))","v":0},{"$f":"IF(X16=\"\",\"\",SUM(R16,Z16))","v":2},{"$f":"IF(X16=\"\",\"\",SUM(S16,AA16))","v":1},{"$f":"IF(X16=\"\",\"\",IF(X16=\"w\",T16+E16,X16+T16))","v":456},null,{"$f":"IF($X16=\"\",\"\",AD16/$E16*180)","v":456},null,{"$f":"IF(【進行】結果入力表!F43=\"\",\"\",【進行】結果入力表!F43)","v":"w"},null,{"$f":"IF(AH16=\"\",\"\",IF(AH16=\"w\",1,0))","v":1},{"$f":"IF(AH16=\"\",\"\",IF(AH16=\"w\",0,1))","v":0},{"$f":"IF(AH16=\"\",\"\",SUM(AB16,AJ16))","v":3},{"$f":"IF(AH16=\"\",\"\",SUM(AC16,AK16))","v":1},{"$f":"IF(AH16=\"\",\"\",IF(AH16=\"w\",AD16+E16,AH16+AD16))","v":636},null,{"$f":"IF($AH16=\"\",\"\",AN16/$E16*180)","v":636},null,{"$f":"IF(【進行】結果入力表!G58=\"\",\"\",【進行】結果入力表!G58)","v":"w"},null,{"$f":"IF(AR16=\"\",\"\",IF(AR16=\"w\",1,0))","v":1},{"$f":"IF(AR16=\"\",\"\",IF(AR16=\"w\",0,1))","v":0},{"$f":"IF(AR16=\"\",\"\",IF(AR16=\"w\",AL16+1,AL16))","v":4},{"$f":"IF(AR16=\"\",\"\",IF(AR16=\"w\",AM16,AM16+1))","v":1},{"$f":"IF(AR16=\"\",\"\",IF(AR16=\"w\",AN16+E16,AR16+AN16))","v":816},null,{"$f":"IF($AR16=\"\",\"\",AX16/$E16*180)","v":816},null,{"$f":"IF(【進行】結果入力表!F65=\"\",\"\",【進行】結果入力表!F65)","v":33},null,{"$f":"IF(BB16=\"\",\"\",IF(BB16=\"w\",1,0))","v":0},{"$f":"IF(BB16=\"\",\"\",IF(BB16=\"w\",0,1))","v":1},{"$f":"IF(BB16=\"\",\"\",IF(BB16=\"w\",AV16+1,AV16))","v":4},{"$f":"IF(BB16=\"\",\"\",IF(BB16=\"w\",AW16,AW16+1))","v":2},{"$f":"IF(BB16=\"\",\"\",IF(BB16=\"w\",AX16+E16,BB16+AX16))","v":849},null,{"$f":"IF($BB16=\"\",\"\",BH16/$E16*180)","v":849},null,{"$f":"IF(SUM(H16:I16,R16:S16)=0,\"\",IF(B$13=\"\",RANK($CF$16:$CF$22,$CF$16:$CF$22,0),RANK($CF$16:$CF$23,$CF$16:$CF$23,0)))","v":1},{"$f":"IF(【進行】結果入力表!H14=\"\",\"\",【進行】結果入力表!H14)","v":""},{"$f":"IF(【進行】結果入力表!E21=\"\",\"\",【進行】結果入力表!E21)","v":""},{"$f":"IF(【進行】結果入力表!H36=\"\",\"\",【進行】結果入力表!H36)","v":""},{"$f":"IF(【進行】結果入力表!E43=\"\",\"\",【進行】結果入力表!E43)","v":""},{"$f":"IF(【進行】結果入力表!H58=\"\",\"\",【進行】結果入力表!H58)","v":""},{"$f":"IF(【進行】結果入力表!E65=\"\",\"\",【進行】結果入力表!E65)","v":""},null,{"$f":"COUNTIF($BM16:$BR16,BT$5)","v":0},0,{"$f":"MAX($BM16:$BR16)","v":0},{"$f":"BT16*10000+BU16*1000+BV16","v":0},{"$f":"RANK(BW16,$BW$6:$BW$33)","v":6},{"$f":"B16","v":"吉向　翔平"},{"$f":"$A$15","v":"NRC"},{"$f":"IF(BT16>0,\"A\"&E16,IF(BU16>0,\"B\"&E16,BV16))","v":0},null,{"$f":"COUNTIF(F16:BC16,\"w\")","v":4},{"$f":"COUNT(F16,N16,AH16,X16,AR16,BB16)","v":2},{"$f":"CC16*180+SUM(F16,N16,AH16,X16,AR16,BB16)*180/E16","v":849},{"$f":"CC16*100000+CE16","v":400849},null,"MVP",{"$f":"IF($CN16=\"\",\"\",INDEX($CH$6:$CN$8,MATCH($CN16,$CN$6:$CN$8,0),2))","v":"ORC"},{"$f":"INDEX($CH$6:$CN$8,MATCH($CN16,$CN$6:$CN$8,0),3)","v":"山岡　修二"},null,{"$f":"INDEX($CH$6:$CN$8,MATCH($CN16,$CN$6:$CN$8,0),5)","v":6},{"$f":"INDEX($CH$6:$CN$8,MATCH($CN16,$CN$6:$CN$8,0),6)","v":0},{"$f":"IF(ISERROR(LARGE($CN$6:$CN$8,1)),\"\",LARGE($CN$6:$CN$8,1))","v":601080}]
[null,{"$f":"IF(【準備】登録!$D$11=0,\"\",【準備】登録!$G$12)","v":"近藤　拓馬"},null,null,{"$f":"【準備】登録!I12","v":180},{"$f":"IF(【進行】結果入力表!G15=\"\",\"\",【進行】結果入力表!G15)","v":"w"},null,1,0,180,null,180,null,{"$f":"IF(【進行】結果入力表!F22=\"\",\"\",【進行】結果入力表!F22)","v":"w"},null,1,0,2,0,360,null,360,null,{"$f":"IF(【進行】結果入力表!G37=\"\",\"\",【進行】結果入力表!G37)","v":110},null,0,1,2,1,470,null,470,null,{"$f":"IF(【進行】結果入力表!F44=\"\",\"\",【進行】結果入力表!F44)","v":115},null,0,1,2,2,585,null,585,null,{"$f":"IF(【進行】結果入力表!G59=\"\",\"\",【進行】結果入力表!G59)","v":"w"},null,1,0,3,2,765,null,765,null,{"$f":"IF(【進行】結果入力表!F66=\"\",\"\",【進行】結果入力表!F66)","v":67},null,0,1,3,3,832,null,831.99999999999989,null,2,{"$f":"IF(【進行】結果入力表!H15=\"\",\"\",【進行】結果入力表!H15)","v":""},{"$f":"IF(【進行】結果入力表!E22=\"\",\"\",【進行】結果入力表!E22)","v":""},{"$f":"IF(【進行】結果入力表!H37=\"\",\"\",【進行】結果入力表!H37)","v":""},{"$f":"IF(【進行】結果入力表!E44=\"\",\"\",【進行】結果入力表!E44)","v":""},{"$f":"IF(【進行】結果入力表!H59=\"\",\"\",【進行】結果入力表!H59)","v":""},{"$f":"IF(【進行】結果入力表!E66=\"\",\"\",【進行】結果入力表!E66)","v":""},null,0,0,0,0,6,"近藤　拓馬","NRC",0,null,3,3,832,300832,null,"VP",{"$f":"IF($CN17=\"\",\"\",INDEX($CH$6:$CN$8,MATCH($CN17,$CN$6:$CN$8,0),2))","v":"HRC"},{"$f":"INDEX($CH$6:$CN$8,MATCH($CN17,$CN$6:$CN$8,0),3)","v":"高山　普任"},null,{"$f":"INDEX($CH$6:$CN$8,MATCH($CN17,$CN$6:$CN$8,0),5)","v":5},{"$f":"INDEX($CH$6:$CN$8,MATCH($CN17,$CN$6:$CN$8,0),6)","v":1},{"$f":"IF(ISERROR(LARGE($CN$6:$CN$8,2)),\"\",LARGE($CN$6:$CN$8,2))","v":501060}]
[null,{"$f":"IF(【準備】登録!$D$11=0,\"\",【準備】登録!$J$12)","v":"金澤　茂昌"},null,null,{"$f":"【準備】登録!L12","v":180},{"$f":"IF(【進行】結果入力表!G16=\"\",\"\",【進行】結果入力表!G16)","v":115},null,0,1,115,null,114.99999999999999,null,{"$f":"IF(【進行】結果入力表!F23=\"\",\"\",【進行】結果入力表!F23)","v":1},null,0,1,0,2,116,null,116.00000000000001,null,{"$f":"IF(【進行】結果入力表!G38=\"\",\"\",【進行】結果入力表!G38)","v":135},null,0,1,0,3,251,null,251,null,{"$f":"IF(【進行】結果入力表!F45=\"\",\"\",【進行】結果入力表!F45)","v":104},null,0,1,0,4,355,null,355,null,{"$f":"IF(【進行】結果入力表!G60=\"\",\"\",【進行】結果入力表!G60)","v":142},null,0,1,0,5,497,null,497,null,{"$f":"IF(【進行】結果入力表!F67=\"\",\"\",【進行】結果入力表!F67)","v":"w"},null,1,0,1,5,677,null,677,null,5,{"$f":"IF(【進行】結果入力表!H16=\"\",\"\",【進行】結果入力表!H16)","v":""},{"$f":"IF(【進行】結果入力表!E23=\"\",\"\",【進行】結果入力表!E23)","v":""},{"$f":"IF(【進行】結果入力表!H38=\"\",\"\",【進行】結果入力表!H38)","v":""},{"$f":"IF(【進行】結果入力表!E45=\"\",\"\",【進行】結果入力表!E45)","v":""},{"$f":"IF(【進行】結果入力表!H60=\"\",\"\",【進行】結果入力表!H60)","v":""},{"$f":"IF(【進行】結果入力表!E67=\"\",\"\",【進行】結果入力表!E67)","v":""},null,0,0,0,0,6,"金澤　茂昌","NRC",0,null,1,5,677,100677,null,"VP",{"$f":"IF($CN18=\"\",\"\",INDEX($CH$6:$CN$8,MATCH($CN18,$CN$6:$CN$8,0),2))","v":"NRC"},{"$f":"INDEX($CH$6:$CN$8,MATCH($CN18,$CN$6:$CN$8,0),3)","v":"吉向　翔平"},null,{"$f":"INDEX($CH$6:$CN$8,MATCH($CN18,$CN$6:$CN$8,0),5)","v":4},{"$f":"INDEX($CH$6:$CN$8,MATCH($CN18,$CN$6:$CN$8,0),6)","v":2},{"$f":"IF(ISERROR(LARGE($CN$6:$CN$8,3)),\"\",LARGE($CN$6:$CN$8,3))","v":400849}]
[null,{"$f":"IF(【準備】登録!$D$11=0,\"\",【準備】登録!$M$12)","v":"斉藤　裕児"},null,null,{"$f":"【準備】登録!O12","v":180},{"$f":"IF(【進行】結果入力表!G17=\"\",\"\",【進行】結果入力表!G17)","v":"w"},null,1,0,180,null,180,null,{"$f":"IF(【進行】結果入力表!F24=\"\",\"\",【進行】結果入力表!F24)","v":82},null,0,1,1,1,262,null,262,null,{"$f":"IF(【進行】結果入力表!G39=\"\",\"\",【進行】結果入力表!G39)","v":138},null,0,1,1,2,400,null,400,null,{"$f":"IF(【進行】結果入力表!F46=\"\",\"\",【進行】結果入力表!F46)","v":100},null,0,1,1,3,500,null,500,null,{"$f":"IF(【進行】結果入力表!G61=\"\",\"\",【進行】結果入力表!G61)","v":36},null,0,1,1,4,536,null,536,null,{"$f":"IF(【進行】結果入力表!F68=\"\",\"\",【進行】結果入力表!F68)","v":"w"},null,1,0,2,4,716,null,716,null,3,{"$f":"IF(【進行】結果入力表!H17=\"\",\"\",【進行】結果入力表!H17)","v":""},{"$f":"IF(【進行】結果入力表!E24=\"\",\"\",【進行】結果入力表!E24)","v":""},{"$f":"IF(【進行】結果入力表!H39=\"\",\"\",【進行】結果入力表!H39)","v":""},{"$f":"IF(【進行】結果入力表!E46=\"\",\"\",【進行】結果入力表!E46)","v":""},{"$f":"IF(【進行】結果入力表!H61=\"\",\"\",【進行】結果入力表!H61)","v":""},{"$f":"IF(【進行】結果入力表!E68=\"\",\"\",【進行】結果入力表!E68)","v":""},null,0,0,0,0,6,"斉藤　裕児","NRC",0,null,2,4,716,200716]
[null,{"$f":"IF(【準備】登録!$D$11=0,\"\",【準備】登録!$P$12)","v":"岩本　剛"},null,null,{"$f":"【準備】登録!R12","v":180},{"$f":"IF(【進行】結果入力表!G18=\"\",\"\",【進行】結果入力表!G18)","v":74},null,0,1,74,null,74,null,{"$f":"IF(【進行】結果入力表!F25=\"\",\"\",【進行】結果入力表!F25)","v":93},null,0,1,0,2,167,null,167,null,{"$f":"IF(【進行】結果入力表!G40=\"\",\"\",【進行】結果入力表!G40)","v":"w"},null,1,0,1,2,347,null,347,null,{"$f":"IF(【進行】結果入力表!F47=\"\",\"\",【進行】結果入力表!F47)","v":103},null,0,1,1,3,450,null,450,null,{"$f":"IF(【進行】結果入力表!G62=\"\",\"\",【進行】結果入力表!G62)","v":82},null,0,1,1,4,532,null,532,null,{"$f":"IF(【進行】結果入力表!F69=\"\",\"\",【進行】結果入力表!F69)","v":124},null,0,1,1,5,656,null,656,null,6,{"$f":"IF(【進行】結果入力表!H18=\"\",\"\",【進行】結果入力表!H18)","v":""},{"$f":"IF(【進行】結果入力表!E25=\"\",\"\",【進行】結果入力表!E25)","v":""},{"$f":"IF(【進行】結果入力表!H40=\"\",\"\",【進行】結果入力表!H40)","v":""},{"$f":"IF(【進行】結果入力表!E47=\"\",\"\",【進行】結果入力表!E47)","v":""},{"$f":"IF(【進行】結果入力表!H62=\"\",\"\",【進行】結果入力表!H62)","v":""},{"$f":"IF(【進行】結果入力表!E69=\"\",\"\",【進行】結果入力表!E69)","v":""},null,0,0,0,0,6,"岩本　剛","NRC",0,null,1,5,656,100656,null,null,"所　属","名 　前",null,null,null,"最高HR"]
[null,{"$f":"IF(【準備】登録!$D$11=0,\"\",【準備】登録!$S$12)","v":"植田　慎也"},null,null,{"$f":"【準備】登録!U12","v":180},{"$f":"IF(【進行】結果入力表!G19=\"\",\"\",【進行】結果入力表!G19)","v":36},null,0,1,36,null,36,null,{"$f":"IF(【進行】結果入力表!F26=\"\",\"\",【進行】結果入力表!F26)","v":"w"},null,1,0,1,1,216,null,216,null,{"$f":"IF(【進行】結果入力表!G41=\"\",\"\",【進行】結果入力表!G41)","v":86},null,0,1,1,2,302,null,302,null,{"$f":"IF(【進行】結果入力表!F48=\"\",\"\",【進行】結果入力表!F48)","v":123},null,0,1,1,3,425,null,425,null,{"$f":"IF(【進行】結果入力表!G56=\"\",\"\",【進行】結果入力表!G56)","v":76},null,0,1,1,4,501,null,501,null,{"$f":"IF(【進行】結果入力表!F63=\"\",\"\",【進行】結果入力表!F63)","v":"w"},null,1,0,2,4,681,null,681,null,4,{"$f":"IF(【進行】結果入力表!H19=\"\",\"\",【進行】結果入力表!H19)","v":""},{"$f":"IF(【進行】結果入力表!E26=\"\",\"\",【進行】結果入力表!E26)","v":""},{"$f":"IF(【進行】結果入力表!H41=\"\",\"\",【進行】結果入力表!H41)","v":""},{"$f":"IF(【進行】結果入力表!E48=\"\",\"\",【進行】結果入力表!E48)","v":""},{"$f":"IF(【進行】結果入力表!H56=\"\",\"\",【進行】結果入力表!H56)","v":""},{"$f":"IF(【進行】結果入力表!E63=\"\",\"\",【進行】結果入力表!E63)","v":""},null,0,0,0,0,6,"植田　慎也","NRC",0,null,2,4,681,200681,null,"HR",{"$f":"IF(CN21 = \"\",\"\",INDEX($BY$6:$CA$33,MATCH($CN21,$CA$6:$CA$33,0),2))","v":"HRC"},{"$f":"IF(CN21 = \"\",\"\",INDEX($BY$6:$CA$33,MATCH($CN21,$CA$6:$CA$33,0),1))","v":"堂園　雅也"},null,null,null,{"$f":"IF(LARGE($CA$6:$CA$33,1) >= 100,LARGE($CA$6:$CA$33,1),\"\")","v":125}]
[null,{"$f":"IF(【準備】登録!$D$11=0,\"\",【準備】登録!$V$12)","v":"宮野　早織"},null,null,{"$f":"【準備】登録!X12","v":140},{"$f":"IF(【進行】結果入力表!G20=\"\",\"\",【進行】結果入力表!G20)","v":92},null,0,1,92,null,118.28571428571429,null,{"$f":"IF(【進行】結果入力表!F27=\"\",\"\",【進行】結果入力表!F27)","v":77},null,0,1,0,2,169,null,217.28571428571428,null,{"$f":"IF(【進行】結果入力表!G35=\"\",\"\",【進行】結果入力表!G35)","v":"w"},null,1,0,1,2,309,null,397.28571428571433,null,{"$f":"IF(【進行】結果入力表!F42=\"\",\"\",【進行】結果入力表!F42)","v":56},null,0,1,1,3,365,null,469.28571428571428,null,{"$f":"IF(【進行】結果入力表!G57=\"\",\"\",【進行】結果入力表!G57)","v":75},null,0,1,1,4,440,null,565.71428571428567,null,{"$f":"IF(【進行】結果入力表!F64=\"\",\"\",【進行】結果入力表!F64)","v":9},null,0,1,1,5,449,null,577.28571428571433,null,7,{"$f":"IF(【進行】結果入力表!H20=\"\",\"\",【進行】結果入力表!H20)","v":""},{"$f":"IF(【進行】結果入力表!E27=\"\",\"\",【進行】結果入力表!E27)","v":""},{"$f":"IF(【進行】結果入力表!H35=\"\",\"\",【進行】結果入力表!H35)","v":""},{"$f":"IF(【進行】結果入力表!E42=\"\",\"\",【進行】結果入力表!E42)","v":""},{"$f":"IF(【進行】結果入力表!H57=\"\",\"\",【進行】結果入力表!H57)","v":""},{"$f":"IF(【進行】結果入力表!E64=\"\",\"\",【進行】結果入力表!E64)","v":""},null,0,0,0,0,6,"宮野　早織","NRC",0,null,1,5,577.28571428571422,100577.28571428571]
[]
[null,"Total",null,null,null,null,null,{"$f":"IF(COUNTBLANK(H16:H23)=8,\"\",SUM(H16:H23))","v":2},{"$f":"IF(COUNTBLANK(I16:I23)=8,\"\",SUM(I16:I23))","v":5},{"$f":"IF($B16=\"\",\"\",SUM(J16:J23))","v":773},{"$f":"IF($B16=\"\",\"\",SUM(K16:K23))","v":0},{"$f":"IF(COUNTBLANK(L16:L23)=8,\"\",SUM(L16:L23))","v":799.28571428571433},{"$f":"IF($B16=\"\",\"\",SUM(M16:M23))","v":0},null,null,{"$f":"SUM(P16:P23)","v":3},{"$f":"SUM(Q16:Q23)","v":4},{"$f":"IF(COUNTBLANK(R16:R23)=8,\"\",SUM(H24,P24))","v":5},{"$f":"IF(COUNTBLANK(S16:S23)=8,\"\",SUM(I24,Q24))","v":9},{"$f":"IF($B16=\"\",\"\",SUM(T16:T23))","v":1566},{"$f":"IF($B16=\"\",\"\",SUM(U16:U23))","v":0},{"$f":"IF(COUNTBLANK(V16:V23)=8,\"\",SUM(V16:V23))","v":1614.2857142857142},{"$f":"IF($B16=\"\",\"\",SUM(W16:W23))","v":0},null,null,{"$f":"SUM(Z16:Z23)","v":3},{"$f":"SUM(AA16:AA23)","v":4},{"$f":"IF(COUNTBLANK(AB16:AB23)=8,\"\",SUM(R24,Z24))","v":8},{"$f":"IF(COUNTBLANK(AC16:AC23)=8,\"\",SUM(S24,AA24))","v":13},{"$f":"IF($B16=\"\",\"\",SUM(AD16:AD23))","v":2535},{"$f":"IF($B16=\"\",\"\",SUM(AE16:AE23))","v":0},{"$f":"IF(COUNTBLANK(AF16:AF23)=8,\"\",SUM(AF16:AF23))","v":2623.2857142857142},{"$f":"IF($B16=\"\",\"\",SUM(AG16:AG23))","v":0},null,null,{"$f":"SUM(AJ16:AJ23)","v":1},{"$f":"SUM(AK16:AK23)","v":6},{"$f":"IF(COUNTBLANK(AL16:AL23)=8,\"\",SUM(AB24,AJ24))","v":9},{"$f":"IF(COUNTBLANK(AM16:AM23)=8,\"\",SUM(AC24,AK24))","v":19},{"$f":"IF($B16=\"\",\"\",SUM(AN16:AN23))","v":3316},{"$f":"IF($B16=\"\",\"\",SUM(AO16:AO23))","v":0},{"$f":"IF(COUNTBLANK(AP16:AP23)=8,\"\",SUM(AP16:AP23))","v":3420.2857142857142},{"$f":"IF($B16=\"\",\"\",SUM(AQ16:AQ23))","v":0},null,null,{"$f":"SUM(AT16:AT23)","v":2},{"$f":"SUM(AU16:AU23)","v":5},{"$f":"IF(COUNTBLANK(AV16:AV23)=8,\"\",SUM(AL24,AT24))","v":11},{"$f":"IF(COUNTBLANK(AW16:AW23)=8,\"\",SUM(AM24,AU24))","v":24},{"$f":"IF($B16=\"\",\"\",SUM(AX16:AX23))","v":4087},{"$f":"IF($B16=\"\",\"\",SUM(AY16:AY23))","v":0},{"$f":"IF(COUNTBLANK(AZ16:AZ23)=8,\"\",SUM(AZ16:AZ23))","v":4212.7142857142853},{"$f":"IF($B16=\"\",\"\",SUM(BA16:BA23))","v":0},null,null,{"$f":"SUM(BD16:BD23)","v":3},{"$f":"SUM(BE16:BE23)","v":4},{"$f":"IF(COUNTBLANK(BF16:BF23)=8,\"\",SUM(AV24,BD24))","v":14},{"$f":"IF(COUNTBLANK(BG16:BG23)=8,\"\",SUM(AW24,BE24))","v":28},{"$f":"IF(COUNTIF(BH16:BI23,\"\")=16,\"\",SUM(BH16:BH23))","v":4860},{"$f":"IF($B16=\"\",\"\",SUM(BI16:BI23))","v":0},{"$f":"IF(COUNTBLANK(BJ16:BJ23)=8,\"\",SUM(BJ16:BJ23))","v":4988.2857142857147},{"$f":"IF($B16=\"\",\"\",SUM(BK16:BK23))","v":0},null,null,null,null,null,null,null,null,null,null,null,null,null,null,null,null,null,{"$f":"SUM(CC16:CC23)","v":14},{"$f":"SUM(CD16:CD23)","v":28},{"$f":"SUM(CE16:CE23)","v":4988.2857142857138},{"$f":"SUM(CF16:CF23)","v":1404988.2857142857}]
[{"$f":"IF(【準備】登録!B13=\"\",\"\",【準備】登録!B13)","v":"ORC"},{"$f":"B5","v":"選手名"},null,null,{"$f":"E5","v":"持点"},{"$f":"A5","v":"HRC"},null,"W","L","TP",null,"TP",null,{"$f":"A15","v":"NRC"},null,"W","L","W","L","TP",null,"TP",null,{"$f":"A5","v":"HRC"},null,"W","L","W","L","TP",null,"TP",null,{"$f":"A15","v":"NRC"},null,"W","L","W","L","TP",null,"TP",null,{"$f":"A5","v":"HRC"},null,"W","L","W","L","TP",null,"TP",null,{"$f":"A15","v":"NRC"},null,"W","L","W","L","TP",null,"TP",null,"R",{"$f":"BM$5","v":"1G"},"2G","3G","4G","5G","6G",null,null,null,null,null,null,null,null,null,null,{"$f":"CC$5","v":"W"},{"$f":"CD$5","v":"L"},{"$f":"CE$5","v":"TP"},{"$f":"CF$5","v":"R_P"}]
[null,{"$f":"IF(【準備】登録!$D$11=0,\"\",【準備】登録!$D$13)","v":"樹本　武士"},null,null,{"$f":"【準備】登録!F13","v":180},{"$f":"IF(【進行】結果入力表!G7=\"\",\"\",【進行】結果入力表!G7)","v":150},null,{"$f":"IF(F26=\"\",\"\",IF(F26=\"w\",1,0))","v":0},{"$f":"IF(F26=\"\",\"\",IF(F26=\"w\",0,1))","v":1},{"$f":"IF(F26=\"\",\"\",IF(F26=\"w\",E26,F26))","v":150},null,{"$f":"IF($F26=\"\",\"\",J26/$E26*180)","v":150},null,{"$f":"IF(【進行】結果入力表!G21=\"\",\"\",【進行】結果入力表!G21)","v":86},null,{"$f":"IF(N26=\"\",\"\",IF(N26=\"w\",1,0))","v":0},{"$f":"IF(N26=\"\",\"\",IF(N26=\"w\",0,1))","v":1},{"$f":"IF(N26=\"\",\"\",SUM(H26,P26))","v":0},{"$f":"IF(N26=\"\",\"\",SUM(I26,Q26))","v":2},{"$f":"IF(N26=\"\",\"\",IF(N26=\"w\",E26+J26,N26+J26))","v":236},null,{"$f":"IF($N26=\"\",\"\",T26/$E26*180)","v":236},null,{"$f":"IF(【進行】結果入力表!G28=\"\",\"\",【進行】結果入力表!G28)","v":"w"},null,{"$f":"IF(X26=\"\",\"\",IF(X26=\"w\",1,0))","v":1},{"$f":"IF(X26=\"\",\"\",IF(X26=\"w\",0,1))","v":0},{"$f":"IF(X26=\"\",\"\",SUM(R26,Z26))","v":1},{"$f":"IF(X26=\"\",\"\",SUM(S26,AA26))","v":2},{"$f":"IF(X26=\"\",\"\",IF(X26=\"w\",T26+E26,X26+T26))","v":416},null,{"$f":"IF($X26=\"\",\"\",AD26/$E26*180)","v":415.99999999999994},null,{"$f":"IF(【進行】結果入力表!G42=\"\",\"\",【進行】結果入力表!G42)","v":"w"},null,{"$f":"IF(AH26=\"\",\"\",IF(AH26=\"w\",1,0))","v":1},{"$f":"IF(AH26=\"\",\"\",IF(AH26=\"w\",0,1))","v":0},{"$f":"IF(AH26=\"\",\"\",SUM(AB26,AJ26))","v":2},{"$f":"IF(AH26=\"\",\"\",SUM(AC26,AK26))","v":2},{"$f":"IF(AH26=\"\",\"\",IF(AH26=\"w\",AD26+E26,AH26+AD26))","v":596},null,{"$f":"IF($AH26=\"\",\"\",AN26/$E26*180)","v":596},null,{"$f":"IF(【進行】結果入力表!G49=\"\",\"\",【進行】結果入力表!G49)","v":123},null,{"$f":"IF(AR26=\"\",\"\",IF(AR26=\"w\",1,0))","v":0},{"$f":"IF(AR26=\"\",\"\",IF(AR26=\"w\",0,1))","v":1},{"$f":"IF(AR26=\"\",\"\",IF(AR26=\"w\",AL26+1,AL26))","v":2},{"$f":"IF(AR26=\"\",\"\",IF(AR26=\"w\",AM26,AM26+1))","v":3},{"$f":"IF(AR26=\"\",\"\",IF(AR26=\"w\",AN26+E26,AR26+AN26))","v":719},null,{"$f":"IF($AR26=\"\",\"\",AX26/$E26*180)","v":719},null,{"$f":"IF(【進行】結果入力表!G63=\"\",\"\",【進行】結果入力表!G63)","v":115},null,{"$f":"IF(BB26=\"\",\"\",IF(BB26=\"w\",1,0))","v":0},{"$f":"IF(BB26=\"\",\"\",IF(BB26=\"w\",0,1))","v":1},{"$f":"IF(BB26=\"\",\"\",IF(BB26=\"w\",AV26+1,AV26))","v":2},{"$f":"IF(BB26=\"\",\"\",IF(BB26=\"w\",AW26,AW26+1))","v":4},{"$f":"IF(BB26=\"\",\"\",IF(BB26=\"w\",AX26+E26,BB26+AX26))","v":834},null,{"$f":"IF($BB26=\"\",\"\",BH26/$E26*180)","v":834.00000000000011},null,{"$f":"IF(SUM(H26:I26,R26:S26)=0,\"\",IF(B$13=\"\",RANK($CF$26:$CF$32,$CF$26:$CF$32,0),RANK($CF$26:$CF$33,$CF$26:$CF$33,0)))","v":7},{"$f":"IF(【進行】結果入力表!H7=\"\",\"\",【進行】結果入力表!H7)","v":""},{"$f":"IF(【進行】結果入力表!H21=\"\",\"\",【進行】結果入力表!H21)","v":""},{"$f":"IF(【進行】結果入力表!H28=\"\",\"\",【進行】結果入力表!H28)","v":""},{"$f":"IF(【進行】結果入力表!H42=\"\",\"\",【進行】結果入力表!H42)","v":""},{"$f":"IF(【進行】結果入力表!H49=\"\",\"\",【進行】結果入力表!H49)","v":""},{"$f":"IF(【進行】結果入力表!H63=\"\",\"\",【進行】結果入力表!H63)","v":""},null,{"$f":"COUNTIF($BM26:$BR26,BT$5)","v":0},0,{"$f":"MAX($BM26:$BR26)","v":0},{"$f":"BT26*10000+BU26*1000+BV26","v":0},{"$f":"RANK(BW26,$BW$6:$BW$33)","v":6},{"$f":"B26","v":"樹本　武士"},{"$f":"$A$25","v":"ORC"},{"$f":"IF(BT26>0,\"A\"&E26,IF(BU26>0,\"B\"&E26,BV26))","v":0},null,{"$f":"COUNTIF(F26:BC26,\"w\")","v":2},{"$f":"COUNT(F26,N26,AH26,X26,AR26,BB26)","v":4},{"$f":"CC26*180+SUM(F26,N26,AH26,X26,AR26,BB26)*180/E26","v":834},{"$f":"CC26*100000+CE26","v":200834}]
[null,{"$f":"IF(【準備】登録!$D$11=0,\"\",【準備】登録!$G$13)","v":"乾　伸綱"},null,null,{"$f":"【準備】登録!I13","v":180},{"$f":"IF(【進行】結果入力表!G8=\"\",\"\",【進行】結果入力表!G8)","v":141},null,0,1,141,null,141,null,{"$f":"IF(【進行】結果入力表!G22=\"\",\"\",【進行】結果入力表!G22)","v":109},null,0,1,0,2,250,null,250,null,{"$f":"IF(【進行】結果入力表!G29=\"\",\"\",【進行】結果入力表!G29)","v":"w"},null,1,0,1,2,430,null,430,null,{"$f":"IF(【進行】結果入力表!G43=\"\",\"\",【進行】結果入力表!G43)","v":123},null,0,1,1,3,553,null,553,null,{"$f":"IF(【進行】結果入力表!G50=\"\",\"\",【進行】結果入力表!G50)","v":"w"},null,1,0,2,3,733,null,733,null,{"$f":"IF(【進行】結果入力表!G64=\"\",\"\",【進行】結果入力表!G64)","v":"w"},null,1,0,3,3,913,null,913,null,4,{"$f":"IF(【進行】結果入力表!H8=\"\",\"\",【進行】結果入力表!H8)","v":""},{"$f":"IF(【進行】結果入力表!H22=\"\",\"\",【進行】結果入力表!H22)","v":""},{"$f":"IF(【進行】結果入力表!H29=\"\",\"\",【進行】結果入力表!H29)","v":""},{"$f":"IF(【進行】結果入力表!H43=\"\",\"\",【進行】結果入力表!H43)","v":""},{"$f":"IF(【進行】結果入力表!H50=\"\",\"\",【進行】結果入力表!H50)","v":""},{"$f":"IF(【進行】結果入力表!H64=\"\",\"\",【進行】結果入力表!H64)","v":""},null,0,0,0,0,6,"乾　伸綱","ORC",0,null,3,3,913,300913]
[null,{"$f":"IF(【準備】登録!$D$11=0,\"\",【準備】登録!$J$13)","v":"村上　泰辰"},null,null,{"$f":"【準備】登録!L13","v":180},{"$f":"IF(【進行】結果入力表!G9=\"\",\"\",【進行】結果入力表!G9)","v":179},null,0,1,179,null,179,null,{"$f":"IF(【進行】結果入力表!G23=\"\",\"\",【進行】結果入力表!G23)","v":"w"},null,1,0,1,1,359,null,359,null,{"$f":"IF(【進行】結果入力表!G30=\"\",\"\",【進行】結果入力表!G30)","v":"w"},null,1,0,2,1,539,null,539,null,{"$f":"IF(【進行】結果入力表!G44=\"\",\"\",【進行】結果入力表!G44)","v":"w"},null,1,0,3,1,719,null,719,null,{"$f":"IF(【進行】結果入力表!G51=\"\",\"\",【進行】結果入力表!G51)","v":"w"},null,1,0,4,1,899,null,899,null,{"$f":"IF(【進行】結果入力表!G65=\"\",\"\",【進行】結果入力表!G65)","v":"w"},null,1,0,5,1,1079,null,1079,null,2,{"$f":"IF(【進行】結果入力表!H9=\"\",\"\",【進行】結果入力表!H9)","v":""},{"$f":"IF(【進行】結果入力表!H23=\"\",\"\",【進行】結果入力表!H23)","v":119},{"$f":"IF(【進行】結果入力表!H30=\"\",\"\",【進行】結果入力表!H30)","v":110},{"$f":"IF(【進行】結果入力表!H44=\"\",\"\",【進行】結果入力表!H44)","v":""},{"$f":"IF(【進行】結果入力表!H51=\"\",\"\",【進行】結果入力表!H51)","v":""},{"$f":"IF(【進行】結果入力表!H65=\"\",\"\",【進行】結果入力表!H65)","v":102},null,0,0,119,119,3,"村上　泰辰","ORC",119,null,5,1,1079,501079]
[null,{"$f":"IF(【準備】登録!$D$11=0,\"\",【準備】登録!$M$13)","v":"山岡　修二"},null,null,{"$f":"【準備】登録!O13","v":180},{"$f":"IF(【進行】結果入力表!G10=\"\",\"\",【進行】結果入力表!G10)","v":"w"},null,1,0,180,null,180,null,{"$f":"IF(【進行】結果入力表!G24=\"\",\"\",【進行】結果入力表!G24)","v":"w"},null,1,0,2,0,360,null,360,null,{"$f":"IF(【進行】結果入力表!G31=\"\",\"\",【進行】結果入力表!G31)","v":"w"},null,1,0,3,0,540,null,540,null,{"$f":"IF(【進行】結果入力表!G45=\"\",\"\",【進行】結果入力表!G45)","v":"w"},null,1,0,4,0,720,null,720,null,{"$f":"IF(【進行】結果入力表!G52=\"\",\"\",【進行】結果入力表!G52)","v":"w"},null,1,0,5,0,900,null,900,null,{"$f":"IF(【進行】結果入力表!G66=\"\",\"\",【進行】結果入力表!G66)","v":"w"},null,1,0,6,0,1080,null,1080,null,1,{"$f":"IF(【進行】結果入力表!H10=\"\",\"\",【進行】結果入力表!H10)","v":109},{"$f":"IF(【進行】結果入力表!H24=\"\",\"\",【進行】結果入力表!H24)","v":""},{"$f":"IF(【進行】結果入力表!H31=\"\",\"\",【進行】結果入力表!H31)","v":""},{"$f":"IF(【進行】結果入力表!H45=\"\",\"\",【進行】結果入力表!H45)","v":""},{"$f":"IF(【進行】結果入力表!H52=\"\",\"\",【進行】結果入力表!H52)","v":109},{"$f":"IF(【進行】結果入力表!H66=\"\",\"\",【進行】結果入力表!H66)","v":""},null,0,0,109,109,4,"山岡　修二","ORC",109,null,6,0,1080,601080]
[null,{"$f":"IF(【準備】登録!$D$11=0,\"\",【準備】登録!$P$13)","v":"吉岡　保俊"},null,null,{"$f":"【準備】登録!R13","v":180},{"$f":"IF(【進行】結果入力表!G11=\"\",\"\",【進行】結果入力表!G11)","v":115},null,0,1,115,null,114.99999999999999,null,{"$f":"IF(【進行】結果入力表!G25=\"\",\"\",【進行】結果入力表!G25)","v":"w"},null,1,0,1,1,295,null,295,null,{"$f":"IF(【進行】結果入力表!G32=\"\",\"\",【進行】結果入力表!G32)","v":"w"},null,1,0,2,1,475,null,475,null,{"$f":"IF(【進行】結果入力表!G46=\"\",\"\",【進行】結果入力表!G46)","v":"w"},null,1,0,3,1,655,null,655,null,{"$f":"IF(【進行】結果入力表!G53=\"\",\"\",【進行】結果入力表!G53)","v":"w"},null,1,0,4,1,835,null,835.00000000000011,null,{"$f":"IF(【進行】結果入力表!G67=\"\",\"\",【進行】結果入力表!G67)","v":153},null,0,1,4,2,988,null,988,null,3,{"$f":"IF(【進行】結果入力表!H11=\"\",\"\",【進行】結果入力表!H11)","v":""},{"$f":"IF(【進行】結果入力表!H25=\"\",\"\",【進行】結果入力表!H25)","v":""},{"$f":"IF(【進行】結果入力表!H32=\"\",\"\",【進行】結果入力表!H32)","v":""},{"$f":"IF(【進行】結果入力表!H46=\"\",\"\",【進行】結果入力表!H46)","v":""},{"$f":"IF(【進行】結果入力表!H53=\"\",\"\",【進行】結果入力表!H53)","v":""},{"$f":"IF(【進行】結果入力表!H67=\"\",\"\",【進行】結果入力表!H67)","v":""},null,0,0,0,0,6,"吉岡　保俊","ORC",0,null,4,2,988,400988]
[null,{"$f":"IF(【準備】登録!$D$11=0,\"\",【準備】登録!$S$13)","v":"渡邊　孝行"},null,null,{"$f":"【準備】登録!U13","v":180},{"$f":"IF(【進行】結果入力表!G12=\"\",\"\",【進行】結果入力表!G12)","v":"w"},null,1,0,180,null,180,null,{"$f":"IF(【進行】結果入力表!G26=\"\",\"\",【進行】結果入力表!G26)","v":115},null,0,1,1,1,295,null,295,null,{"$f":"IF(【進行】結果入力表!G33=\"\",\"\",【進行】結果入力表!G33)","v":"w"},null,1,0,2,1,475,null,475,null,{"$f":"IF(【進行】結果入力表!G47=\"\",\"\",【進行】結果入力表!G47)","v":"w"},null,1,0,3,1,655,null,655,null,{"$f":"IF(【進行】結果入力表!G54=\"\",\"\",【進行】結果入力表!G54)","v":87},null,0,1,3,2,742,null,741.99999999999989,null,{"$f":"IF(【進行】結果入力表!G68=\"\",\"\",【進行】結果入力表!G68)","v":170},null,0,1,3,3,912,null,912,null,5,{"$f":"IF(【進行】結果入力表!H12=\"\",\"\",【進行】結果入力表!H12)","v":""},{"$f":"IF(【進行】結果入力表!H26=\"\",\"\",【進行】結果入力表!H26)","v":""},{"$f":"IF(【進行】結果入力表!H33=\"\",\"\",【進行】結果入力表!H33)","v":""},{"$f":"IF(【進行】結果入力表!H47=\"\",\"\",【進行】結果入力表!H47)","v":""},{"$f":"IF(【進行】結果入力表!H54=\"\",\"\",【進行】結果入力表!H54)","v":""},{"$f":"IF(【進行】結果入力表!H68=\"\",\"\",【進行】結果入力表!H68)","v":""},null,0,0,0,0,6,"渡邊　孝行","ORC",0,null,3,3,912,300912]
[null,{"$f":"IF(【準備】登録!$D$11=0,\"\",【準備】登録!$V$13)","v":"山崎真紀子"},null,null,{"$f":"【準備】登録!X13","v":140},{"$f":"IF(【進行】結果入力表!G13=\"\",\"\",【進行】結果入力表!G13)","v":79},null,0,1,79,null,101.57142857142857,null,{"$f":"IF(【進行】結果入力表!G27=\"\",\"\",【進行】結果入力表!G27)","v":"w"},null,1,0,1,1,219,null,281.57142857142856,null,{"$f":"IF(【進行】結果入力表!G34=\"\",\"\",【進行】結果入力表!G34)","v":14},null,0,1,1,2,233,null,299.57142857142861,null,{"$f":"IF(【進行】結果入力表!G48=\"\",\"\",【進行】結果入力表!G48)","v":"w"},null,1,0,2,2,373,null,479.57142857142856,null,{"$f":"IF(【進行】結果入力表!G55=\"\",\"\",【進行】結果入力表!G55)","v":75},null,0,1,2,3,448,null,576,null,{"$f":"IF(【進行】結果入力表!G69=\"\",\"\",【進行】結果入力表!G69)","v":"w"},null,1,0,3,3,588,null,756,null,6,{"$f":"IF(【進行】結果入力表!H13=\"\",\"\",【進行】結果入力表!H13)","v":""},{"$f":"IF(【進行】結果入力表!H27=\"\",\"\",【進行】結果入力表!H27)","v":""},{"$f":"IF(【進行】結果入力表!H34=\"\",\"\",【進行】結果入力表!H34)","v":""},{"$f":"IF(【進行】結果入力表!H48=\"\",\"\",【進行】結果入力表!H48)","v":""},{"$f":"IF(【進行】結果入力表!H55=\"\",\"\",【進行】結果入力表!H55)","v":""},{"$f":"IF(【進行】結果入力表!H69=\"\",\"\",【進行】結果入力表!H69)","v":""},null,0,0,0,0,6,"山崎真紀子","ORC",0,null,3,3,756,300756]
[]
[null,"Total",null,null,null,null,null,{"$f":"IF(COUNTBLANK(H26:H33)=8,\"\",SUM(H26:H33))","v":2},{"$f":"IF(COUNTBLANK(I26:I33)=8,\"\",SUM(I26:I33))","v":5},{"$f":"IF($B26=\"\",\"\",SUM(J26:J33))","v":1024},{"$f":"IF($B26=\"\",\"\",SUM(K26:K33))","v":0},{"$f":"IF(COUNTBLANK(L26:L33)=8,\"\",SUM(L26:L33))","v":1046.5714285714287},{"$f":"IF($B26=\"\",\"\",SUM(M26:M33))","v":0},null,null,{"$f":"SUM(P26:P33)","v":4},{"$f":"SUM(Q26:Q33)","v":3},{"$f":"IF(COUNTBLANK(R26:R33)=8,\"\",SUM(H34,P34))","v":6},{"$f":"IF(COUNTBLANK(S26:S33)=8,\"\",SUM(I34,Q34))","v":8},{"$f":"IF($B26=\"\",\"\",SUM(T26:T33))","v":2014},{"$f":"IF($B26=\"\",\"\",SUM(U26:U33))","v":0},{"$f":"IF(COUNTBLANK(V26:V33)=8,\"\",SUM(V26:V33))","v":2076.5714285714284},{"$f":"IF($B26=\"\",\"\",SUM(W26:W33))","v":0},null,null,{"$f":"SUM(Z26:Z33)","v":6},{"$f":"SUM(AA26:AA33)","v":1},{"$f":"IF(COUNTBLANK(AB26:AB33)=8,\"\",SUM(R34,Z34))","v":12},{"$f":"IF(COUNTBLANK(AC26:AC33)=8,\"\",SUM(S34,AA34))","v":9},{"$f":"IF($B26=\"\",\"\",SUM(AD26:AD33))","v":3108},{"$f":"IF($B26=\"\",\"\",SUM(AE26:AE33))","v":0},{"$f":"IF(COUNTBLANK(AF26:AF33)=8,\"\",SUM(AF26:AF33))","v":3174.5714285714284},{"$f":"IF($B26=\"\",\"\",SUM(AG26:AG33))","v":0},null,null,{"$f":"SUM(AJ26:AJ33)","v":6},{"$f":"SUM(AK26:AK33)","v":1},{"$f":"IF(COUNTBLANK(AL26:AL33)=8,\"\",SUM(AB34,AJ34))","v":18},{"$f":"IF(COUNTBLANK(AM26:AM33)=8,\"\",SUM(AC34,AK34))","v":10},{"$f":"IF($B26=\"\",\"\",SUM(AN26:AN33))","v":4271},{"$f":"IF($B26=\"\",\"\",SUM(AO26:AO33))","v":0},{"$f":"IF(COUNTBLANK(AP26:AP33)=8,\"\",SUM(AP26:AP33))","v":4377.5714285714284},{"$f":"IF($B26=\"\",\"\",SUM(AQ26:AQ33))","v":0},null,null,{"$f":"SUM(AT26:AT33)","v":4},{"$f":"SUM(AU26:AU33)","v":3},{"$f":"IF(COUNTBLANK(AV26:AV33)=8,\"\",SUM(AL34,AT34))","v":22},{"$f":"IF(COUNTBLANK(AW26:AW33)=8,\"\",SUM(AM34,AU34))","v":13},{"$f":"IF($B26=\"\",\"\",SUM(AX26:AX33))","v":5276},{"$f":"IF($B26=\"\",\"\",SUM(AY26:AY33))","v":0},{"$f":"IF(COUNTBLANK(AZ26:AZ33)=8,\"\",SUM(AZ26:AZ33))","v":5404},{"$f":"IF($B26=\"\",\"\",SUM(BA26:BA33))","v":0},null,null,{"$f":"SUM(BD26:BD33)","v":4},{"$f":"SUM(BE26:BE33)","v":3},{"$f":"IF(COUNTBLANK(BF26:BF33)=8,\"\",SUM(AV34,BD34))","v":26},{"$f":"IF(COUNTBLANK(BG26:BG33)=8,\"\",SUM(AW34,BE34))","v":16},{"$f":"IF(COUNTIF(BH26:BI33,\"\")=16,\"\",SUM(BH26:BH33))","v":6394},{"$f":"IF($B26=\"\",\"\",SUM(BI26:BI33))","v":0},{"$f":"IF(COUNTBLANK(BJ26:BJ33)=8,\"\",SUM(BJ26:BJ33))","v":6562},{"$f":"IF($B26=\"\",\"\",SUM(BK26:BK33))","v":0},null,null,null,null,null,null,null,null,null,null,null,null,null,null,null,null,null,{"$f":"SUM(CC26:CC33)","v":26},{"$f":"SUM(CD26:CD33)","v":16},{"$f":"SUM(CE26:CE33)","v":6562},{"$f":"SUM(CF26:CF33)","v":2606562}]
[null,"※","TPの数字は、ハンデによる換算後の得点を示す。"]

{"sheet":"【結果】リーグ成績表","index":4,"n_rows":43,"n_cols":59,"rows_kept":43,"cut":false,"hidden":false,"merged":[[10,7,10,8],[9,13,9,14],[11,13,11,14],[10,0,10,1],[10,2,10,3],[10,5,10,6],[11,9,11,10],[3,13,3,14],[4,13,4,14],[5,13,5,14],[6,0,6,1],[3,2,3,3],[4,2,4,3],[5,2,5,3],[6,2,6,3],[3,0,3,1],[4,0,4,1],[5,0,5,1],[4,5,4,6],[4,7,4,8],[4,9,4,10],[5,5,5,6],[5,7,5,8],[5,9,5,10],[8,13,8,14],[9,9,9,10],[6,5,6,6],[6,7,6,8],[6,9,6,10],[8,0,8,1],[8,2,8,3],[9,0,9,1],[9,2,9,3],[6,13,6,14],[9,5,9,6],[9,7,9,8],[15,2,15,3],[15,5,15,6],[15,7,15,8],[14,0,14,1],[14,2,14,3],[14,5,14,6],[11,0,11,1],[11,2,11,3],[11,5,11,6],[11,7,11,8],[14,7,14,8],[13,0,13,1],[13,2,13,3],[15,0,15,1],[16,0,16,1],[16,2,16,3],[16,5,16,6],[16,7,16,8],[20,0,20,1],[20,2,20,3],[20,5,20,6],[20,7,20,8],[19,0,19,1],[19,2,19,3],[19,5,19,6],[19,7,19,8],[18,0,18,1],[18,2,18,3],[21,0,21,1],[21,2,21,3],[21,5,21,6],[21,7,21,8],[18,13,18,14],[19,9,19,10],[19,13,19,14],[21,9,21,10],[21,13,21,14],[20,13,20,14],[20,9,20,10],[24,7,24,8],[23,0,23,1],[23,2,23,3],[25,9,25,10],[25,0,25,1],[25,2,25,3],[25,5,25,6],[25,7,25,8],[24,0,24,1],[24,2,24,3],[24,5,24,6],[26,0,26,1],[26,2,26,3],[26,5,26,6],[26,7,26,8],[29,9,29,10],[29,13,29,14],[28,0,28,1],[28,2,28,3],[29,0,29,1],[29,2,29,3],[29,5,29,6],[29,7,29,8],[26,9,26,10],[26,13,26,14],[30,7,30,8],[28,13,28,14],[30,5,30,6],[30,0,30,1],[30,2,30,3],[31,0,31,1],[31,2,31,3],[31,9,31,10],[31,13,31,14],[31,5,31,6],[31,7,31,8],[34,0,34,1],[34,2,34,3],[34,5,34,6],[34,7,34,8],[33,0,33,1],[33,2,33,3],[36,0,36,1],[36,2,36,3],[36,5,36,6],[36,7,36,8],[35,0,35,1],[35,2,35,3],[35,5,35,6],[35,7,35,8],[16,13,16,14],[15,13,15,14],[36,20,36,21],[15,9,15,10],[16,9,16,10],[10,9,10,10],[10,13,10,14],[33,13,33,14],[34,9,34,10],[34,13,34,14],[36,9,36,10],[36,13,36,14],[35,13,35,14],[13,13,13,14],[14,9,14,10],[14,13,14,14],[35,9,35,10],[30,9,30,10],[30,13,30,14],[18,20,18,21],[21,20,21,21],[31,20,31,21],[23,13,23,14],[24,9,24,10],[24,13,24,14],[25,13,25,14],[8,20,8,21],[8,22,8,23],[10,29,10,30],[10,20,10,21],[10,22,10,23],[10,25,10,26],[10,27,10,28],[9,22,9,23],[15,27,15,28],[11,20,11,21],[9,20,9,21],[11,29,11,30],[14,25,14,26],[14,27,14,28],[16,29,16,30],[20,20,20,21],[20,22,20,23],[20,25,20,26],[20,27,20,28],[19,20,19,21],[19,22,19,23],[19,25,19,26],[3,20,3,21],[3,22,3,23],[5,29,5,30],[4,20,4,21],[4,22,4,23],[4,25,4,26],[5,20,5,21],[5,22,5,23],[6,20,6,21],[6,22,6,23],[11,33,11,34],[10,33,10,34],[9,27,9,28],[8,33,8,34],[9,29,9,30],[3,33,3,34],[4,29,4,30],[11,22,11,23],[11,25,11,26],[11,27,11,28],[6,25,6,26],[6,27,6,28],[5,25,5,26],[5,33,5,34],[4,27,4,28],[4,33,4,34],[6,29,6,30],[6,33,6,34],[9,33,9,34],[9,25,9,26],[5,27,5,28],[16,33,16,34],[13,20,13,21],[13,22,13,23],[15,29,15,30],[15,33,15,34],[14,20,14,21],[14,22,14,23],[16,25,16,26],[16,27,16,28],[13,33,13,34],[14,29,14,30],[14,33,14,34],[15,25,15,26],[15,20,15,21],[15,22,15,23],[16,20,16,21],[16,22,16,23],[19,27,19,28],[30,20,30,21],[30,22,30,23],[30,33,30,34],[29,27,29,28],[28,33,28,34],[29,29,29,30],[29,33,29,34],[21,22,21,23],[21,25,21,26],[21,27,21,28],[23,20,23,21],[23,22,23,23],[24,20,24,21],[24,22,24,23],[24,25,24,26],[24,27,24,28],[21,29,21,30],[21,33,21,34],[23,33,23,34],[24,29,24,30],[24,33,24,34],[29,20,29,21],[29,22,29,23],[29,25,29,26],[25,33,25,34],[26,29,26,30],[26,33,26,34],[25,20,25,21],[25,22,25,23],[25,27,25,28],[26,20,26,21],[26,22,26,23],[26,25,26,26],[26,27,26,28],[25,29,25,30],[28,20,28,21],[28,22,28,23],[34,20,34,21],[34,22,34,23],[34,25,34,26],[34,27,34,28],[35,20,35,21],[35,22,35,23],[34,33,34,34],[31,29,31,30],[33,33,33,34],[34,29,34,30],[31,22,31,23],[31,25,31,26],[33,20,33,21],[33,22,33,23],[31,27,31,28],[31,33,31,34],[4,47,4,48],[6,40,6,41],[6,42,6,43],[6,45,6,46],[6,47,6,48],[36,22,36,23],[36,25,36,26],[36,27,36,28],[35,25,35,26],[36,29,36,30],[36,33,36,34],[35,27,35,28],[35,29,35,30],[35,33,35,34],[25,25,25,26],[30,25,30,26],[30,27,30,28],[30,29,30,30],[18,33,18,34],[19,29,19,30],[19,33,19,34],[20,33,20,34],[20,29,20,30],[18,22,18,23],[3,40,3,41],[3,42,3,43],[10,45,10,46],[10,47,10,48],[9,40,9,41],[9,42,9,43],[9,45,9,46],[4,53,4,54],[6,49,6,50],[6,53,6,54],[5,40,5,41],[5,42,5,43],[5,47,5,48],[8,40,8,41],[8,42,8,43],[10,40,10,41],[10,42,10,43],[3,53,3,54],[4,49,4,50],[5,49,5,50],[5,53,5,54],[4,40,4,41],[4,42,4,43],[4,45,4,46],[11,49,11,50],[11,53,11,54],[10,53,10,54],[9,47,9,48],[8,53,8,54],[9,49,9,50],[9,53,9,54],[10,49,10,50],[5,45,5,46],[15,40,15,41],[15,42,15,43],[11,40,11,41],[11,42,11,43],[11,45,11,46],[11,47,11,48],[14,45,14,46],[16,49,16,50],[16,53,16,54],[16,45,16,46],[16,47,16,48],[15,49,15,50],[15,53,15,54],[15,45,15,46],[15,47,15,48],[13,40,13,41],[13,42,13,43],[14,40,14,41],[14,42,14,43],[14,47,14,48],[13,53,13,54],[14,49,14,50],[14,53,14,54],[16,40,16,41],[16,42,16,43],[21,40,21,41],[21,42,21,43],[21,45,21,46],[21,47,21,48],[20,40,20,41],[20,42,20,43],[20,45,20,46],[20,47,20,48],[24,40,24,41],[24,42,24,43],[24,45,24,46],[24,47,24,48],[23,53,23,54],[24,49,24,50],[25,40,25,41],[25,42,25,43],[18,53,18,54],[19,49,19,50],[19,53,19,54],[21,49,21,50],[21,53,21,54],[20,53,20,54],[20,49,20,50],[23,40,23,41],[23,42,23,43],[19,40,19,41],[19,42,19,43],[19,45,19,46],[19,47,19,48],[18,40,18,41],[18,42,18,43],[26,45,26,46],[26,47,26,48],[25,45,25,46],[25,47,25,48],[28,53,28,54],[29,49,29,50],[29,53,29,54],[25,49,25,50],[25,53,25,54],[2,0,2,18],[2,20,2,38],[2,40,2,58],[35,53,35,54],[35,45,35,46],[36,40,36,41],[36,42,36,43],[36,45,36,46],[36,47,36,48],[35,40,35,41],[35,42,35,43],[35,47,35,48],[35,49,35,50],[31,40,31,41],[31,42,31,43],[31,45,31,46],[30,47,30,48],[33,40,33,41],[33,42,33,43],[30,49,30,50],[24,53,24,54],[26,49,26,50],[26,53,26,54],[28,40,28,41],[1,51,1,58],[33,53,33,54],[34,49,34,50],[34,53,34,54],[36,53,36,54],[29,47,29,48],[36,49,36,50],[34,40,34,41],[34,42,34,43],[34,45,34,46],[34,47,34,48],[28,42,28,43],[31,49,31,50],[29,40,29,41],[29,42,29,43],[29,45,29,46],[30,40,30,41],[30,42,30,43],[30,45,30,46],[31,47,31,48],[31,53,31,54],[30,53,30,54],[26,40,26,41],[26,42,26,43]]}
[{"$f":"【結果】個人成績表!A1","v":"第8回　阪神奈対抗戦　　　(奈良：キングスポット)"}]
[null,null,null,null,null,null,null,null,null,null,null,null,null,null,null,null,null,null,null,null,null,null,null,null,null,null,null,null,null,null,null,null,null,null,null,null,null,null,null,null,null,null,null,null,null,null,null,null,null,null,null,{"$f":"【準備】登録!D4","v":"2015-10-25"}]
["第１節",null,null,null,null,null,null,null,null,null,null,null,null,null,null,null,null,null,null,null,"第２節",null,null,null,null,null,null,null,null,null,null,null,null,null,null,null,null,null,null,null,"第３節"]
[{"$f":"【準備】登録!D9","v":1},null,"Name",null,"持点",{"$f":"$A$5","v":"HRC"},null,{"$f":"$A$6","v":"NRC"},null,{"$f":"$A$7","v":"ORC"},null,"W","L","TP",null,"TP","LP","R_P","R",null,1,null,"Name",null,{"$f":"$E$4","v":"持点"},{"$f":"$A$5","v":"HRC"},null,{"$f":"$A$6","v":"NRC"},null,{"$f":"$A$7","v":"ORC"},null,"W","L","TP",null,"TP","LP","R_P","R",null,1,null,"Name",null,{"$f":"$E$4","v":"持点"},{"$f":"$A$5","v":"HRC"},null,{"$f":"$A$6","v":"NRC"},null,{"$f":"$A$7","v":"ORC"},null,"W","L","TP",null,"TP","LP","R_P","R"]
[{"$f":"IF(【準備】登録!$B$11=\"\",\"\",【準備】登録!$B$11)","v":"HRC"},null,{"$f":"【進行】結果入力表!D7","v":"高木　俊行"},null,{"$f":"【準備】登録!F11","v":180},null,null,{"$f":"IF(【進行】結果入力表!F14=\"\",\"\",【進行】結果入力表!F14)","v":"w"},null,{"$f":"IF(【進行】結果入力表!F7=\"\",\"\",【進行】結果入力表!F7)","v":"w"},null,{"$f":"IF(J5=\"\",\"\",COUNTIF(F5:K5,\"w\"))","v":2},{"$f":"IF(J5=\"\",\"\",COUNT(H5,J5))","v":0},{"$f":"SUM(F5:K5)+L5*E5","v":360},null,{"$f":"IF(J5=\"\",\"\",N5/E5*180)","v":360},{"$f":"IF(F6=\"w\",180,F6/E5*180)+IF(F7=\"w\",180,F7/E5*180)","v":246},{"$f":"L5*10000000+P5*L10004*10000000+P5*1000-Q5","v":20359754},{"$f":"IF(J5=\"\",\"\",RANK(R5:R7,R5:R7,0))","v":1},null,{"$f":"$A$5","v":"HRC"},null,{"$f":"【進行】結果入力表!D35","v":"藤中健太郎"},null,{"$f":"【準備】登録!U11","v":180},null,null,{"$f":"IF(【進行】結果入力表!F35=\"\",\"\",【進行】結果入力表!F35)","v":66},null,{"$f":"IF(【進行】結果入力表!F28=\"\",\"\",【進行】結果入力表!F28)","v":39},null,{"$f":"IF(AD5=\"\",\"\",COUNTIF(Z5:AE5,\"w\"))","v":0},{"$f":"IF(AD5=\"\",\"\",COUNT(AB5,AD5))","v":2},{"$f":"SUM(Z5:AE5)+AF5*Y5","v":105},null,{"$f":"IF(AD5=\"\",\"\",AH5/Y5*180)","v":105},{"$f":"IF(Z6=\"w\",180,Z6/Y5*180)+IF(Z7=\"w\",180,Z7/Y5*180)","v":360},{"$f":"AF5*10000000+AJ5*AF10004*10000000+AJ5*1000-AK5","v":104640},{"$f":"IF(AD5=\"\",\"\",RANK(AL5:AL7,AL5:AL7,0))","v":3},null,{"$f":"$A$5","v":"HRC"},null,{"$f":"【進行】結果入力表!D56","v":"丹羽　俊也"},null,{"$f":"【準備】登録!O11","v":180},null,null,{"$f":"IF(【進行】結果入力表!F56=\"\",\"\",【進行】結果入力表!F56)","v":"w"},null,{"$f":"IF(【進行】結果入力表!F49=\"\",\"\",【進行】結果入力表!F49)","v":"w"},null,{"$f":"IF(AX5=\"\",\"\",COUNTIF(AT5:AY5,\"w\"))","v":2},{"$f":"IF(AX5=\"\",\"\",COUNT(AV5,AX5))","v":0},{"$f":"SUM(AT5:AY5)+AZ5*AS5","v":360},null,{"$f":"IF(AX5=\"\",\"\",BB5/AS5*180)","v":360},{"$f":"IF(AT6=\"w\",180,AT6/AS5*180)+IF(AT7=\"w\",180,AT7/AS5*180)","v":199},{"$f":"AZ5*10000000+BD5*AZ10004*10000000+BD5*1000-BE5","v":20359801},{"$f":"IF(AX5=\"\",\"\",RANK(BF5:BF7,BF5:BF7,0))","v":1}]
[{"$f":"IF(【準備】登録!$B$12=\"\",\"\",【準備】登録!$B$12)","v":"NRC"},null,{"$f":"【進行】結果入力表!I14","v":"吉向　翔平"},null,{"$f":"【準備】登録!F12","v":180},{"$f":"IF(【進行】結果入力表!G14=\"\",\"\",【進行】結果入力表!G14)","v":96},null,null,null,{"$f":"IF(【進行】結果入力表!F21=\"\",\"\",【進行】結果入力表!F21)","v":"w"},null,{"$f":"IF(J5=\"\",\"\",COUNTIF(F6:K6,\"w\"))","v":1},{"$f":"IF(J5=\"\",\"\",COUNT(F6,J6))","v":1},{"$f":"SUM(F6:K6)+L6*E6","v":276},null,{"$f":"IF(J5=\"\",\"\",N6/E6*180)","v":276},{"$f":"IF(H5=\"w\",180,H5/E6*180)+IF(H7=\"w\",180,H7/E6*180)","v":266},{"$f":"L6*10000000+P6*L10005*10000000+P6*1000-Q6","v":10275734},{"$f":"IF(J5=\"\",\"\",RANK(R5:R7,R5:R7,0))","v":2},null,{"$f":"$A$6","v":"NRC"},null,{"$f":"【進行】結果入力表!I35","v":"宮野　早織"},null,{"$f":"【準備】登録!X12","v":140},{"$f":"IF(【進行】結果入力表!G35=\"\",\"\",【進行】結果入力表!G35)","v":"w"},null,null,null,{"$f":"IF(【進行】結果入力表!F42=\"\",\"\",【進行】結果入力表!F42)","v":56},null,{"$f":"IF(AD5=\"\",\"\",COUNTIF(Z6:AE6,\"w\"))","v":1},{"$f":"IF(AD5=\"\",\"\",COUNT(Z6,AD6))","v":1},{"$f":"SUM(Z6:AE6)+AF6*Y6","v":196},null,{"$f":"IF(AD5=\"\",\"\",AH6/Y6*180)","v":251.99999999999997},{"$f":"IF(AB5=\"w\",180,AB5/Y6*180)+IF(AB7=\"w\",180,AB7/Y6*180)","v":264.85714285714289},{"$f":"AF6*10000000+AJ6*AF10005*10000000+AJ6*1000-AK6","v":10251735.142857144},{"$f":"IF(AD5=\"\",\"\",RANK(AL5:AL7,AL5:AL7,0))","v":2},null,{"$f":"$A$6","v":"NRC"},null,{"$f":"【進行】結果入力表!I56","v":"植田　慎也"},null,{"$f":"【準備】登録!U12","v":180},{"$f":"IF(【進行】結果入力表!G56=\"\",\"\",【進行】結果入力表!G56)","v":76},null,null,null,{"$f":"IF(【進行】結果入力表!F63=\"\",\"\",【進行】結果入力表!F63)","v":"w"},null,{"$f":"IF(AX5=\"\",\"\",COUNTIF(AT6:AY6,\"w\"))","v":1},{"$f":"IF(AX5=\"\",\"\",COUNT(AT6,AX6))","v":1},{"$f":"SUM(AT6:AY6)+AZ6*AS6","v":256},null,{"$f":"IF(AX5=\"\",\"\",BB6/AS6*180)","v":256},{"$f":"IF(AV5=\"w\",180,AV5/AS6*180)+IF(AV7=\"w\",180,AV7/AS6*180)","v":295},{"$f":"AZ6*10000000+BD6*AZ10005*10000000+BD6*1000-BE6","v":10255705},{"$f":"IF(AX5=\"\",\"\",RANK(BF5:BF7,BF5:BF7,0))","v":2}]
[{"$f":"IF(【準備】登録!$B$13=\"\",\"\",【準備】登録!$B$13)","v":"ORC"},null,{"$f":"【進行】結果入力表!I7","v":"樹本　武士"},null,{"$f":"【準備】登録!F13","v":180},{"$f":"IF(【進行】結果入力表!G7=\"\",\"\",【進行】結果入力表!G7)","v":150},null,{"$f":"IF(【進行】結果入力表!G21=\"\",\"\",【進行】結果入力表!G21)","v":86},null,null,null,{"$f":"IF(J5=\"\",\"\",COUNTIF(F7:K7,\"w\"))","v":0},{"$f":"IF(J5=\"\",\"\",COUNT(F7,H7))","v":2},{"$f":"SUM(F7:K7)+L7*E7","v":236},null,{"$f":"IF(J5=\"\",\"\",(N7/E7*180))","v":236},{"$f":"IF(J5=\"w\",180,J5/E7*180)+IF(J6=\"w\",180,J6/E7*180)","v":360},{"$f":"L7*10000000+P7*L10006*10000000+P7*1000-Q7","v":235640},{"$f":"IF(J5=\"\",\"\",RANK(R5:R7,R5:R7,0))","v":3},null,{"$f":"$A$7","v":"ORC"},null,{"$f":"【進行】結果入力表!I28","v":"樹本　武士"},null,{"$f":"【準備】登録!F13","v":180},{"$f":"IF(【進行】結果入力表!G28=\"\",\"\",【進行】結果入力表!G28)","v":"w"},null,{"$f":"IF(【進行】結果入力表!G42=\"\",\"\",【進行】結果入力表!G42)","v":"w"},null,null,null,{"$f":"IF(AD5=\"\",\"\",COUNTIF(Z7:AE7,\"w\"))","v":2},{"$f":"IF(AD5=\"\",\"\",COUNT(Z7,AB7))","v":0},{"$f":"SUM(Z7:AE7)+AF7*Y7","v":360},null,{"$f":"IF(AD5=\"\",\"\",AH7/Y7*180)","v":360},{"$f":"IF(AD5=\"w\",180,AD5/Y7*180)+IF(AD6=\"w\",180,AD6/Y7*180)","v":95},{"$f":"AF7*10000000+AJ7*AF10006*10000000+AJ7*1000-AK7","v":20359905},{"$f":"IF(AD5=\"\",\"\",RANK(AL5:AL7,AL5:AL7,0))","v":1},null,{"$f":"$A$7","v":"ORC"},null,{"$f":"【進行】結果入力表!I49","v":"樹本　武士"},null,{"$f":"【準備】登録!F13","v":180},{"$f":"IF(【進行】結果入力表!G49=\"\",\"\",【進行】結果入力表!G49)","v":123},null,{"$f":"IF(【進行】結果入力表!G63=\"\",\"\",【進行】結果入力表!G63)","v":115},null,null,null,{"$f":"IF(AX5=\"\",\"\",COUNTIF(AT7:AY7,\"w\"))","v":0},{"$f":"IF(AX5=\"\",\"\",COUNT(AT7,AV7))","v":2},{"$f":"SUM(AT7:AY7)+AZ7*AS7","v":238},null,{"$f":"IF(AX5=\"\",\"\",BB7/AS7*180)","v":238},{"$f":"IF(AX5=\"w\",180,AX5/AS7*180)+IF(AX6=\"w\",180,AX6/AS7*180)","v":360},{"$f":"AZ7*10000000+BD7*AZ10006*10000000+BD7*1000-BE7","v":237640},{"$f":"IF(AX5=\"\",\"\",RANK(BF5:BF7,BF5:BF7,0))","v":3}]
[]
[2,null,"Name",null,{"$f":"$E$4","v":"持点"},{"$f":"$A$5","v":"HRC"},null,{"$f":"$A$6","v":"NRC"},null,{"$f":"$A$7","v":"ORC"},null,"W","L","TP",null,"TP","LP","R_P","R",null,2,null,"Name",null,{"$f":"$E$4","v":"持点"},{"$f":"$A$5","v":"HRC"},null,{"$f":"$A$6","v":"NRC"},null,{"$f":"$A$7","v":"ORC"},null,"W","L","TP",null,"TP","LP","R_P","R",null,2,null,"Name",null,{"$f":"$E$4","v":"持点"},{"$f":"$A$5","v":"HRC"},null,{"$f":"$A$6","v":"NRC"},null,{"$f":"$A$7","v":"ORC"},null,"W","L","TP",null,"TP","LP","R_P","R"]
[{"$f":"$A$5","v":"HRC"},null,{"$f":"【進行】結果入力表!D8","v":"堂園　雅也"},null,{"$f":"【準備】登録!I11","v":180},null,null,{"$f":"IF(【進行】結果入力表!F15=\"\",\"\",【進行】結果入力表!F15)","v":137},null,{"$f":"IF(【進行】結果入力表!F8=\"\",\"\",【進行】結果入力表!F8)","v":"w"},null,{"$f":"IF(J10=\"\",\"\",COUNTIF(F10:K10,\"w\"))","v":1},{"$f":"IF(J10=\"\",\"\",COUNT(H10,J10))","v":1},{"$f":"SUM(F10:K10)+L10*E10","v":317},null,{"$f":"IF(J10=\"\",\"\",N10/E10*180)","v":317},{"$f":"IF(F11=\"w\",180,F11/E10*180)+IF(F12=\"w\",180,F12/E10*180)","v":321},{"$f":"L10*10000000+P10*L10009*10000000+P10*1000-Q10","v":10316679},{"$f":"IF(J10=\"\",\"\",RANK(R10:R12,R10:R12,0))","v":2},null,{"$f":"$A$5","v":"HRC"},null,{"$f":"【進行】結果入力表!D36","v":"中平　美輪"},null,{"$f":"【準備】登録!X11","v":140},null,null,{"$f":"IF(【進行】結果入力表!F36=\"\",\"\",【進行】結果入力表!F36)","v":45},null,{"$f":"IF(【進行】結果入力表!F29=\"\",\"\",【進行】結果入力表!F29)","v":97},null,{"$f":"IF(AD10=\"\",\"\",COUNTIF(Z10:AE10,\"w\"))","v":0},{"$f":"IF(AD10=\"\",\"\",COUNT(AB10,AD10))","v":2},{"$f":"SUM(Z10:AE10)+AF10*Y10","v":142},null,{"$f":"IF(AD10=\"\",\"\",AH10/Y10*180)","v":182.57142857142856},{"$f":"IF(Z11=\"w\",180,Z11/Y10*180)+IF(Z12=\"w\",180,Z12/Y10*180)","v":360},{"$f":"AF10*10000000+AJ10*AF10009*10000000+AJ10*1000-AK10","v":182211.42857142855},{"$f":"IF(AD10=\"\",\"\",RANK(AL10:AL12,AL10:AL12,0))","v":3},null,{"$f":"$A$5","v":"HRC"},null,{"$f":"【進行】結果入力表!D57","v":"高山　普任"},null,{"$f":"【準備】登録!R11","v":180},null,null,{"$f":"IF(【進行】結果入力表!F57=\"\",\"\",【進行】結果入力表!F57)","v":"w"},null,{"$f":"IF(【進行】結果入力表!F50=\"\",\"\",【進行】結果入力表!F50)","v":160},null,{"$f":"IF(AX10=\"\",\"\",COUNTIF(AT10:AY10,\"w\"))","v":1},{"$f":"IF(AX10=\"\",\"\",COUNT(AV10,AX10))","v":1},{"$f":"SUM(AT10:AY10)+AZ10*AS10","v":340},null,{"$f":"IF(AX10=\"\",\"\",BB10/AS10*180)","v":340},{"$f":"IF(AT11=\"w\",180,AT11/AS10*180)+IF(AT12=\"w\",180,AT12/AS10*180)","v":255},{"$f":"AZ10*10000000+BD10*AZ10009*10000000+BD10*1000-BE10","v":10339745},{"$f":"IF(AX10=\"\",\"\",RANK(BF10:BF12,BF10:BF12,0))","v":2}]
[{"$f":"$A$6","v":"NRC"},null,{"$f":"【進行】結果入力表!I15","v":"近藤　拓馬"},null,{"$f":"【準備】登録!I12","v":180},{"$f":"IF(【進行】結果入力表!G15=\"\",\"\",【進行】結果入力表!G15)","v":"w"},null,null,null,{"$f":"IF(【進行】結果入力表!F22=\"\",\"\",【進行】結果入力表!F22)","v":"w"},null,{"$f":"IF(J10=\"\",\"\",COUNTIF(F11:K11,\"w\"))","v":2},{"$f":"IF(J10=\"\",\"\",COUNT(F11,J11))","v":0},{"$f":"SUM(F11:K11)+L11*E11","v":360},null,{"$f":"IF(J10=\"\",\"\",N11/E11*180)","v":360},{"$f":"IF(H10=\"w\",180,H10/E11*180)+IF(H12=\"w\",180,H12/E11*180)","v":246},{"$f":"L11*10000000+P11*L10010*10000000+P11*1000-Q11","v":20359754},{"$f":"IF(J10=\"\",\"\",RANK(R10:R12,R10:R12,0))","v":1},null,{"$f":"$A$6","v":"NRC"},null,{"$f":"【進行】結果入力表!I36","v":"吉向　翔平"},null,{"$f":"【準備】登録!F12","v":180},{"$f":"IF(【進行】結果入力表!G36=\"\",\"\",【進行】結果入力表!G36)","v":"w"},null,null,null,{"$f":"IF(【進行】結果入力表!F43=\"\",\"\",【進行】結果入力表!F43)","v":"w"},null,{"$f":"IF(AD10=\"\",\"\",COUNTIF(Z11:AE11,\"w\"))","v":2},{"$f":"IF(AD10=\"\",\"\",COUNT(Z11,AD11))","v":0},{"$f":"SUM(Z11:AE11)+AF11*Y11","v":360},null,{"$f":"IF(AD10=\"\",\"\",AH11/Y11*180)","v":360},{"$f":"IF(AB10=\"w\",180,AB10/Y11*180)+IF(AB12=\"w\",180,AB12/Y11*180)","v":168},{"$f":"AF11*10000000+AJ11*AF10010*10000000+AJ11*1000-AK11","v":20359832},{"$f":"IF(AD10=\"\",\"\",RANK(AL10:AL12,AL10:AL12,0))","v":1},null,{"$f":"$A$6","v":"NRC"},null,{"$f":"【進行】結果入力表!I57","v":"宮野　早織"},null,{"$f":"【準備】登録!X12","v":140},{"$f":"IF(【進行】結果入力表!G57=\"\",\"\",【進行】結果入力表!G57)","v":75},null,null,null,{"$f":"IF(【進行】結果入力表!F64=\"\",\"\",【進行】結果入力表!F64)","v":9},null,{"$f":"IF(AX10=\"\",\"\",COUNTIF(AT11:AY11,\"w\"))","v":0},{"$f":"IF(AX10=\"\",\"\",COUNT(AT11,AX11))","v":2},{"$f":"SUM(AT11:AY11)+AZ11*AS11","v":84},null,{"$f":"IF(AX10=\"\",\"\",BB11/AS11*180)","v":108},{"$f":"IF(AV10=\"w\",180,AV10/AS11*180)+IF(AV12=\"w\",180,AV12/AS11*180)","v":360},{"$f":"AZ11*10000000+BD11*AZ10010*10000000+BD11*1000-BE11","v":107640},{"$f":"IF(AX10=\"\",\"\",RANK(BF10:BF12,BF10:BF12,0))","v":3}]
[{"$f":"$A$7","v":"ORC"},null,{"$f":"【進行】結果入力表!I8","v":"乾　伸綱"},null,{"$f":"【準備】登録!I13","v":180},{"$f":"IF(【進行】結果入力表!G8=\"\",\"\",【進行】結果入力表!G8)","v":141},null,{"$f":"IF(【進行】結果入力表!G22=\"\",\"\",【進行】結果入力表!G22)","v":109},null,null,null,{"$f":"IF(J10=\"\",\"\",COUNTIF(F12:K12,\"w\"))","v":0},{"$f":"IF(J10=\"\",\"\",COUNT(F12,H12))","v":2},{"$f":"SUM(F12:K12)+L12*E12","v":250},null,{"$f":"IF(J10=\"\",\"\",N12/E12*180)","v":250},{"$f":"IF(J10=\"w\",180,J10/E12*180)+IF(J11=\"w\",180,J11/E12*180)","v":360},{"$f":"L12*10000000+P12*L10011*10000000+P12*1000-Q12","v":249640},{"$f":"IF(J10=\"\",\"\",RANK(R10:R12,R10:R12,0))","v":3},null,{"$f":"$A$7","v":"ORC"},null,{"$f":"【進行】結果入力表!I29","v":"乾　伸綱"},null,{"$f":"【準備】登録!I13","v":180},{"$f":"IF(【進行】結果入力表!G29=\"\",\"\",【進行】結果入力表!G29)","v":"w"},null,{"$f":"IF(【進行】結果入力表!G43=\"\",\"\",【進行】結果入力表!G43)","v":123},null,null,null,{"$f":"IF(AD10=\"\",\"\",COUNTIF(Z12:AE12,\"w\"))","v":1},{"$f":"IF(AD10=\"\",\"\",COUNT(Z12,AB12))","v":1},{"$f":"SUM(Z12:AE12)+AF12*Y12","v":303},null,{"$f":"IF(AD10=\"\",\"\",AH12/Y12*180)","v":303},{"$f":"IF(AD10=\"w\",180,AD10/Y12*180)+IF(AD11=\"w\",180,AD11/Y12*180)","v":277},{"$f":"AF12*10000000+AJ12*AF10011*10000000+AJ12*1000-AK12","v":10302723},{"$f":"IF(AD10=\"\",\"\",RANK(AL10:AL12,AL10:AL12,0))","v":2},null,{"$f":"$A$7","v":"ORC"},null,{"$f":"【進行】結果入力表!I50","v":"乾　伸綱"},null,{"$f":"【準備】登録!I13","v":180},{"$f":"IF(【進行】結果入力表!G50=\"\",\"\",【進行】結果入力表!G50)","v":"w"},null,{"$f":"IF(【進行】結果入力表!G64=\"\",\"\",【進行】結果入力表!G64)","v":"w"},null,null,null,{"$f":"IF(AX10=\"\",\"\",COUNTIF(AT12:AY12,\"w\"))","v":2},{"$f":"IF(AX10=\"\",\"\",COUNT(AT12,AV12))","v":0},{"$f":"SUM(AT12:AY12)+AZ12*AS12","v":360},null,{"$f":"IF(AX10=\"\",\"\",BB12/AS12*180)","v":360},{"$f":"IF(AX10=\"w\",180,AX10/AS12*180)+IF(AX11=\"w\",180,AX11/AS12*180)","v":169},{"$f":"AZ12*10000000+BD12*AZ10011*10000000+BD12*1000-BE12","v":20359831},{"$f":"IF(AX10=\"\",\"\",RANK(BF10:BF12,BF10:BF12,0))","v":1}]
[]
[3,null,"Name",null,{"$f":"E$4","v":"持点"},{"$f":"$A$5","v":"HRC"},null,{"$f":"$A$6","v":"NRC"},null,{"$f":"$A$7","v":"ORC"},null,"W","L","TP",null,"TP","LP","R_P","R",null,3,null,"Name",null,{"$f":"$E$4","v":"持点"},{"$f":"$A$5","v":"HRC"},null,{"$f":"$A$6","v":"NRC"},null,{"$f":"$A$7","v":"ORC"},null,"W","L","TP",null,"TP","LP","R_P","R",null,3,null,"Name",null,{"$f":"$E$4","v":"持点"},{"$f":"$A$5","v":"HRC"},null,{"$f":"$A$6","v":"NRC"},null,{"$f":"$A$7","v":"ORC"},null,"W","L","TP",null,"TP","LP","R_P","R"]
[{"$f":"$A$5","v":"HRC"},null,{"$f":"【進行】結果入力表!D9","v":"菊川　博功"},null,{"$f":"【準備】登録!L11","v":180},null,null,{"$f":"IF(【進行】結果入力表!F16=\"\",\"\",【進行】結果入力表!F16)","v":"w"},null,{"$f":"IF(【進行】結果入力表!F9=\"\",\"\",【進行】結果入力表!F9)","v":"w"},null,{"$f":"IF(J15=\"\",\"\",COUNTIF(F15:K15,\"w\"))","v":2},{"$f":"IF(J15=\"\",\"\",COUNT(H15,J15))","v":0},{"$f":"SUM(F15:K15)+L15*E15","v":360},null,{"$f":"IF(J15=\"\",\"\",N15/E15*180)","v":360},{"$f":"IF(F16=\"w\",180,F16/E15*180)+IF(F17=\"w\",180,F17/E15*180)","v":294},{"$f":"L15*10000000+P15*L10014*10000000+P15*1000-Q15","v":20359706},{"$f":"IF(J15=\"\",\"\",RANK(R15:R17,R15:R17,0))","v":1},null,{"$f":"$A$5","v":"HRC"},null,{"$f":"【進行】結果入力表!D37","v":"高木　俊行"},null,{"$f":"【準備】登録!F11","v":180},null,null,{"$f":"IF(【進行】結果入力表!F37=\"\",\"\",【進行】結果入力表!F37)","v":"w"},null,{"$f":"IF(【進行】結果入力表!F30=\"\",\"\",【進行】結果入力表!F30)","v":10},null,{"$f":"IF(AD15=\"\",\"\",COUNTIF(Z15:AE15,\"w\"))","v":1},{"$f":"IF(AD15=\"\",\"\",COUNT(AB15,AD15))","v":1},{"$f":"SUM(Z15:AE15)+AF15*Y15","v":190},null,{"$f":"IF(AD15=\"\",\"\",AH15/Y15*180)","v":190},{"$f":"IF(Z16=\"w\",180,Z16/Y15*180)+IF(Z17=\"w\",180,Z17/Y15*180)","v":290},{"$f":"AF15*10000000+AJ15*AF10014*10000000+AJ15*1000-AK15","v":10189710},{"$f":"IF(AD15=\"\",\"\",RANK(AL15:AL17,AL15:AL17,0))","v":2},null,{"$f":"$A$5","v":"HRC"},null,{"$f":"【進行】結果入力表!D58","v":"藤中健太郎"},null,{"$f":"【準備】登録!U11","v":180},null,null,{"$f":"IF(【進行】結果入力表!F58=\"\",\"\",【進行】結果入力表!F58)","v":3},null,{"$f":"IF(【進行】結果入力表!F51=\"\",\"\",【進行】結果入力表!F51)","v":2},null,{"$f":"IF(AX15=\"\",\"\",COUNTIF(AT15:AY15,\"w\"))","v":0},{"$f":"IF(AX15=\"\",\"\",COUNT(AV15,AX15))","v":2},{"$f":"SUM(AT15:AY15)+AZ15*AS15","v":5},null,{"$f":"IF(AX15=\"\",\"\",BB15/AS15*180)","v":5},{"$f":"IF(AT16=\"w\",180,AT16/AS15*180)+IF(AT17=\"w\",180,AT17/AS15*180)","v":360},{"$f":"AZ15*10000000+BD15*AZ10014*10000000+BD15*1000-BE15","v":4640},{"$f":"IF(AX15=\"\",\"\",RANK(BF15:BF17,BF15:BF17,0))","v":3}]
[{"$f":"$A$6","v":"NRC"},null,{"$f":"【進行】結果入力表!I16","v":"金澤　茂昌"},null,{"$f":"【準備】登録!L12","v":180},{"$f":"IF(【進行】結果入力表!G16=\"\",\"\",【進行】結果入力表!G16)","v":115},null,null,null,{"$f":"IF(【進行】結果入力表!F23=\"\",\"\",【進行】結果入力表!F23)","v":1},null,{"$f":"IF(J15=\"\",\"\",COUNTIF(F16:K16,\"w\"))","v":0},{"$f":"IF(J15=\"\",\"\",COUNT(F16,J16))","v":2},{"$f":"SUM(F16:K16)+L16*E16","v":116},null,{"$f":"IF(J15=\"\",\"\",N16/E16*180)","v":116.00000000000001},{"$f":"IF(H15=\"w\",180,H15/E16*180)+IF(H17=\"w\",180,H17/E16*180)","v":360},{"$f":"L16*10000000+P16*L10015*10000000+P16*1000-Q16","v":115640.00000000001},{"$f":"IF(J15=\"\",\"\",RANK(R15:R17,R15:R17,0))","v":3},null,{"$f":"$A$6","v":"NRC"},null,{"$f":"【進行】結果入力表!I37","v":"近藤　拓馬"},null,{"$f":"【準備】登録!I12","v":180},{"$f":"IF(【進行】結果入力表!G37=\"\",\"\",【進行】結果入力表!G37)","v":110},null,null,null,{"$f":"IF(【進行】結果入力表!F44=\"\",\"\",【進行】結果入力表!F44)","v":115},null,{"$f":"IF(AD15=\"\",\"\",COUNTIF(Z16:AE16,\"w\"))","v":0},{"$f":"IF(AD15=\"\",\"\",COUNT(Z16,AD16))","v":2},{"$f":"SUM(Z16:AE16)+AF16*Y16","v":225},null,{"$f":"IF(AD15=\"\",\"\",AH16/Y16*180)","v":225},{"$f":"IF(AB15=\"w\",180,AB15/Y16*180)+IF(AB17=\"w\",180,AB17/Y16*180)","v":360},{"$f":"AF16*10000000+AJ16*AF10015*10000000+AJ16*1000-AK16","v":224640},{"$f":"IF(AD15=\"\",\"\",RANK(AL15:AL17,AL15:AL17,0))","v":3},null,{"$f":"$A$6","v":"NRC"},null,{"$f":"【進行】結果入力表!I58","v":"吉向　翔平"},null,{"$f":"【準備】登録!F12","v":180},{"$f":"IF(【進行】結果入力表!G58=\"\",\"\",【進行】結果入力表!G58)","v":"w"},null,null,null,{"$f":"IF(【進行】結果入力表!F65=\"\",\"\",【進行】結果入力表!F65)","v":33},null,{"$f":"IF(AX15=\"\",\"\",COUNTIF(AT16:AY16,\"w\"))","v":1},{"$f":"IF(AX15=\"\",\"\",COUNT(AT16,AX16))","v":1},{"$f":"SUM(AT16:AY16)+AZ16*AS16","v":213},null,{"$f":"IF(AX15=\"\",\"\",BB16/AS16*180)","v":213},{"$f":"IF(AV15=\"w\",180,AV15/AS16*180)+IF(AV17=\"w\",180,AV17/AS16*180)","v":183},{"$f":"AZ16*10000000+BD16*AZ10015*10000000+BD16*1000-BE16","v":10212817},{"$f":"IF(AX15=\"\",\"\",RANK(BF15:BF17,BF15:BF17,0))","v":2}]
[{"$f":"$A$7","v":"ORC"},null,{"$f":"【進行】結果入力表!I9","v":"村上　泰辰"},null,{"$f":"【準備】登録!L13","v":180},{"$f":"IF(【進行】結果入力表!G9=\"\",\"\",【進行】結果入力表!G9)","v":179},null,{"$f":"IF(【進行】結果入力表!G23=\"\",\"\",【進行】結果入力表!G23)","v":"w"},null,null,null,{"$f":"IF(J15=\"\",\"\",COUNTIF(F17:K17,\"w\"))","v":1},{"$f":"IF(J15=\"\",\"\",COUNT(F17,H17))","v":1},{"$f":"SUM(F17:K17)+L17*E17","v":359},null,{"$f":"IF(J15=\"\",\"\",N17/E17*180)","v":359},{"$f":"IF(J15=\"w\",180,J15/E17*180)+IF(J16=\"w\",180,J16/E17*180)","v":181},{"$f":"L17*10000000+P17*L10016*10000000+P17*1000-Q17","v":10358819},{"$f":"IF(J15=\"\",\"\",RANK(R15:R17,R15:R17,0))","v":2},null,{"$f":"$A$7","v":"ORC"},null,{"$f":"【進行】結果入力表!I30","v":"村上　泰辰"},null,{"$f":"【準備】登録!L13","v":180},{"$f":"IF(【進行】結果入力表!G30=\"\",\"\",【進行】結果入力表!G30)","v":"w"},null,{"$f":"IF(【進行】結果入力表!G44=\"\",\"\",【進行】結果入力表!G44)","v":"w"},null,null,null,{"$f":"IF(AD15=\"\",\"\",COUNTIF(Z17:AE17,\"w\"))","v":2},{"$f":"IF(AD15=\"\",\"\",COUNT(Z17,AB17))","v":0},{"$f":"SUM(Z17:AE17)+AF17*Y17","v":360},null,{"$f":"IF(AD15=\"\",\"\",AH17/Y17*180)","v":360},{"$f":"IF(AD15=\"w\",180,AD15/Y17*180)+IF(AD16=\"w\",180,AD16/Y17*180)","v":124.99999999999999},{"$f":"AF17*10000000+AJ17*AF10016*10000000+AJ17*1000-AK17","v":20359875},{"$f":"IF(AD15=\"\",\"\",RANK(AL15:AL17,AL15:AL17,0))","v":1},null,{"$f":"$A$7","v":"ORC"},null,{"$f":"【進行】結果入力表!I51","v":"村上　泰辰"},null,{"$f":"【準備】登録!L13","v":180},{"$f":"IF(【進行】結果入力表!G51=\"\",\"\",【進行】結果入力表!G51)","v":"w"},null,{"$f":"IF(【進行】結果入力表!G65=\"\",\"\",【進行】結果入力表!G65)","v":"w"},null,null,null,{"$f":"IF(AX15=\"\",\"\",COUNTIF(AT17:AY17,\"w\"))","v":2},{"$f":"IF(AX15=\"\",\"\",COUNT(AT17,AV17))","v":0},{"$f":"SUM(AT17:AY17)+AZ17*AS17","v":360},null,{"$f":"IF(AX15=\"\",\"\",BB17/AS17*180)","v":360},{"$f":"IF(AX15=\"w\",180,AX15/AS17*180)+IF(AX16=\"w\",180,AX16/AS17*180)","v":35},{"$f":"AZ17*10000000+BD17*AZ10016*10000000+BD17*1000-BE17","v":20359965},{"$f":"IF(AX15=\"\",\"\",RANK(BF15:BF17,BF15:BF17,0))","v":1}]
[]
[4,null,"Name",null,{"$f":"E$4","v":"持点"},{"$f":"$A$5","v":"HRC"},null,{"$f":"$A$6","v":"NRC"},null,{"$f":"$A$7","v":"ORC"},null,"W","L","TP",null,"TP","LP","R_P","R",null,4,null,"Name",null,{"$f":"$E$4","v":"持点"},{"$f":"$A$5","v":"HRC"},null,{"$f":"$A$6","v":"NRC"},null,{"$f":"$A$7","v":"ORC"},null,"W","L","TP",null,"TP","LP","R_P","R",null,4,null,"Name",null,{"$f":"$E$4","v":"持点"},{"$f":"$A$5","v":"HRC"},null,{"$f":"$A$6","v":"NRC"},null,{"$f":"$A$7","v":"ORC"},null,"W","L","TP",null,"TP","LP","R_P","R"]
[{"$f":"$A$5","v":"HRC"},null,{"$f":"【進行】結果入力表!D10","v":"丹羽　俊也"},null,{"$f":"【準備】登録!O11","v":180},null,null,{"$f":"IF(【進行】結果入力表!F17=\"\",\"\",【進行】結果入力表!F17)","v":87},null,{"$f":"IF(【進行】結果入力表!F10=\"\",\"\",【進行】結果入力表!F10)","v":103},null,{"$f":"IF(J20=\"\",\"\",COUNTIF(F20:K20,\"w\"))","v":0},{"$f":"IF(J20=\"\",\"\",COUNT(H20,J20))","v":2},{"$f":"SUM(F20:K20)+L20*E20","v":190},null,{"$f":"IF(J20=\"\",\"\",N20/E20*180)","v":190},{"$f":"IF(F21=\"w\",180,F21/E20*180)+IF(F22=\"w\",180,F22/E20*180)","v":360},{"$f":"L20*10000000+P20*L10019*10000000+P20*1000-Q20","v":189640},{"$f":"IF(J20=\"\",\"\",RANK(R20:R22,R20:R22,0))","v":3},null,{"$f":"$A$5","v":"HRC"},null,{"$f":"【進行】結果入力表!D38","v":"堂園　雅也"},null,{"$f":"【準備】登録!I11","v":180},null,null,{"$f":"IF(【進行】結果入力表!F38=\"\",\"\",【進行】結果入力表!F38)","v":"w"},null,{"$f":"IF(【進行】結果入力表!F31=\"\",\"\",【進行】結果入力表!F31)","v":35},null,{"$f":"IF(AD20=\"\",\"\",COUNTIF(Z20:AE20,\"w\"))","v":1},{"$f":"IF(AD20=\"\",\"\",COUNT(AB20,AD20))","v":1},{"$f":"SUM(Z20:AE20)+AF20*Y20","v":215},null,{"$f":"IF(AD20=\"\",\"\",AH20/Y20*180)","v":215},{"$f":"IF(Z21=\"w\",180,Z21/Y20*180)+IF(Z22=\"w\",180,Z22/Y20*180)","v":315},{"$f":"AF20*10000000+AJ20*AF10019*10000000+AJ20*1000-AK20","v":10214685},{"$f":"IF(AD20=\"\",\"\",RANK(AL20:AL22,AL20:AL22,0))","v":2},null,{"$f":"$A$5","v":"HRC"},null,{"$f":"【進行】結果入力表!D59","v":"中平　美輪"},null,{"$f":"【準備】登録!X11","v":140},null,null,{"$f":"IF(【進行】結果入力表!F59=\"\",\"\",【進行】結果入力表!F59)","v":56},null,{"$f":"IF(【進行】結果入力表!F52=\"\",\"\",【進行】結果入力表!F52)","v":10},null,{"$f":"IF(AX20=\"\",\"\",COUNTIF(AT20:AY20,\"w\"))","v":0},{"$f":"IF(AX20=\"\",\"\",COUNT(AV20,AX20))","v":2},{"$f":"SUM(AT20:AY20)+AZ20*AS20","v":66},null,{"$f":"IF(AX20=\"\",\"\",BB20/AS20*180)","v":84.857142857142861},{"$f":"IF(AT21=\"w\",180,AT21/AS20*180)+IF(AT22=\"w\",180,AT22/AS20*180)","v":360},{"$f":"AZ20*10000000+BD20*AZ10019*10000000+BD20*1000-BE20","v":84497.142857142855},{"$f":"IF(AX20=\"\",\"\",RANK(BF20:BF22,BF20:BF22,0))","v":3}]
[{"$f":"$A$6","v":"NRC"},null,{"$f":"【進行】結果入力表!I17","v":"斉藤　裕児"},null,{"$f":"【準備】登録!O12","v":180},{"$f":"IF(【進行】結果入力表!G17=\"\",\"\",【進行】結果入力表!G17)","v":"w"},null,null,null,{"$f":"IF(【進行】結果入力表!F24=\"\",\"\",【進行】結果入力表!F24)","v":82},null,{"$f":"IF(J20=\"\",\"\",COUNTIF(F21:K21,\"w\"))","v":1},{"$f":"IF(J20=\"\",\"\",COUNT(F21,J21))","v":1},{"$f":"SUM(F21:K21)+L21*E21","v":262},null,{"$f":"IF(J20=\"\",\"\",N21/E21*180)","v":262},{"$f":"IF(H20=\"w\",180,H20/E21*180)+IF(H22=\"w\",180,H22/E21*180)","v":267},{"$f":"L21*10000000+P21*L10020*10000000+P21*1000-Q21","v":10261733},{"$f":"IF(J20=\"\",\"\",RANK(R20:R22,R20:R22,0))","v":2},null,{"$f":"$A$6","v":"NRC"},null,{"$f":"【進行】結果入力表!I38","v":"金澤　茂昌"},null,{"$f":"【準備】登録!L12","v":180},{"$f":"IF(【進行】結果入力表!G38=\"\",\"\",【進行】結果入力表!G38)","v":135},null,null,null,{"$f":"IF(【進行】結果入力表!F45=\"\",\"\",【進行】結果入力表!F45)","v":104},null,{"$f":"IF(AD20=\"\",\"\",COUNTIF(Z21:AE21,\"w\"))","v":0},{"$f":"IF(AD20=\"\",\"\",COUNT(Z21,AD21))","v":2},{"$f":"SUM(Z21:AE21)+AF21*Y21","v":239},null,{"$f":"IF(AD20=\"\",\"\",AH21/Y21*180)","v":239},{"$f":"IF(AB20=\"w\",180,AB20/Y21*180)+IF(AB22=\"w\",180,AB22/Y21*180)","v":360},{"$f":"AF21*10000000+AJ21*AF10020*10000000+AJ21*1000-AK21","v":238640},{"$f":"IF(AD20=\"\",\"\",RANK(AL20:AL22,AL20:AL22,0))","v":3},null,{"$f":"$A$6","v":"NRC"},null,{"$f":"【進行】結果入力表!I59","v":"近藤　拓馬"},null,{"$f":"【準備】登録!I12","v":180},{"$f":"IF(【進行】結果入力表!G59=\"\",\"\",【進行】結果入力表!G59)","v":"w"},null,null,null,{"$f":"IF(【進行】結果入力表!F66=\"\",\"\",【進行】結果入力表!F66)","v":67},null,{"$f":"IF(AX20=\"\",\"\",COUNTIF(AT21:AY21,\"w\"))","v":1},{"$f":"IF(AX20=\"\",\"\",COUNT(AT21,AX21))","v":1},{"$f":"SUM(AT21:AY21)+AZ21*AS21","v":247},null,{"$f":"IF(AX20=\"\",\"\",BB21/AS21*180)","v":247},{"$f":"IF(AV20=\"w\",180,AV20/AS21*180)+IF(AV22=\"w\",180,AV22/AS21*180)","v":236},{"$f":"AZ21*10000000+BD21*AZ10020*10000000+BD21*1000-BE21","v":10246764},{"$f":"IF(AX20=\"\",\"\",RANK(BF20:BF22,BF20:BF22,0))","v":2}]
[{"$f":"$A$7","v":"ORC"},null,{"$f":"【進行】結果入力表!I10","v":"山岡　修二"},null,{"$f":"【準備】登録!O13","v":180},{"$f":"IF(【進行】結果入力表!G10=\"\",\"\",【進行】結果入力表!G10)","v":"w"},null,{"$f":"IF(【進行】結果入力表!G24=\"\",\"\",【進行】結果入力表!G24)","v":"w"},null,null,null,{"$f":"IF(J20=\"\",\"\",COUNTIF(F22:K22,\"w\"))","v":2},{"$f":"IF(J20=\"\",\"\",COUNT(F22,H22))","v":0},{"$f":"SUM(F22:K22)+L22*E22","v":360},null,{"$f":"IF(J20=\"\",\"\",N22/E22*180)","v":360},{"$f":"IF(J20=\"w\",180,J20/E22*180)+IF(J21=\"w\",180,J21/E22*180)","v":185},{"$f":"L22*10000000+P22*L10021*10000000+P22*1000-Q22","v":20359815},{"$f":"IF(J20=\"\",\"\",RANK(R20:R22,R20:R22,0))","v":1},null,{"$f":"$A$7","v":"ORC"},null,{"$f":"【進行】結果入力表!I31","v":"山岡　修二"},null,{"$f":"【準備】登録!O13","v":180},{"$f":"IF(【進行】結果入力表!G31=\"\",\"\",【進行】結果入力表!G31)","v":"w"},null,{"$f":"IF(【進行】結果入力表!G45=\"\",\"\",【進行】結果入力表!G45)","v":"w"},null,null,null,{"$f":"IF(AD20=\"\",\"\",COUNTIF(Z22:AE22,\"w\"))","v":2},{"$f":"IF(AD20=\"\",\"\",COUNT(Z22,AB22))","v":0},{"$f":"SUM(Z22:AE22)+AF22*Y22","v":360},null,{"$f":"IF(AD20=\"\",\"\",AH22/Y22*180)","v":360},{"$f":"IF(AD20=\"w\",180,AD20/Y22*180)+IF(AD21=\"w\",180,AD21/Y22*180)","v":139},{"$f":"AF22*10000000+AJ22*AF10021*10000000+AJ22*1000-AK22","v":20359861},{"$f":"IF(AD20=\"\",\"\",RANK(AL20:AL22,AL20:AL22,0))","v":1},null,{"$f":"$A$7","v":"ORC"},null,{"$f":"【進行】結果入力表!I52","v":"山岡　修二"},null,{"$f":"【準備】登録!O13","v":180},{"$f":"IF(【進行】結果入力表!G52=\"\",\"\",【進行】結果入力表!G52)","v":"w"},null,{"$f":"IF(【進行】結果入力表!G66=\"\",\"\",【進行】結果入力表!G66)","v":"w"},null,null,null,{"$f":"IF(AX20=\"\",\"\",COUNTIF(AT22:AY22,\"w\"))","v":2},{"$f":"IF(AX20=\"\",\"\",COUNT(AT22,AV22))","v":0},{"$f":"SUM(AT22:AY22)+AZ22*AS22","v":360},null,{"$f":"IF(AX20=\"\",\"\",BB22/AS22*180)","v":360},{"$f":"IF(AX20=\"w\",180,AX20/AS22*180)+IF(AX21=\"w\",180,AX21/AS22*180)","v":77},{"$f":"AZ22*10000000+BD22*AZ10021*10000000+BD22*1000-BE22","v":20359923},{"$f":"IF(AX20=\"\",\"\",RANK(BF20:BF22,BF20:BF22,0))","v":1}]
[]
[5,null,"Name",null,{"$f":"E$4","v":"持点"},{"$f":"$A$5","v":"HRC"},null,{"$f":"$A$6","v":"NRC"},null,{"$f":"$A$7","v":"ORC"},null,"W","L","TP",null,"TP","LP","R_P","R",null,5,null,"Name",null,{"$f":"$E$4","v":"持点"},{"$f":"$A$5","v":"HRC"},null,{"$f":"$A$6","v":"NRC"},null,{"$f":"$A$7","v":"ORC"},null,"W","L","TP",null,"TP","LP","R_P","R",null,5,null,"Name",null,{"$f":"$E$4","v":"持点"},{"$f":"$A$5","v":"HRC"},null,{"$f":"$A$6","v":"NRC"},null,{"$f":"$A$7","v":"ORC"},null,"W","L","TP",null,"TP","LP","R_P","R"]
[{"$f":"$A$5","v":"HRC"},null,{"$f":"【進行】結果入力表!D11","v":"高山　普任"},null,{"$f":"【準備】登録!R11","v":180},null,null,{"$f":"IF(【進行】結果入力表!F18=\"\",\"\",【進行】結果入力表!F18)","v":"w"},null,{"$f":"IF(【進行】結果入力表!F11=\"\",\"\",【進行】結果入力表!F11)","v":"w"},null,{"$f":"IF(J25=\"\",\"\",COUNTIF(F25:K25,\"w\"))","v":2},{"$f":"IF(J25=\"\",\"\",COUNT(H25,J25))","v":0},{"$f":"SUM(F25:K25)+L25*E25","v":360},null,{"$f":"IF(J25=\"\",\"\",N25/E25*180)","v":360},{"$f":"IF(F26=\"w\",180,F26/E25*180)+IF(F27=\"w\",180,F27/E25*180)","v":189},{"$f":"L25*10000000+P25*L10024*10000000+P25*1000-Q25","v":20359811},{"$f":"IF(J25=\"\",\"\",RANK(R25:R27,R25:R27,0))","v":1},null,{"$f":"$A$5","v":"HRC"},null,{"$f":"【進行】結果入力表!D39","v":"菊川　博功"},null,{"$f":"【準備】登録!L11","v":180},null,null,{"$f":"IF(【進行】結果入力表!F39=\"\",\"\",【進行】結果入力表!F39)","v":"w"},null,{"$f":"IF(【進行】結果入力表!F32=\"\",\"\",【進行】結果入力表!F32)","v":29},null,{"$f":"IF(AD25=\"\",\"\",COUNTIF(Z25:AE25,\"w\"))","v":1},{"$f":"IF(AD25=\"\",\"\",COUNT(AB25,AD25))","v":1},{"$f":"SUM(Z25:AE25)+AF25*Y25","v":209},null,{"$f":"IF(AD25=\"\",\"\",AH25/Y25*180)","v":209.00000000000003},{"$f":"IF(Z26=\"w\",180,Z26/Y25*180)+IF(Z27=\"w\",180,Z27/Y25*180)","v":318},{"$f":"AF25*10000000+AJ25*AF10024*10000000+AJ25*1000-AK25","v":10208682},{"$f":"IF(AD25=\"\",\"\",RANK(AL25:AL27,AL25:AL27,0))","v":2},null,{"$f":"$A$5","v":"HRC"},null,{"$f":"【進行】結果入力表!D60","v":"高木　俊行"},null,{"$f":"【準備】登録!F11","v":180},null,null,{"$f":"IF(【進行】結果入力表!F60=\"\",\"\",【進行】結果入力表!F60)","v":"w"},null,{"$f":"IF(【進行】結果入力表!F53=\"\",\"\",【進行】結果入力表!F53)","v":156},null,{"$f":"IF(AX25=\"\",\"\",COUNTIF(AT25:AY25,\"w\"))","v":1},{"$f":"IF(AX25=\"\",\"\",COUNT(AV25,AX25))","v":1},{"$f":"SUM(AT25:AY25)+AZ25*AS25","v":336},null,{"$f":"IF(AX25=\"\",\"\",BB25/AS25*180)","v":336},{"$f":"IF(AT26=\"w\",180,AT26/AS25*180)+IF(AT27=\"w\",180,AT27/AS25*180)","v":322},{"$f":"AZ25*10000000+BD25*AZ10024*10000000+BD25*1000-BE25","v":10335678},{"$f":"IF(AX25=\"\",\"\",RANK(BF25:BF27,BF25:BF27,0))","v":1}]
[{"$f":"$A$6","v":"NRC"},null,{"$f":"【進行】結果入力表!I18","v":"岩本　剛"},null,{"$f":"【準備】登録!R12","v":180},{"$f":"IF(【進行】結果入力表!G18=\"\",\"\",【進行】結果入力表!G18)","v":74},null,null,null,{"$f":"IF(【進行】結果入力表!F25=\"\",\"\",【進行】結果入力表!F25)","v":93},null,{"$f":"IF(J25=\"\",\"\",COUNTIF(F26:K26,\"w\"))","v":0},{"$f":"IF(J25=\"\",\"\",COUNT(F26,J26))","v":2},{"$f":"SUM(F26:K26)+L26*E26","v":167},null,{"$f":"IF(J25=\"\",\"\",N26/E26*180)","v":167},{"$f":"IF(H25=\"w\",180,H25/E26*180)+IF(H27=\"w\",180,H27/E26*180)","v":360},{"$f":"L26*10000000+P26*L10025*10000000+P26*1000-Q26","v":166640},{"$f":"IF(J25=\"\",\"\",RANK(R25:R27,R25:R27,0))","v":3},null,{"$f":"$A$6","v":"NRC"},null,{"$f":"【進行】結果入力表!I39","v":"斉藤　裕児"},null,{"$f":"【準備】登録!O12","v":180},{"$f":"IF(【進行】結果入力表!G39=\"\",\"\",【進行】結果入力表!G39)","v":138},null,null,null,{"$f":"IF(【進行】結果入力表!F46=\"\",\"\",【進行】結果入力表!F46)","v":100},null,{"$f":"IF(AD25=\"\",\"\",COUNTIF(Z26:AE26,\"w\"))","v":0},{"$f":"IF(AD25=\"\",\"\",COUNT(Z26,AD26))","v":2},{"$f":"SUM(Z26:AE26)+AF26*Y26","v":238},null,{"$f":"IF(AD25=\"\",\"\",AH26/Y26*180)","v":238},{"$f":"IF(AB25=\"w\",180,AB25/Y26*180)+IF(AB27=\"w\",180,AB27/Y26*180)","v":360},{"$f":"AF26*10000000+AJ26*AF10025*10000000+AJ26*1000-AK26","v":237640},{"$f":"IF(AD25=\"\",\"\",RANK(AL25:AL27,AL25:AL27,0))","v":3},null,{"$f":"$A$6","v":"NRC"},null,{"$f":"【進行】結果入力表!I60","v":"金澤　茂昌"},null,{"$f":"【準備】登録!L12","v":180},{"$f":"IF(【進行】結果入力表!G60=\"\",\"\",【進行】結果入力表!G60)","v":142},null,null,null,{"$f":"IF(【進行】結果入力表!F67=\"\",\"\",【進行】結果入力表!F67)","v":"w"},null,{"$f":"IF(AX25=\"\",\"\",COUNTIF(AT26:AY26,\"w\"))","v":1},{"$f":"IF(AX25=\"\",\"\",COUNT(AT26,AX26))","v":1},{"$f":"SUM(AT26:AY26)+AZ26*AS26","v":322},null,{"$f":"IF(AX25=\"\",\"\",BB26/AS26*180)","v":322},{"$f":"IF(AV25=\"w\",180,AV25/AS26*180)+IF(AV27=\"w\",180,AV27/AS26*180)","v":333},{"$f":"AZ26*10000000+BD26*AZ10025*10000000+BD26*1000-BE26","v":10321667},{"$f":"IF(AX25=\"\",\"\",RANK(BF25:BF27,BF25:BF27,0))","v":3}]
[{"$f":"$A$7","v":"ORC"},null,{"$f":"【進行】結果入力表!I11","v":"吉岡　保俊"},null,{"$f":"【準備】登録!R13","v":180},{"$f":"IF(【進行】結果入力表!G11=\"\",\"\",【進行】結果入力表!G11)","v":115},null,{"$f":"IF(【進行】結果入力表!G25=\"\",\"\",【進行】結果入力表!G25)","v":"w"},null,null,null,{"$f":"IF(J25=\"\",\"\",COUNTIF(F27:K27,\"w\"))","v":1},{"$f":"IF(J25=\"\",\"\",COUNT(F27,H27))","v":1},{"$f":"SUM(F27:K27)+L27*E27","v":295},null,{"$f":"IF(J25=\"\",\"\",N27/E27*180)","v":295},{"$f":"IF(J25=\"w\",180,J25/E27*180)+IF(J26=\"w\",180,J26/E27*180)","v":273},{"$f":"L27*10000000+P27*L10026*10000000+P27*1000-Q27","v":10294727},{"$f":"IF(J25=\"\",\"\",RANK(R25:R27,R25:R27,0))","v":2},null,{"$f":"$A$7","v":"ORC"},null,{"$f":"【進行】結果入力表!I32","v":"吉岡　保俊"},null,{"$f":"【準備】登録!R13","v":180},{"$f":"IF(【進行】結果入力表!G32=\"\",\"\",【進行】結果入力表!G32)","v":"w"},null,{"$f":"IF(【進行】結果入力表!G46=\"\",\"\",【進行】結果入力表!G46)","v":"w"},null,null,null,{"$f":"IF(AD25=\"\",\"\",COUNTIF(Z27:AE27,\"w\"))","v":2},{"$f":"IF(AD25=\"\",\"\",COUNT(Z27,AB27))","v":0},{"$f":"SUM(Z27:AE27)+AF27*Y27","v":360},null,{"$f":"IF(AD25=\"\",\"\",AH27/Y27*180)","v":360},{"$f":"IF(AD25=\"w\",180,AD25/Y27*180)+IF(AD26=\"w\",180,AD26/Y27*180)","v":129},{"$f":"AF27*10000000+AJ27*AF10026*10000000+AJ27*1000-AK27","v":20359871},{"$f":"IF(AD25=\"\",\"\",RANK(AL25:AL27,AL25:AL27,0))","v":1},null,{"$f":"$A$7","v":"ORC"},null,{"$f":"【進行】結果入力表!I53","v":"吉岡　保俊"},null,{"$f":"【準備】登録!R13","v":180},{"$f":"IF(【進行】結果入力表!G53=\"\",\"\",【進行】結果入力表!G53)","v":"w"},null,{"$f":"IF(【進行】結果入力表!G67=\"\",\"\",【進行】結果入力表!G67)","v":153},null,null,null,{"$f":"IF(AX25=\"\",\"\",COUNTIF(AT27:AY27,\"w\"))","v":1},{"$f":"IF(AX25=\"\",\"\",COUNT(AT27,AV27))","v":1},{"$f":"SUM(AT27:AY27)+AZ27*AS27","v":333},null,{"$f":"IF(AX25=\"\",\"\",BB27/AS27*180)","v":333},{"$f":"IF(AX25=\"w\",180,AX25/AS27*180)+IF(AX26=\"w\",180,AX26/AS27*180)","v":336},{"$f":"AZ27*10000000+BD27*AZ10026*10000000+BD27*1000-BE27","v":10332664},{"$f":"IF(AX25=\"\",\"\",RANK(BF25:BF27,BF25:BF27,0))","v":2}]
[]
[6,null,"Name",null,{"$f":"E$4","v":"持点"},{"$f":"$A$5","v":"HRC"},null,{"$f":"$A$6","v":"NRC"},null,{"$f":"$A$7","v":"ORC"},null,"W","L","TP",null,"TP","LP","R_P","R",null,6,null,"Name",null,{"$f":"$E$4","v":"持点"},{"$f":"$A$5","v":"HRC"},null,{"$f":"$A$6","v":"NRC"},null,{"$f":"$A$7","v":"ORC"},null,"W","L","TP",null,"TP","LP","R_P","R",null,6,null,"Name",null,{"$f":"$E$4","v":"持点"},{"$f":"$A$5","v":"HRC"},null,{"$f":"$A$6","v":"NRC"},null,{"$f":"$A$7","v":"ORC"},null,"W","L","TP",null,"TP","LP","R_P","R"]
[{"$f":"$A$5","v":"HRC"},null,{"$f":"【進行】結果入力表!D12","v":"藤中健太郎"},null,{"$f":"【準備】登録!U11","v":180},null,null,{"$f":"IF(【進行】結果入力表!F19=\"\",\"\",【進行】結果入力表!F19)","v":"w"},null,{"$f":"IF(【進行】結果入力表!F12=\"\",\"\",【進行】結果入力表!F12)","v":150},null,{"$f":"IF(J30=\"\",\"\",COUNTIF(F30:K30,\"w\"))","v":1},{"$f":"IF(J30=\"\",\"\",COUNT(H30,J30))","v":1},{"$f":"SUM(F30:K30)+L30*E30","v":330},null,{"$f":"IF(J30=\"\",\"\",N30/E30*180)","v":330},{"$f":"IF(F31=\"w\",180,F31/E30*180)+IF(F32=\"w\",180,F32/E30*180)","v":216},{"$f":"L30*10000000+P30*L10029*10000000+P30*1000-Q30","v":10329784},{"$f":"IF(J30=\"\",\"\",RANK(R30:R32,R30:R32,0))","v":1},null,{"$f":"$A$5","v":"HRC"},null,{"$f":"【進行】結果入力表!D40","v":"丹羽　俊也"},null,{"$f":"【準備】登録!O11","v":180},null,null,{"$f":"IF(【進行】結果入力表!F40=\"\",\"\",【進行】結果入力表!F40)","v":157},null,{"$f":"IF(【進行】結果入力表!F33=\"\",\"\",【進行】結果入力表!F33)","v":149},null,{"$f":"IF(AD30=\"\",\"\",COUNTIF(Z30:AE30,\"w\"))","v":0},{"$f":"IF(AD30=\"\",\"\",COUNT(AB30,AD30))","v":2},{"$f":"SUM(Z30:AE30)+AF30*Y30","v":306},null,{"$f":"IF(AD30=\"\",\"\",AH30/Y30*180)","v":306},{"$f":"IF(Z31=\"w\",180,Z31/Y30*180)+IF(Z32=\"w\",180,Z32/Y30*180)","v":360},{"$f":"AF30*10000000+AJ30*AF10029*10000000+AJ30*1000-AK30","v":305640},{"$f":"IF(AD30=\"\",\"\",RANK(AL30:AL32,AL30:AL32,0))","v":3},null,{"$f":"$A$5","v":"HRC"},null,{"$f":"【進行】結果入力表!D61","v":"堂園　雅也"},null,{"$f":"【準備】登録!I11","v":180},null,null,{"$f":"IF(【進行】結果入力表!F61=\"\",\"\",【進行】結果入力表!F61)","v":"w"},null,{"$f":"IF(【進行】結果入力表!F54=\"\",\"\",【進行】結果入力表!F54)","v":"w"},null,{"$f":"IF(AX30=\"\",\"\",COUNTIF(AT30:AY30,\"w\"))","v":2},{"$f":"IF(AX30=\"\",\"\",COUNT(AV30,AX30))","v":0},{"$f":"SUM(AT30:AY30)+AZ30*AS30","v":360},null,{"$f":"IF(AX30=\"\",\"\",BB30/AS30*180)","v":360},{"$f":"IF(AT31=\"w\",180,AT31/AS30*180)+IF(AT32=\"w\",180,AT32/AS30*180)","v":123},{"$f":"AZ30*10000000+BD30*AZ10029*10000000+BD30*1000-BE30","v":20359877},{"$f":"IF(AX30=\"\",\"\",RANK(BF30:BF32,BF30:BF32,0))","v":1}]
[{"$f":"$A$6","v":"NRC"},null,{"$f":"【進行】結果入力表!I19","v":"植田　慎也"},null,{"$f":"【準備】登録!U12","v":180},{"$f":"IF(【進行】結果入力表!G19=\"\",\"\",【進行】結果入力表!G19)","v":36},null,null,null,{"$f":"IF(【進行】結果入力表!F26=\"\",\"\",【進行】結果入力表!F26)","v":"w"},null,{"$f":"IF(J30=\"\",\"\",COUNTIF(F31:K31,\"w\"))","v":1},{"$f":"IF(J30=\"\",\"\",COUNT(F31,J31))","v":1},{"$f":"SUM(F31:K31)+L31*E31","v":216},null,{"$f":"IF(J30=\"\",\"\",N31/E31*180)","v":216},{"$f":"IF(H30=\"w\",180,H30/E31*180)+IF(H32=\"w\",180,H32/E31*180)","v":295},{"$f":"L31*10000000+P31*L10030*10000000+P31*1000-Q31","v":10215705},{"$f":"IF(J30=\"\",\"\",RANK(R30:R32,R30:R32,0))","v":3},null,{"$f":"$A$6","v":"NRC"},null,{"$f":"【進行】結果入力表!I40","v":"岩本　剛"},null,{"$f":"【準備】登録!R12","v":180},{"$f":"IF(【進行】結果入力表!G40=\"\",\"\",【進行】結果入力表!G40)","v":"w"},null,null,null,{"$f":"IF(【進行】結果入力表!F47=\"\",\"\",【進行】結果入力表!F47)","v":103},null,{"$f":"IF(AD30=\"\",\"\",COUNTIF(Z31:AE31,\"w\"))","v":1},{"$f":"IF(AD30=\"\",\"\",COUNT(Z31,AD31))","v":1},{"$f":"SUM(Z31:AE31)+AF31*Y31","v":283},null,{"$f":"IF(AD30=\"\",\"\",AH31/Y31*180)","v":283},{"$f":"IF(AB30=\"w\",180,AB30/Y31*180)+IF(AB32=\"w\",180,AB32/Y31*180)","v":337},{"$f":"AF31*10000000+AJ31*AF10030*10000000+AJ31*1000-AK31","v":10282663},{"$f":"IF(AD30=\"\",\"\",RANK(AL30:AL32,AL30:AL32,0))","v":2},null,{"$f":"$A$6","v":"NRC"},null,{"$f":"【進行】結果入力表!I61","v":"斉藤　裕児"},null,{"$f":"【準備】登録!O12","v":180},{"$f":"IF(【進行】結果入力表!G61=\"\",\"\",【進行】結果入力表!G61)","v":36},null,null,null,{"$f":"IF(【進行】結果入力表!F68=\"\",\"\",【進行】結果入力表!F68)","v":"w"},null,{"$f":"IF(AX30=\"\",\"\",COUNTIF(AT31:AY31,\"w\"))","v":1},{"$f":"IF(AX30=\"\",\"\",COUNT(AT31,AX31))","v":1},{"$f":"SUM(AT31:AY31)+AZ31*AS31","v":216},null,{"$f":"IF(AX30=\"\",\"\",BB31/AS31*180)","v":216},{"$f":"IF(AV30=\"w\",180,AV30/AS31*180)+IF(AV32=\"w\",180,AV32/AS31*180)","v":350},{"$f":"AZ31*10000000+BD31*AZ10030*10000000+BD31*1000-BE31","v":10215650},{"$f":"IF(AX30=\"\",\"\",RANK(BF30:BF32,BF30:BF32,0))","v":2}]
[{"$f":"$A$7","v":"ORC"},null,{"$f":"【進行】結果入力表!I12","v":"渡邊　孝行"},null,{"$f":"【準備】登録!U13","v":180},{"$f":"IF(【進行】結果入力表!G12=\"\",\"\",【進行】結果入力表!G12)","v":"w"},null,{"$f":"IF(【進行】結果入力表!G26=\"\",\"\",【進行】結果入力表!G26)","v":115},null,null,null,{"$f":"IF(J30=\"\",\"\",COUNTIF(F32:K32,\"w\"))","v":1},{"$f":"IF(J30=\"\",\"\",COUNT(F32,H32))","v":1},{"$f":"SUM(F32:K32)+L32*E32","v":295},null,{"$f":"IF(J30=\"\",\"\",N32/E32*180)","v":295},{"$f":"IF(J30=\"w\",180,J30/E32*180)+IF(J31=\"w\",180,J31/E32*180)","v":330},{"$f":"L32*10000000+P32*L10031*10000000+P32*1000-Q32","v":10294670},{"$f":"IF(J30=\"\",\"\",RANK(R30:R32,R30:R32,0))","v":2},null,{"$f":"$A$7","v":"ORC"},null,{"$f":"【進行】結果入力表!I33","v":"渡邊　孝行"},null,{"$f":"【準備】登録!U13","v":180},{"$f":"IF(【進行】結果入力表!G33=\"\",\"\",【進行】結果入力表!G33)","v":"w"},null,{"$f":"IF(【進行】結果入力表!G47=\"\",\"\",【進行】結果入力表!G47)","v":"w"},null,null,null,{"$f":"IF(AD30=\"\",\"\",COUNTIF(Z32:AE32,\"w\"))","v":2},{"$f":"IF(AD30=\"\",\"\",COUNT(Z32,AB32))","v":0},{"$f":"SUM(Z32:AE32)+AF32*Y32","v":360},null,{"$f":"IF(AD30=\"\",\"\",AH32/Y32*180)","v":360},{"$f":"IF(AD30=\"w\",180,AD30/Y32*180)+IF(AD31=\"w\",180,AD31/Y32*180)","v":252},{"$f":"AF32*10000000+AJ32*AF10031*10000000+AJ32*1000-AK32","v":20359748},{"$f":"IF(AD30=\"\",\"\",RANK(AL30:AL32,AL30:AL32,0))","v":1},null,{"$f":"$A$7","v":"ORC"},null,{"$f":"【進行】結果入力表!I54","v":"渡邊　孝行"},null,{"$f":"【準備】登録!U13","v":180},{"$f":"IF(【進行】結果入力表!G54=\"\",\"\",【進行】結果入力表!G54)","v":87},null,{"$f":"IF(【進行】結果入力表!G68=\"\",\"\",【進行】結果入力表!G68)","v":170},null,null,null,{"$f":"IF(AX30=\"\",\"\",COUNTIF(AT32:AY32,\"w\"))","v":0},{"$f":"IF(AX30=\"\",\"\",COUNT(AT32,AV32))","v":2},{"$f":"SUM(AT32:AY32)+AZ32*AS32","v":257},null,{"$f":"IF(AX30=\"\",\"\",BB32/AS32*180)","v":257},{"$f":"IF(AX30=\"w\",180,AX30/AS32*180)+IF(AX31=\"w\",180,AX31/AS32*180)","v":360},{"$f":"AZ32*10000000+BD32*AZ10031*10000000+BD32*1000-BE32","v":256640},{"$f":"IF(AX30=\"\",\"\",RANK(BF30:BF32,BF30:BF32,0))","v":3}]
[]
[7,null,"Name",null,{"$f":"E$4","v":"持点"},{"$f":"$A$5","v":"HRC"},null,{"$f":"$A$6","v":"NRC"},null,{"$f":"$A$7","v":"ORC"},null,"W","L","TP",null,"TP","LP","R_P","R",null,7,null,"Name",null,{"$f":"$E$4","v":"持点"},{"$f":"$A$5","v":"HRC"},null,{"$f":"$A$6","v":"NRC"},null,{"$f":"$A$7","v":"ORC"},null,"W","L","TP",null,"TP","LP","R_P","R",null,7,null,"Name",null,{"$f":"$E$4","v":"持点"},{"$f":"$A$5","v":"HRC"},null,{"$f":"$A$6","v":"NRC"},null,{"$f":"$A$7","v":"ORC"},null,"W","L","TP",null,"TP","LP","R_P","R"]
[{"$f":"$A$5","v":"HRC"},null,{"$f":"【進行】結果入力表!D13","v":"中平　美輪"},null,{"$f":"【準備】登録!X11","v":140},null,null,{"$f":"IF(【進行】結果入力表!F20=\"\",\"\",【進行】結果入力表!F20)","v":"w"},null,{"$f":"IF(【進行】結果入力表!F13=\"\",\"\",【進行】結果入力表!F13)","v":"w"},null,{"$f":"IF(J35=\"\",\"\",COUNTIF(F35:K35,\"w\"))","v":2},{"$f":"IF(J35=\"\",\"\",COUNT(H35,J35))","v":0},{"$f":"SUM(F35:K35)+L35*E35","v":280},null,{"$f":"IF(J35=\"\",\"\",N35/E35*180)","v":360},{"$f":"IF(F36=\"w\",180,F36/E35*180)+IF(F37=\"w\",180,F37/E35*180)","v":219.85714285714286},{"$f":"L35*10000000+P35*L10034*10000000+P35*1000-Q35","v":20359780.142857142},{"$f":"IF(J35=\"\",\"\",RANK(R35:R37,R35:R37,0))","v":1},null,{"$f":"$A$5","v":"HRC"},null,{"$f":"【進行】結果入力表!D41","v":"高山　普任"},null,{"$f":"【準備】登録!R11","v":180},null,null,{"$f":"IF(【進行】結果入力表!F41=\"\",\"\",【進行】結果入力表!F41)","v":"w"},null,{"$f":"IF(【進行】結果入力表!F34=\"\",\"\",【進行】結果入力表!F34)","v":"w"},null,{"$f":"IF(AD35=\"\",\"\",COUNTIF(Z35:AE35,\"w\"))","v":2},{"$f":"IF(AD35=\"\",\"\",COUNT(AB35,AD35))","v":0},{"$f":"SUM(Z35:AE35)+AF35*Y35","v":360},null,{"$f":"IF(AD35=\"\",\"\",AH35/Y35*180)","v":360},{"$f":"IF(Z36=\"w\",180,Z36/Y35*180)+IF(Z37=\"w\",180,Z37/Y35*180)","v":100},{"$f":"AF35*10000000+AJ35*AF10034*10000000+AJ35*1000-AK35","v":20359900},{"$f":"IF(AD35=\"\",\"\",RANK(AL35:AL37,AL35:AL37,0))","v":1},null,{"$f":"$A$5","v":"HRC"},null,{"$f":"【進行】結果入力表!D62","v":"菊川　博功"},null,{"$f":"【準備】登録!L11","v":180},null,null,{"$f":"IF(【進行】結果入力表!F62=\"\",\"\",【進行】結果入力表!F62)","v":"w"},null,{"$f":"IF(【進行】結果入力表!F55=\"\",\"\",【進行】結果入力表!F55)","v":"w"},null,{"$f":"IF(AX35=\"\",\"\",COUNTIF(AT35:AY35,\"w\"))","v":2},{"$f":"IF(AX35=\"\",\"\",COUNT(AV35,AX35))","v":0},{"$f":"SUM(AT35:AY35)+AZ35*AS35","v":360},null,{"$f":"IF(AX35=\"\",\"\",BB35/AS35*180)","v":360},{"$f":"IF(AT36=\"w\",180,AT36/AS35*180)+IF(AT37=\"w\",180,AT37/AS35*180)","v":157},{"$f":"AZ35*10000000+BD35*AZ10034*10000000+BD35*1000-BE35","v":20359843},{"$f":"IF(AX35=\"\",\"\",RANK(BF35:BF37,BF35:BF37,0))","v":1}]
[{"$f":"$A$6","v":"NRC"},null,{"$f":"【進行】結果入力表!I20","v":"宮野　早織"},null,{"$f":"【準備】登録!X12","v":140},{"$f":"IF(【進行】結果入力表!G20=\"\",\"\",【進行】結果入力表!G20)","v":92},null,null,null,{"$f":"IF(【進行】結果入力表!F27=\"\",\"\",【進行】結果入力表!F27)","v":77},null,{"$f":"IF(J35=\"\",\"\",COUNTIF(F36:K36,\"w\"))","v":0},{"$f":"IF(J35=\"\",\"\",COUNT(F36,J36))","v":2},{"$f":"SUM(F36:K36)+L36*E36","v":169},null,{"$f":"IF(J35=\"\",\"\",N36/E36*180)","v":217.28571428571428},{"$f":"IF(H35=\"w\",180,H35/E36*180)+IF(H37=\"w\",180,H37/E36*180)","v":360},{"$f":"L36*10000000+P36*L10035*10000000+P36*1000-Q36","v":216925.71428571429},{"$f":"IF(J35=\"\",\"\",RANK(R35:R37,R35:R37,0))","v":3},null,{"$f":"$A$6","v":"NRC"},null,{"$f":"【進行】結果入力表!I41","v":"植田　慎也"},null,{"$f":"【準備】登録!U12","v":180},{"$f":"IF(【進行】結果入力表!G41=\"\",\"\",【進行】結果入力表!G41)","v":86},null,null,null,{"$f":"IF(【進行】結果入力表!F48=\"\",\"\",【進行】結果入力表!F48)","v":123},null,{"$f":"IF(AD35=\"\",\"\",COUNTIF(Z36:AE36,\"w\"))","v":0},{"$f":"IF(AD35=\"\",\"\",COUNT(Z36,AD36))","v":2},{"$f":"SUM(Z36:AE36)+AF36*Y36","v":209},null,{"$f":"IF(AD35=\"\",\"\",AH36/Y36*180)","v":209.00000000000003},{"$f":"IF(AB35=\"w\",180,AB35/Y36*180)+IF(AB37=\"w\",180,AB37/Y36*180)","v":360},{"$f":"AF36*10000000+AJ36*AF10035*10000000+AJ36*1000-AK36","v":208640.00000000003},{"$f":"IF(AD35=\"\",\"\",RANK(AL35:AL37,AL35:AL37,0))","v":3},null,{"$f":"$A$6","v":"NRC"},null,{"$f":"【進行】結果入力表!I62","v":"岩本　剛"},null,{"$f":"【準備】登録!R12","v":180},{"$f":"IF(【進行】結果入力表!G62=\"\",\"\",【進行】結果入力表!G62)","v":82},null,null,null,{"$f":"IF(【進行】結果入力表!F69=\"\",\"\",【進行】結果入力表!F69)","v":124},null,{"$f":"IF(AX35=\"\",\"\",COUNTIF(AT36:AY36,\"w\"))","v":0},{"$f":"IF(AX35=\"\",\"\",COUNT(AT36,AX36))","v":2},{"$f":"SUM(AT36:AY36)+AZ36*AS36","v":206},null,{"$f":"IF(AX35=\"\",\"\",BB36/AS36*180)","v":206},{"$f":"IF(AV35=\"w\",180,AV35/AS36*180)+IF(AV37=\"w\",180,AV37/AS36*180)","v":360},{"$f":"AZ36*10000000+BD36*AZ10035*10000000+BD36*1000-BE36","v":205640},{"$f":"IF(AX35=\"\",\"\",RANK(BF35:BF37,BF35:BF37,0))","v":3}]
[{"$f":"$A$7","v":"ORC"},null,{"$f":"【進行】結果入力表!I13","v":"山崎真紀子"},null,{"$f":"【準備】登録!X13","v":140},{"$f":"IF(【進行】結果入力表!G13=\"\",\"\",【進行】結果入力表!G13)","v":79},null,{"$f":"IF(【進行】結果入力表!G27=\"\",\"\",【進行】結果入力表!G27)","v":"w"},null,null,null,{"$f":"IF(J35=\"\",\"\",COUNTIF(F37:K37,\"w\"))","v":1},{"$f":"IF(J35=\"\",\"\",COUNT(F37,H37))","v":1},{"$f":"SUM(F37:K37)+L37*E37","v":219},null,{"$f":"IF(J35=\"\",\"\",N37/E37*180)","v":281.57142857142856},{"$f":"IF(J35=\"w\",180,J35/E37*180)+IF(J36=\"w\",180,J36/E37*180)","v":279},{"$f":"L37*10000000+P37*L10036*10000000+P37*1000-Q37","v":10281292.428571429},{"$f":"IF(J35=\"\",\"\",RANK(R35:R37,R35:R37,0))","v":2},null,{"$f":"$A$7","v":"ORC"},null,{"$f":"【進行】結果入力表!I34","v":"山崎真紀子"},null,{"$f":"【準備】登録!X13","v":140},{"$f":"IF(【進行】結果入力表!G34=\"\",\"\",【進行】結果入力表!G34)","v":14},null,{"$f":"IF(【進行】結果入力表!G48=\"\",\"\",【進行】結果入力表!G48)","v":"w"},null,null,null,{"$f":"IF(AD35=\"\",\"\",COUNTIF(Z37:AE37,\"w\"))","v":1},{"$f":"IF(AD35=\"\",\"\",COUNT(Z37,AB37))","v":1},{"$f":"SUM(Z37:AE37)+AF37*Y37","v":154},null,{"$f":"IF(AD35=\"\",\"\",AH37/Y37*180)","v":198.00000000000003},{"$f":"IF(AD35=\"w\",180,AD35/Y37*180)+IF(AD36=\"w\",180,AD36/Y37*180)","v":338.14285714285711},{"$f":"AF37*10000000+AJ37*AF10036*10000000+AJ37*1000-AK37","v":10197661.857142856},{"$f":"IF(AD35=\"\",\"\",RANK(AL35:AL37,AL35:AL37,0))","v":2},null,{"$f":"$A$7","v":"ORC"},null,{"$f":"【進行】結果入力表!I55","v":"山崎真紀子"},null,{"$f":"【準備】登録!X13","v":140},{"$f":"IF(【進行】結果入力表!G55=\"\",\"\",【進行】結果入力表!G55)","v":75},null,{"$f":"IF(【進行】結果入力表!G69=\"\",\"\",【進行】結果入力表!G69)","v":"w"},null,null,null,{"$f":"IF(AX35=\"\",\"\",COUNTIF(AT37:AY37,\"w\"))","v":1},{"$f":"IF(AX35=\"\",\"\",COUNT(AT37,AV37))","v":1},{"$f":"SUM(AT37:AY37)+AZ37*AS37","v":215},null,{"$f":"IF(AX35=\"\",\"\",BB37/AS37*180)","v":276.42857142857144},{"$f":"IF(AX35=\"w\",180,AX35/AS37*180)+IF(AX36=\"w\",180,AX36/AS37*180)","v":339.42857142857144},{"$f":"AZ37*10000000+BD37*AZ10036*10000000+BD37*1000-BE37","v":10276089.142857142},{"$f":"IF(AX35=\"\",\"\",RANK(BF35:BF37,BF35:BF37,0))","v":2}]
[]
[]
[]
[]
[]
[null,"※","TPの数字は、ハンデによる換算後の得点を示す。（縮小表示を解除）"]

{"sheet":"【結果】総合結果表","index":5,"n_rows":34,"n_cols":37,"rows_kept":34,"cut":false,"hidden":false,"merged":[[15,1,20,3],[21,1,26,3],[27,1,32,3],[21,4,22,6],[27,4,28,6],[15,4,20,9],[21,7,22,9],[23,4,24,6],[31,4,32,6],[31,7,32,9],[27,7,28,9],[29,4,30,6],[25,19,26,21],[21,10,26,15],[23,19,24,21],[29,13,30,15],[27,10,28,12],[23,16,24,18],[27,16,32,21],[31,10,32,12],[31,13,32,15],[29,10,30,12],[27,13,28,15],[25,16,26,18],[19,10,20,12],[19,13,20,15],[11,4,12,9],[11,10,12,15],[13,4,14,6],[13,7,14,9],[13,10,14,12],[13,13,14,15],[17,13,18,15],[15,10,16,12],[15,13,16,15],[17,10,18,12],[23,30,26,33],[25,4,26,6],[29,7,30,9],[27,22,32,25],[11,22,14,25],[21,22,26,25],[15,19,16,21],[19,16,20,18],[19,19,20,21],[15,22,20,25],[13,16,14,18],[13,19,14,21],[17,16,18,18],[17,19,18,21],[21,16,22,18],[21,19,22,21],[5,32,6,39],[11,16,12,21],[29,30,32,33],[21,26,26,29],[11,30,14,33],[11,36,14,39],[15,26,20,29],[15,36,20,39],[17,30,20,33],[15,30,16,33],[11,26,14,29],[27,26,32,29],[27,36,32,39],[27,30,28,33],[21,36,26,39],[21,30,22,33],[15,16,16,18],[23,7,24,9],[25,7,26,9],[0,1,1,39],[3,36,3,39],[5,1,6,4],[7,1,8,4],[5,24,6,27],[7,24,8,27],[7,5,8,12],[7,13,8,23],[5,13,6,23],[7,28,8,31],[7,32,8,39],[5,5,6,12],[5,28,6,31]]}
[null,{"$f":"【結果】個人成績表!A1","v":"第8回　阪神奈対抗戦　　　(奈良：キングスポット)"}]
[]
[]
[null,null,null,null,null,null,null,null,null,null,null,null,null,null,null,null,null,null,null,null,null,null,null,null,null,null,null,null,null,null,null,null,null,null,null,null,{"$f":"【準備】登録!D4","v":"2015-10-25"}]
[]
[null,"MVP",null,null,null,{"$f":"【結果】個人成績表!CL16 & \"勝　\" & 【結果】個人成績表!CM16 & \"敗\"","v":"6勝　0敗"},null,null,null,null,null,null,null,{"$f":"【結果】個人成績表!CI16 & \" \" & 【結果】個人成績表!CJ16","v":"ORC 山岡　修二"},null,null,null,null,null,null,null,null,null,null,"VP",null,null,null,{"$f":"【結果】個人成績表!CL17 & \"勝　\" & 【結果】個人成績表!CM17 & \"敗\"","v":"5勝　1敗"},null,null,null,{"$f":"【結果】個人成績表!CI17 & \" \" & 【結果】個人成績表!CJ17","v":"HRC 高山　普任"}]
[]
[null,"HR",null,null,null,{"$f":"IF(【結果】個人成績表!CN21=\"\",\"\",【結果】個人成績表!CN21 & \"点 \")","v":"125点 "},null,null,null,null,null,null,null,{"$f":"IF(【結果】個人成績表!CN21=\"\",\"\",【結果】個人成績表!CI21 & \" \" & 【結果】個人成績表!CJ21)","v":"HRC 堂園　雅也"},null,null,null,null,null,null,null,null,null,null,"VP",null,null,null,{"$f":"【結果】個人成績表!CL18 & \"勝　\" & 【結果】個人成績表!CM18 & \"敗\"","v":"4勝　2敗"},null,null,null,{"$f":"【結果】個人成績表!CI18 & \" \" & 【結果】個人成績表!CJ18","v":"NRC 吉向　翔平"}]
[]
[]
[]
[null,null,null,null,{"$f":"B16","v":"HRC"},null,null,null,null,null,{"$f":"B22","v":"NRC"},null,null,null,null,null,{"$f":"B28","v":"ORC"},null,null,null,null,null,"W",null,null,null,"L",null,null,null,"TP",null,null,null,null,null,"RK"]
[null,null,null,null,null,null,null,null,null,null,null,null,null,null,null,null,null,null,null,null,null,null,null,null,null,null,null,null,null,null,null,null,null,null,"(TP)","TP"]
[null,null,null,null,"W",null,null,"L",null,null,"W",null,null,"L",null,null,"W",null,null,"L"]
[]
[null,{"$f":"IF(【準備】登録!B11=\"\",\"\",【準備】登録!B11)","v":"HRC"},null,null,null,null,null,null,null,null,{"$f":"IF(【結果】個人成績表!R14=\"\",\"\",【結果】個人成績表!R14-Q16)","v":5},null,null,{"$f":"IF(【結果】個人成績表!S14=\"\",\"\",【結果】個人成績表!S14-T16)","v":2},null,null,{"$f":"【結果】個人成績表!H14","v":5},null,null,{"$f":"【結果】個人成績表!I14","v":2},null,null,{"$f":"IF(Q16=\"\",\"\",SUM(Q16:S21,K16:M21))","v":23},null,null,null,{"$f":"IF(T16=\"\",\"\",SUM(T16:V21,N16:P21))","v":19},null,null,null,{"$f":"IF(【結果】個人成績表!BH14=\"\",\"\",\"(\"&【結果】個人成績表!BH14&\")\")","v":"(5551)"},null,null,null,{"$f":"【結果】個人成績表!BH14","v":5551},{"$f":"【結果】個人成績表!CE14","v":5690.4285714285716},{"$f":"IF(AE18=\"\",\"\",RANK(W$16:W$33,W$16:W$33,0))","v":2}]
[]
[null,null,null,null,null,null,null,null,null,null,{"$f":"IF(【結果】個人成績表!AL14=\"\",\"\",【結果】個人成績表!AL14-【結果】個人成績表!AB14)","v":4},null,null,{"$f":"IF(【結果】個人成績表!AM14=\"\",\"\",【結果】個人成績表!AM14-【結果】個人成績表!AC14)","v":3},null,null,{"$f":"IF(【結果】個人成績表!AB14=\"\",\"\",【結果】個人成績表!AB14-【結果】個人成績表!R14)","v":1},null,null,{"$f":"IF(【結果】個人成績表!AC14=\"\",\"\",【結果】個人成績表!AC14-【結果】個人成績表!S14)","v":6},null,null,null,null,null,null,null,null,null,null,{"$f":"IF(ISERROR(【結果】個人成績表!CE14),\"\",【結果】個人成績表!CE14)","v":5690.4285714285716}]
[]
[null,null,null,null,null,null,null,null,null,null,{"$f":"IF(【結果】個人成績表!BF14=\"\",\"\",【結果】個人成績表!BF14-【結果】個人成績表!AV14)","v":5},null,null,{"$f":"IF(【結果】個人成績表!BG14=\"\",\"\",【結果】個人成績表!BG14-【結果】個人成績表!AW14)","v":2},null,null,{"$f":"IF(【結果】個人成績表!AV14=\"\",\"\",【結果】個人成績表!AV14-【結果】個人成績表!AL14)","v":3},null,null,{"$f":"IF(【結果】個人成績表!AW14=\"\",\"\",【結果】個人成績表!AW14-【結果】個人成績表!AM14)","v":4}]
[]
[null,{"$f":"IF(【準備】登録!B12=\"\",\"\",【準備】登録!B12)","v":"NRC"},null,null,{"$f":"N16","v":2},null,null,{"$f":"K16","v":5},null,null,null,null,null,null,null,null,{"$f":"IF(【結果】個人成績表!R24=\"\",\"\",【結果】個人成績表!R24-【結果】個人成績表!H24)","v":3},null,null,{"$f":"IF(【結果】個人成績表!S24=\"\",\"\",【結果】個人成績表!S24-【結果】個人成績表!I24)","v":4},null,null,{"$f":"IF(E22=\"\",\"\",SUM(E22:G27,Q22:S27))","v":14},null,null,null,{"$f":"IF(H22=\"\",\"\",SUM(H22:J27,T22:V27))","v":28},null,null,null,{"$f":"IF(【結果】個人成績表!BH24=\"\",\"\",\"(\"&【結果】個人成績表!BH24&\")\")","v":"(4860)"},null,null,null,{"$f":"【結果】個人成績表!BH24","v":4860},{"$f":"【結果】個人成績表!CE24","v":4988.2857142857138},{"$f":"IF(AE24=\"\",\"\",RANK(W$16:W$33,W$16:W$33,0))","v":3}]
[]
[null,null,null,null,{"$f":"N18","v":3},null,null,{"$f":"K18","v":4},null,null,null,null,null,null,null,null,{"$f":"IF(【結果】個人成績表!AL24=\"\",\"\",【結果】個人成績表!AL24-【結果】個人成績表!AB24)","v":1},null,null,{"$f":"IF(【結果】個人成績表!AM24=\"\",\"\",【結果】個人成績表!AM24-【結果】個人成績表!AC24)","v":6},null,null,null,null,null,null,null,null,null,null,{"$f":"IF(ISERROR(【結果】個人成績表!CE24),\"\",【結果】個人成績表!CE24)","v":4988.2857142857138}]
[]
[null,null,null,null,{"$f":"N20","v":2},null,null,{"$f":"K20","v":5},null,null,null,null,null,null,null,null,{"$f":"IF(【結果】個人成績表!BF24=\"\",\"\",【結果】個人成績表!BF24-【結果】個人成績表!AV24)","v":3},null,null,{"$f":"IF(【結果】個人成績表!BG24=\"\",\"\",【結果】個人成績表!BG24-【結果】個人成績表!AW24)","v":4}]
[]
[null,{"$f":"IF(【準備】登録!B13=\"\",\"\",【準備】登録!B13)","v":"ORC"},null,null,{"$f":"【結果】個人成績表!H34","v":2},null,null,{"$f":"【結果】個人成績表!I34","v":5},null,null,{"$f":"T22","v":4},null,null,{"$f":"Q22","v":3},null,null,null,null,null,null,null,null,{"$f":"IF(E28=\"\",\"\",SUM(E28:G33,K28:M33))","v":26},null,null,null,{"$f":"IF(H28=\"\",\"\",SUM(H28:J33,N28:P33))","v":16},null,null,null,{"$f":"IF(【結果】個人成績表!BH34=\"\",\"\",\"(\"&【結果】個人成績表!BH34&\")\")","v":"(6394)"},null,null,null,{"$f":"【結果】個人成績表!BH34","v":6394},{"$f":"【結果】個人成績表!CE34","v":6562},{"$f":"IF(AE30=\"\",\"\",RANK(W$16:W$33,W$16:W$33,0))","v":1}]
[]
[null,null,null,null,{"$f":"T18","v":6},null,null,{"$f":"Q18","v":1},null,null,{"$f":"T24","v":6},null,null,{"$f":"Q24","v":1},null,null,null,null,null,null,null,null,null,null,null,null,null,null,null,null,{"$f":"IF(ISERROR(【結果】個人成績表!CE34),\"\",【結果】個人成績表!CE34)","v":6562}]
[]
[null,null,null,null,{"$f":"T20","v":4},null,null,{"$f":"Q20","v":3},null,null,{"$f":"T26","v":4},null,null,{"$f":"Q26","v":3}]
[]
[null,null,null,"※","TPの上段（　　）内の数字は、ハンデによる換算をしていない得点を示す。 ※MVP,VP,HR自動表示対応"]